Tous les collages #22807 Brut Modifier

Something

public text v1 · immuable
#22807 ·publié 2005-09-13 13:26 UTC
corps du collage affiché
g++-3.4 -o nsNegotiateAuthFactory.o -c  -DXPCOM_TRANSLATE_NSGM_ENTRY_POINT=1 -DMOZILLA_INTERNAL_API -DOSTYPE=\"Linux2.6\" -DOSARCH=\"Linux\" -DBUILD_ID=2005091309  -I../../dist/include/xpcom -I../../dist/include/string -I../../dist/include/necko -I../../dist/include/pref -I../../dist/include/negotiateauth -I../../dist/include -I../../dist/include/nspr -I/usr/include -I/usr/include  -I/usr/X11R6/include     -I/usr/X11R6/include -fno-rtti -fno-exceptions -Wall -Wconversion -Wpointer-arith -Wcast-align -Woverloaded-virtual -Wsynth -Wno-ctor-dtor-privacy -Wno-non-virtual-dtor -Wno-long-long -fshort-wchar -pthread -pipe  -DNDEBUG -DTRIMMED -pipe -w -O2 -DDEBIAN  -I/usr/X11R6/include -DMOZILLA_CLIENT -include ../../mozilla-config.h -Wp,-MD,.deps/nsNegotiateAuthFactory.pp nsNegotiateAuthFactory.cpp
nsNegotiateAuthFactory.cpp:94:2: #error "missing implementation"
nsNegotiateAuthFactory.cpp: In function `nsresult nsNegotiateAuthConstructor(nsISupports*, const nsIID&, void**)':
nsNegotiateAuthFactory.cpp:97: error: `nsNegotiateAuth' undeclared (first use this function)
nsNegotiateAuthFactory.cpp:97: error: (Each undeclared identifier is reported only once for each function it appears in.)
nsNegotiateAuthFactory.cpp:97: error: `inst' undeclared (first use this function)
nsNegotiateAuthFactory.cpp:97: error: `nsNegotiateAuth' has not been declared
nsNegotiateAuthFactory.cpp: At global scope:
nsNegotiateAuthFactory.cpp:105: error: `NS_AUTH_MODULE_CONTRACTID_PREFIX' was not declared in this scope
nsNegotiateAuthFactory.cpp:105: error: expected `}' before string constant
nsNegotiateAuthFactory.cpp:105: error: expected `}' before string constant
nsNegotiateAuthFactory.cpp:105: error: expected `,' or `;' before string constant
nsNegotiateAuthFactory.cpp:107: error: expected declaration before '}' token
make[1]: *** [nsNegotiateAuthFactory.o] Error 1
make[1]: Leaving directory `/opt/dl/mozilla/extensions/negotiateauth'
make: *** [all] Error 2