Archive›2006›October

October 2006

13699 pastes
  • Someone

    197640·text·385 B·2006-10-11 12:52 UTC
    Unable to make a vmmon module that can be loaded in the running kernel:
    insmod: error inserting '/tmp/vmware-config2/vmmon.o': -1 Invalid module format
    There is probably a slight difference in the k
  • Mine

    197637·apache·5.5 KB·2006-10-11 12:50 UTC
    [Sun Oct 08 22:57:30 2006] [warn] Init: Session Cache is not configured [hint: SSLSessionCache]
    PHP Warning: Method panda::__set() must take exactly 2 arguments in Unknown on line 0
    [Sun Oct 08 23:
  • Sans titre

    197636·text·1.6 KB·2006-10-11 12:46 UTC
    body {
     font: 11px verdana, sans-serif;
     background: #AFA99B url("fond.jpg") top left no-repeat;
     margin: 0;
     padding: 0;
    }
    
    /* -----------------------------------------------------------------
  • wilhart

    197610·text·479 B·2006-10-11 12:31 UTC
    Gnomen asetusdemonin käynnistys epäonnistui.
    
    Jotkin ominaisuudet, kuten teemat, äänet tai taustan asetukset eivät välttämättä toimi kunnolla.
    
    Asetusdemoni on käynnistynyt liian monta kertaa uude
  • Quelqu'un

    197599·text·832 B·2006-10-11 12:24 UTC
    Knoppix / # emerge wireless-tools
    Calculating dependencies... done!
    >>> Emerging (1 of 1) net-wireless/wireless-tools-28 to /
    >>> checking ebuild checksums ;-)
    >>> checking auxfile checksums ;-)
  • isAAAAAAc

    197594·text·9.6 KB·2006-10-11 12:20 UTC
    >>> Compiling source in /var/tmp/portage/spca5xx-20060501/work/spca5xx-20060501 ...
     * Preparing spca5xx module
     Building SPCA5XX driver for 2.5/2.6 kernel.
     Remember: you must have read/write
  • isAAAc

    197590·text·2.4 KB·2006-10-11 12:15 UTC
    /var/tmp/portage/spca5xx-20060501/work/spca5xx-20060501/drivers/usb/spca5xx.c:5507: error: invalid application of 'sizeof' to incomplete type 'struct video_device' 
    /var/tmp/portage/spca5xx-20060501/
  • Someone

    197581·text·1.4 KB·2006-10-11 12:09 UTC
    cat /proc/cpuinfo 
    processor : 0
    vendor_id : GenuineIntel
    cpu family : 15
    model : 4
    model name : Intel(R) Pentium(R) 4 CPU 3.40GHz
    stepping : 3
    cpu MHz
  • Mine

    197574·text·4.9 KB·2006-10-11 12:03 UTC
    8765/8765 (Unspecified) (D) 255.255.255.255 0 Unmonitored
    610/610 (Unspecified) (D) 255.255.255.255 0 Unmonitored
    5555/5555 (Unspecified) (D)
  • ViceVirtue

    197573·text·2.7 KB·2006-10-11 12:02 UTC
    rbn rbn # ldd /usr/bin/fbpanel
     linux-gate.so.1 => (0xffffe000)
     libgtk-x11-2.0.so.0 => /usr/lib/libgtk-x11-2.0.so.0 (0xb7bc8000)
     libgdk-x11-2.0.so.0 => /usr/lib/libgdk-x11-2
  • isAAAc spca5

    197570·text·1.1 KB·2006-10-11 11:59 UTC
    /var/tmp/portage/spca5xx-20060301/work/spca5xx-20060301/drivers/usb/spca5xx.c:8316: error: dereferencing pointer to incomplete type
    /var/tmp/portage/spca5xx-20060301/work/spca5xx-20060301/drivers/usb
  • Something

    197568·text·1.7 KB·2006-10-11 11:56 UTC
    gandalf:~# vserver stdserver start
    umount: /vservers/ftpserv/home: not found
    umount: /vservers/ftpserv/home: not found
    umount: /vservers/ftpserv/home/ftp/upload: not found
    umount: /vservers/ftpser
  • strace

    197567·text·2.9 KB·2006-10-11 11:55 UTC
    open("/etc/networks", O_RDONLY) = -1 ENOENT (No such file or directory)
    open("/etc/networks", O_RDONLY) = -1 ENOENT (No such file or directory)
    open("/etc/hosts", O_RDONLY)
  • isAAAc qc-usb

    197566·text·1.8 KB·2006-10-11 11:55 UTC
    /var/tmp/portage/qc-usb-0.6.3/work/qc-usb-0.6.3/qc-driver.c: In function 'qc_usb_init':
    /var/tmp/portage/qc-usb-0.6.3/work/qc-usb-0.6.3/qc-driver.c:3141: error: invalid application of 'sizeof' to inc
  • Stuff

    197565·text·472 B·2006-10-11 11:54 UTC
    gandalf:~# vserver stdserver start
    umount: /vservers/ftpserv/home: not found
    umount: /vservers/ftpserv/home: not found
    umount: /vservers/ftpserv/home/ftp/upload: not found
    umount: /vservers/ftpser
  • Miscellany

    197564·text·1.4 KB·2006-10-11 11:54 UTC
    # $Id: fai.conf 3770 2006-08-07 12:08:51Z lange $
    
    # /etc/fai/fai.conf -- configuration for FAI (Fully Automatic Installation)
    #installserver=fai
    #mirrorhost=fai
    # Access to Debian mirror via NFS
  • emergo

    197563·text·362 B·2006-10-11 11:53 UTC
    file vmware-ping ; ldd vmware-ping
    vmware-ping: setuid ELF 32-bit LSB executable, Intel 80386, version 1 (SYSV), for GNU/Linux 2.0.0, dynamically linked (uses shared libs), for GNU/Linux 2.0.0, stri
  • isAAAc cam

    197561·text·15.6 KB·2006-10-11 11:53 UTC
    Bus 002 Device 002: ID 046d:08ad Logitech, Inc. 
    Device Descriptor:
     bLength 18
     bDescriptorType 1
     bcdUSB 1.10
     bDeviceClass 0 (Defined at Int
  • Anonymous

    197559·text·675 B·2006-10-11 11:52 UTC
    fai:/srv/fai/config# cat /etc/dhcp3/dhcpd.conf
    # dhcpd.conf for fai
    # replace faiserver with the name of your install server
    
    deny unknown-clients;
    option dhcp-max-message-size 2048;
    use-host-de
  • Something

    197557·text·1.5 KB·2006-10-11 11:51 UTC
    Oct 11 20:05:41 localhost in.tftpd[29919]: RRQ from 10.1.1.52 filename fai/pxelinux.0
    Oct 11 20:05:41 localhost in.tftpd[29919]: tftp: client does not accept options
    Oct 11 20:05:41 localhost in.tft
  • Stuff

    197544·text·1.5 KB·2006-10-11 11:45 UTC
    f-spot-import /home/sde/Desktop/ch950924.gif
    7316: arguments to dbus_message_new_method_call() were incorrect, assertion "_dbus_check_is_valid_path (path)" failed in file dbus-message.c line 797.
    Th
  • Someone

    197536·text·5.5 KB·2006-10-11 11:28 UTC
    alp@rover:~$ f-spot
    
    =================================================================
    Got a SIGSEGV while executing native code. This usually indicates
    a fatal error in the mono runtime or one of
  • Untitled

    197528·text·914 B·2006-10-11 11:22 UTC
    html {
    background-color:#ffffff;
    }
    
    body{
     text-align: justify;
     margin: 0;
     background: #fffff;
    }
    
    h1{
     font: 18pt georgia, sans-serif;
     color: ##666666;
     margin: 0px;
     text-align: cent
  • Someone

    197526·apache·433 B·2006-10-11 11:18 UTC
    <Directory /home/myjoomlasite/public_html>
     Options Indexes FollowSymLinks MultiViews
     AllowOverride None
     Order allow,deny
     allow from all
    
     # Rew
  • Untitled

    197515·text·229 B·2006-10-11 11:00 UTC
    int my_strncmp(char *s1, char *s2, int n)
    {
     int y;
    
     y = 0;
     while (y < n - 1)
     {
     if (s1[y] == s2[y])
     y++;
     else
     return (s1[y] - s2[y]);
     }
  • Anonymous

    197514·text·608 B·2006-10-11 11:00 UTC
    int my_strlen(char *src)
    {
     int i;
    
     i = 0;
     while (src[i] != '\0')
     {
     i++;
     }
     return (i);
    }
    
    char *my_strstr(char *str, char *to_find)
    {
     int n;
     int m;
  • Stuff

    197513·text·610 B·2006-10-11 10:56 UTC
    int my_strlen(char *src)
    {
     int i;
    
     i = 0;
     while (src[i] != '\0')
     {
     i++;
     }
     return (i);
    }
    
    char *my_strstr(char *str, char *to_find)
    {
     int n;
     int m;
  • Mine

    197510·text·2.2 KB·2006-10-11 10:52 UTC
    rmccurdy# tcpdump -n | grep 226
    tcpdump: verbose output suppressed, use -v or -vv for full protocol decode
    listening on ed0, link-type EN10MB (Ethernet), capture size 96 bytes
    
    06:49:11.046026 I
  • Something

    197506·text·508 B·2006-10-11 10:47 UTC
    jim@panicroom:~/libfastjar/trunk$ gcc -c -o obj/pushback.o -I include/ src/pushback.c -Wall -Werror -O2 -std=c99
    jim@panicroom:~/libfastjar/trunk$ gcc -c -o obj/pbtest.o -I include/ pbtest.c -Wall -W
  • Mine

    197503·text·1.6 KB·2006-10-11 10:45 UTC
    ====== making target build [new prereqs: stamp-build]======
    make[2]: Leaving directory `/root/build/linux-2.6-2.6.17/debian/build/build-amd64-none-amd64'
    python2.4 debian/bin/abicheck.py debian/buil
  • Mine

    197502·php·282 B·2006-10-11 10:44 UTC
    if(isset($_POST['submit'])) {
     if (isset($_SESSION['last_post_time']) && time()-$_SESSION['last_post_time'] > $flood_time) {
     echo "You flooded! MY GOD MAN HOW COULD YOU?!?";
     } else {
     ec
  • Someone

    197500·text·435 B·2006-10-11 10:44 UTC
    touch: setting times of `/var/tmp/portage/gentoo-sources-2.6.17-r8/.unpacked': Function not implemented
    
    !!! ERROR: sys-kernel/gentoo-sources-2.6.17-r8 failed.
    Call stack:
     ebuild.sh, line 1539:
  • Unnamed

    197499·text·201 B·2006-10-11 10:44 UTC
    jim@panicroom:~/libfastjar/trunk$ ls
    doc include obj original pbtest pbtest.c src test.txt TlistSession
    jim@panicroom:~/libfastjar/trunk$ ./pbtest
    bash: ./pbtest: No such file or directory
  • Untitled

    197493·text·386 B·2006-10-11 10:38 UTC
    ../libs/qanava/build/libqanava_can.a(canGraphItemView.o): In function `Layout':
    ../../../src/can/./../la/laLayout.h:62: undefined reference to `vtable for qan::la::Layout'
    ../libs/qanava/build/libqa
  • Miscellany

    197492·cpp·9.4 KB·2006-10-11 10:36 UTC
    /*
    Qanava - Graph drawing library for QT
    Copyright (C) 2006 Benoit AUTHEMAN
    
    This library is free software; you can redistribute it and/or
    modify it under the terms of the GNU Lesser General Publ
  • Thinuviel

    197488·text·1.5 KB·2006-10-11 10:32 UTC
    [quote][size=1]Miranda IM - VersionInformation plugin by Hrk, modified by Eblis
    Report generated at: 12:30:25 on 11 October 2006
    
    CPU: Intel(R) Pentium(R) 4 CPU 2.93GHz [x86 Family 15
  • Anonymous

    197486·text·9.4 KB·2006-10-11 10:30 UTC
    /*
    Qanava - Graph drawing library for QT
    Copyright (C) 2006 Benoit AUTHEMAN
    
    This library is free software; you can redistribute it and/or
    modify it under the terms of the GNU Lesser General Publ
  • Something

    197485·text·1.4 KB·2006-10-11 10:25 UTC
    Return-Path: <cyrus@iua-mail>
    Received: from iua-mail ([unix socket])
     by iua-mail (Cyrus v2.1.15-IPv6-Debian-2.1.15-0woody.1.0) with LMTP; Wed, 11 Oct 2006 11:16:18 +0200
    X-Sieve: CMU Sieve 2.2
    R
  • Unnamed

    197484·text·23.7 KB·2006-10-11 10:25 UTC
    <html>
    <img src="data:image/jpg;base64,/9j/4AAQSkZJRgABAQEAAAAAAAD/2wBDAAMCAgMCAgMDAwMEAwMEBQgFBQQEBQoHBwYIDAoMDAsKCwsNDhIQDQ4RDgsLEBYQERMUFRUVDA8XGBYUGBIUFRT/2wBDAQMEBAUEBQkFBQkUDQsNFBQUFBQUFBQUFBQU
  • Miscellany

    197482·text·356 B·2006-10-11 10:22 UTC
    <item type="layoutcolumn" name="col" ... >
     <item type="layoutrow" flexibleItem="row_ok_cancel" width="300" height="50" name="oFlexRow3" colour="firgreen">
     <item type="button" name="row_ok_cance
  • Mine

    197471·c·177 B·2006-10-11 10:08 UTC
    #include <math.h>
    #include <stdio.h>
    void mmxfunc(void) { asm("emms"); }
    int main(void){
     float f = log(10.0);
     mmxfunc();
     printf("%f\n", f);
     return 0;
    }
  • dexen

    197458·bash·262 B·2006-10-11 09:48 UTC
    #!/bin/bash
    
    # by dexen Sun 13 Aug 2006 02:42:58 AM CEST
    
    i=1
    #i=190
    #limit=--limit-rate=12k
    while [ $i -le 892 ]; do
     ii=`printf '%04d' $i`
     i=$(( $i + 1 ))
     echo $ii
     wget -
  • dexen

    197456·text·264 B·2006-10-11 09:48 UTC
    #!/bin/bash
    
    # by dexen Sun 13 Aug 2006 02:42:58 AM CEST
    
    i=1
    #i=190
    #limit=--limit-rate=12k
    while [ $i -le 892 ]; do
     ii=`printf '%04d' $i`
     i=$(( $i + 1 ))
     echo $ii
     wget -
  • Hit3k

    197442·text·469 B·2006-10-11 09:26 UTC
    collect2: ld returned 1 exit status
    make[4]: *** [gtk-demo] Error 1
    make[4]: Leaving directory `/home/allan/gtk+-2.4.9/demos/gtk-demo'
    make[3]: *** [install] Error 2
    make[3]: Leaving directory `/h
  • Mine

    197440·text·407 B·2006-10-11 09:23 UTC
    rune@toshiba:~/apps/mplayer$ make
    make -C libavformat LIBPREF=lib LIBSUF=.a
    make[1]: Entering directory `/home/rune/apps/mplayer/libavformat'
    cc -I../libavcodec -c -o utils.o utils.c
    In file incl
  • Miscellany

    197437·text·5.5 KB·2006-10-11 09:18 UTC
    GNU gdb 6.5
    Copyright (C) 2006 Free Software Foundation, Inc.
    GDB is free software, covered by the GNU General Public License, and you are
    welcome to change it and/or distribute copies of it under
  • Unnamed

    197434·text·252 B·2006-10-11 09:13 UTC
    @echo off
    
    for /f %%a in ('dir /b "C:\Documents and Settings\Owner\Desktop\p\*.sxw"') do call :DOIT %%~fa
    goto :eof
    
    :DOIT
    "C:\Program Files\OpenOffice.org 2.0\program\soffice" -invisible macro:
  • Untitled

    197430·text·400 B·2006-10-11 09:00 UTC
    # Which listing to boot as default.
    default 0
    # How many seconds before default listing os loaded
    timeout 30
    
    title=Gentoo Linux 2.6.17-r8
    root(hd0,1)
    kernel /kernel-2.6.17-gentoo-r8 root=/dev/
  • Something

    197427·text·222 B·2006-10-11 08:57 UTC
    @echo off
    
    for /f %%a in ('dir /b c:\somedir\*.sxw') do call :DOIT %%~fa
    goto :eof
    
    :DOIT
    "C:\Program Files\OpenOffice.org 2.0\program\soffice" -invisible macro:///Standard.Module1.SaveAsPDF("%*
  • Something

    197425·text·220 B·2006-10-11 08:56 UTC
    @echo off
    
    for /f %%a in ('dir /b c:\somedir\*.sxw') do call :DOIT %%a
    goto :eof
    
    :DOIT
    "C:\Program Files\OpenOffice.org 2.0\program\soffice" -invisible macro:///Standard.Module1.SaveAsPDF(%~f1)
  • Anonymous

    197414·text·32.3 KB·2006-10-11 08:49 UTC
    
        
  • Divers

    197412·mirc·7.2 KB·2006-10-11 08:48 UTC
    #Dekadent Counter v1.0 by CoolMaster for eggdrop
    #
    ######## INFO(it's important to read this and configuration) ########
    #This Dekadent TCL Script is a simple join/kick counter for eggdrop channels
  • Miscellany

    197409·text·2.0 KB·2006-10-11 08:46 UTC
    Output folder: C:\DOCUME~1\THE~1.GOL\LOCALS~1\Temp\nsx1255.tmp
    Extract: test.txt
    Rename: C:\DOCUME~1\THE~1.GOL\LOCALS~1\Temp\nsx1255.tmp\test.txt->C:\DOCUME~1\THE~1.GOL\LOCALS~1\Temp\nsx1255.tmp\tes
  • Anonymous

    197406·text·8.7 KB·2006-10-11 08:45 UTC
    import impsoft.ibot.methods.Script;
    
    import java.awt.event.MouseListener;
    import java.lang.reflect.Field;
    import java.lang.reflect.Method;
    import java.lang.reflect.Modifier;
    import java.net.URL;
  • HowardTheCoward

    197405·sql·16.9 KB·2006-10-11 08:44 UTC
    INSERT INTO obj_ArchivePage (_id, html, number) VALUES ('681cfbd05b35125d1f64d9eef5b7e994-62a551987cc92f8bcddd3507ba6e5736', '<!DOCTYPE html PUBLIC "-//W3C//DTD XHTML 1.0 Transitional//EN" "http://www
  • Unnamed

    197401·text·227 B·2006-10-11 08:39 UTC
    while ( (!isDOM) ? node : (typeof node.tagName != "undefined") )
     {
     if (node.tagName != "TR")
     {
     xPos += node.offsetLeft;
     yPos += node.offsetTop;
     }
     node = (!isDOM) ? node.parentEl
  • Anonymous

    197399·text·435 B·2006-10-11 08:39 UTC
    touch: setting times of `/var/tmp/portage/gentoo-sources-2.6.17-r8/.unpacked': Function not implemented
    
    !!! ERROR: sys-kernel/gentoo-sources-2.6.17-r8 failed.
    Call stack:
     ebuild.sh, line 1539:
  • user00265

    197396·bash·374 B·2006-10-11 08:34 UTC
    #!/bin/bash
    export GDK_USE_XFT=1
    
    for errfile in "$HOME/.fvwm2-errors" "${TMPDIR-/tmp}/fvwm2-$USER" "/tmp/fvwmrc-$USER"
    do
     if ( cp /dev/null "$errfile" 2> /dev/null )
     then
  • Unnamed

    197392·text·218 B·2006-10-11 08:30 UTC
    @echo off
    
    for /f %%a in ('dir /b c:\somedir\*.sxw') do call :DOIT %%a
    goto :eof
    
    :DOIT
    "C:\Program Files\OpenOffice.org 2.0\program\soffice" -invisible macro:///Standard.Module1.SaveAsPDF(%1)
  • Miscellany

    197385·html·21.7 KB·2006-10-11 08:16 UTC
    <!DOCTYPE HTML PUBLIC "-//W3C//DTD HTML 4.0 Transitional//EN">
    <html lang="en-US" dir="LTR">
     <head>
     <title>IHT: Classifieds</title>
     <meta http-equiv="Conten
  • Mine

    197381·text·1.2 KB·2006-10-11 08:08 UTC
    Your init file should contain only one such instance.
     '(case-fold-search t)
     '(column-number-mode t)
     '(current-language-environment "UTF-8")
     '(default-input-method "rfc1345")
     '(delete-selecti
  • Untitled

    197375·text·2.4 KB·2006-10-11 07:58 UTC
    Configuring search environment for revdep-rebuild
    
    Checking reverse dependencies...
    
    Packages containing binaries and libraries broken by a package update
    will be emerged.
    
    Collecting system bi
  • Anonymous

    197373·text·2.3 KB·2006-10-11 07:58 UTC
    [quote][size=1]CPU: AMD Sempron(tm) 2200+ [x86 Family 6 Model 8 Stepping 1]
    Operating System: Microsoft Windows XP [version: 5.1.2600 Service Pack 2]
    Installed RAM: 1024 MBytes
    Free disk space on
  • Stuff

    197369·text·23.2 KB·2006-10-11 07:55 UTC
    [4294667.296000] Linux version 2.6.15-23-386 (buildd@rothera) (gcc version 4.0.3 (Ubuntu 4.0.3-1ubuntu5)) #1 PREEMPT Tue May 23 13:49:40 UTC 2006
    [4294667.296000] BIOS-provided physical RAM map:
    [42
  • Miscellany

    197367·text·186 B·2006-10-11 07:54 UTC
    Oct 10 10:15:02 m24s27 pam_limits[7763]: setrlimit limit #6 to soft=-1, hard=-1 failed: Operation not permitted; uid=0 euid=0
    
    ^\w{3} [ :0-9]{11} [._[:alnum:]-]+ pam_limits\[[0-9]+\]:*
  • Falgor

    197364·text·219 B·2006-10-11 07:51 UTC
    ____________ 
     O / /|| o / || __O
    <|| .. /. || X / || .. . . . . .. |\ . . . . . . . .. . . . . . .. 
     / \
  • Unnamed

    197357·text·54.0 KB·2006-10-11 07:40 UTC
    
        
  • Unnamed

    197356·text·752 B·2006-10-11 07:39 UTC
    make -C /lib/modules/2.6.15-23-386/build M=/usr/src/ivtv-0.4.1/driver modules
    make[1]: Entering directory `/usr/src/linux-headers-2.6.15-23-386'
     Building modules, stage 2.
     MODPOST
    make[1]: Lea
  • Stuff

    197353·text·3.3 KB·2006-10-11 07:33 UTC
    $ sudo modprobe snd-pcm-oss
    FATAL: Error inserting snd_pcm (/lib/modules/2.6.15-27-k7/kernel/sound/acore/snd-pcm.ko): Unknown symbol in module, or unknown parameter (see dmesg)
    WARNING: Error runnin
  • Something

    197352·php·1.4 KB·2006-10-11 07:32 UTC
    <table width="800" border="0" align="center">
     <tr>
     <th scope="col">Product Name</th>
     <th scope="col">Image</th>
     <th scope="col">Media type</th>
     <th scope="col">Genre</th>
  • Stuff

    197351·text·393 B·2006-10-11 07:31 UTC
    $ sudo modprobe snd-pcm-oss
    FATAL: Error inserting snd_pcm (/lib/modules/2.6.15-27-k7/kernel/sound/acore/snd-pcm.ko): Unknown symbol in module, or unknown parameter (see dmesg)
    WARNING: Error runnin
  • Mine

    197349·text·1.6 KB·2006-10-11 07:30 UTC
    # time pkg_add -rv wget
    looking up ftp.freebsd.org
    connecting to ftp.freebsd.org:21
    setting passive mode
    opening data connection
    initiating transfer
    Fetching ftp://ftp.freebsd.org/pub/FreeBSD/po
  • Miscellany

    197347·text·70.0 KB·2006-10-11 07:28 UTC
    
        
  • cp

    197340·c·900 B·2006-10-11 07:20 UTC
    #include <stdio.h>
    #include <stdlib.h>
    
    #define limit_radku 100
    
    int ctiradek(char radek[], int);
    void kopiruj(char radek[], char nejdeslsi[]);
    
    int main()
    {
     char radek[limit_radku];
  • Unnamed

    197339·text·23.8 KB·2006-10-11 07:19 UTC
    cat /proc/22446/maps 
    08048000-08074000 r-xp 00000000 03:05 1081451 /usr/bin/xmms2d
    08074000-08075000 rw-p 0002c000 03:05 1081451 /usr/bin/xmms2d
    08075000-08fcf000 rw-p 08075000 00:00 0
  • Mine

    197338·text·194 B·2006-10-11 07:18 UTC
    HashKnownhosts no
    Host syriana.goyman.com
    User asyd
    Host kaoru.asyd.net
    Port 2222
    Host ejbca
    User bruno
    Host coruscant
    User pki
    Host pkilng.vservers.linagora.com
    Port 2722
    User root
  • Something

    197337·text·16 B·2006-10-11 07:18 UTC
    helllo.. testing
  • PeCet

    197334·c·743 B·2006-10-11 07:16 UTC
    // gcc funkcja_kwadratowa.c -lm -o funkcja
    
    #include <stdlib.h>
    #include <stdio.h>
    #include <math.h>
    
    int main()
    {
    float a, b, c;
    float delta;
    
     printf("Wpisz\n");
     printf(" a = ")
  • Miscellany

    197333·text·550 B·2006-10-11 07:13 UTC
    ./op.h:3595: error: expected identifier or '(' before '.' token
    ./op.h:3597: error: expected expression before '.' token
    make[1]: *** [translate-op.o] Error 1
    make[1]: *** Waiting for unfinished jo
  • TigerWolf

    197332·text·1.3 KB·2006-10-11 07:12 UTC
    #!/bin/sh
    
    if test -f /etc/oss.conf
    then
     . /etc/oss.conf
    else
     echo "Error: /etc/oss.conf not found - don't know where OSS is installed!"
     exit -1
    fi
    
    $OSSLIBDIR/bin/soundoff
    
    rm -f /u
  • Untitled

    197323·text·359 B·2006-10-11 06:54 UTC
    Reading package lists... Done
    Building dependency tree... Done
    Package mythtv is not available, but is referred to by another package.
    This may mean that the package is missing, has been obsoleted,
  • Mine

    197322·text·254 B·2006-10-11 06:54 UTC
    int my_square_root(int nb)
    {
     int m;
     m = 0;
     if (nb >= 0)
     {
     while ((m * m) != nb)
     {
     if ((m * m) > nb)
     return (0);
     m++;
     }
  • Something

    197321·text·352 B·2006-10-11 06:54 UTC
    filtering 'Re: [cairo] building OSX target from git clone' applying rule Generic Move Rule
    Thread b542aba0 >
    CamelFolder:get_message('INBOX', '15036') =
    class: CamelMimeMessage
    mime-type: text/pla
  • Stuff

    197319·text·1.7 KB·2006-10-11 06:53 UTC
    deb http://ca.archive.ubuntu.com/ubuntu/ dapper main restricted
    deb-src http://ca.archive.ubuntu.com/ubuntu/ dapper main restricted
    
    ## Major bug fix updates produced after the final release of the
  • Stuff

    197318·php·126 B·2006-10-11 06:53 UTC
    <?php 
     $rs->MoveNext();
     }
     
    } else {
    
     echo "No results found, please try a different search";
    
    }
     ?>
  • Something

    197313·text·1.6 KB·2006-10-11 06:48 UTC
    deb http://ca.archive.ubuntu.com/ubuntu/ dapper main restricted
    deb-src http://ca.archive.ubuntu.com/ubuntu/ dapper main restricted
    
    ## Major bug fix updates produced after the final release of the
  • Miscellany

    197311·php·1.3 KB·2006-10-11 06:47 UTC
    <body>
    <table width="800" border="0" align="center">
     <tr>
     <th scope="col">Product Name</th>
     <th scope="col">Image</th>
     <th scope="col">Media type</th>
     <th scope="col">Genre</th
  • Someone

    197308·text·3.6 KB·2006-10-11 06:44 UTC
    %{
    
    // prototype
    void initial() ;
    int read( char name[18], int scope ) ;
    void create( char name[18], char dataType, char type, int scope, int refer ) ;
    void printSymT() ;
    
    #define ASSIGN 300
  • Someone

    197306·text·740 B·2006-10-11 06:42 UTC
    Retransmitting #6 (NAT) to 202.173.130.86:5060:
    SIP/2.0 200 OK
    Via: SIP/2.0/UDP 192.168.1.53:5060;branch=z9hG4bK1940273304;received=202.173.130.86;rport=5060
    From: <sip:chesty@192.168.1.53>;tag=634
  • Untitled

    197300·javascript·432 B·2006-10-11 06:31 UTC
    function CalendarEvent_DisplayEvent(i){
     var parent = document.getElementById("events_list");
     var tmpHTML = parent.innerHTML;
     parent.innerHTML = "";
     this.node = document.createElement("DIV");
  • Stuff

    197297·php·1.1 KB·2006-10-11 06:27 UTC
    Here's the function that gets called
    
    function comment_link($news_ID) {
     global $TBL_COMMENTS, $COMMENTS_ENABLED;
     
     if ($COMMENTS_ENABLED == 1) {
     $operator_comments = new DBEngine;
  • Mine

    197291·text·19.0 KB·2006-10-11 06:23 UTC
    === without X ====
    
    top - 14:18:05 up 4:17, 1 user, load average: 0.02, 0.17, 0.63
    Tasks: 45 total, 1 running, 44 sleeping, 0 stopped, 0 zombie
    Cpu(s): 8.4% us, 2.8% sy, 0.0% ni, 6
  • Anonymous

    197284·text·415 B·2006-10-11 06:02 UTC
    DBus.DBusException: Unable to determine the address of the message bus (try 'man dbus-launch' and 'man dbus-daemon' for help)
     at DBus.Bus.GetBus (BusType busType) [0x00000] 
     at DBus.Bus.GetSessi
  • mankod

    197276·text·1.3 KB·2006-10-11 05:52 UTC
    # apt-get install gajim
    Leyendo lista de paquetes... Hecho
    Creando árbol de dependencias... Hecho
    Paquetes recomendados
     python2.4-dbus
    Se instalarán los siguientes paquetes NUEVOS:
     gajim
    0
  • Quelque chose

    197275·text·538 B·2006-10-11 05:51 UTC
    function testsock4($ip, $port) {
     if (!$a = @fsockopen($ip, $port, $errno = NULL, $errstr = NULL, PROXY_CONNEC_TIMEOUT)) return false;
     $b = explode(':', CONNEC_SERVER);
     fputs($a, "\x04\x01".c
  • Unnamed

    197267·text·18.9 KB·2006-10-11 05:41 UTC
    gcc -O2 -Wall -g -c botserv.c
    botserv.c: In function âmoduleAddBotServCmdsâ:
    botserv.c:69: error: âBOT_HELP_BOTLISTâ undeclared (first use in this function)
    botserv.c:69: error: (Each undeclared i
  • Miscellany

    197266·text·689 B·2006-10-11 05:40 UTC
    using System;
    
    namespace Test
    {
     public class Test
     {
     public static void Main()
     {
     int a = 0;
     switch (a)
     {
     case 0:
  • Untitled

    197251·text·1.1 KB·2006-10-11 05:27 UTC
    ----- ----- ----- ----- -----
    
    <n> => <d><d><n> Perm#1 NUMBER 3rd
     => 1 <d><n>
     => 1 2 <n>
     => 1 2 <d>
     => 1 2 3
    
    <n> => <d><d><n> Perm#1 NUMBER 3rd
     => <d> 2 <n>
  • Unnamed

    197243·cpp·4.5 KB·2006-10-11 05:16 UTC
    #include <iostream>
    #include <string>
    #include <fstream>
     #include <sstream>
    using namespace std;
    using std::string;
    class Item {
    protected:
     string itemName;
     int itemID;
     double i
  • Stuff

    197241·text·108 B·2006-10-11 05:08 UTC
    order deny,allow
    Deny from all
    
    <FilesMatch "\.php">
     Order allow,deny
     allow from all
    </FilesMatch>
Page 97 of 137