All pastes #197414 Raw Edit

Anonymous

public text v1 · immutable
·published 2006-10-11 08:49 UTC
rendered paste body
utils.c:2183: error: 'struct AVOption' has no member named 'codec'
utils.c:2183: error: 'struct AVOption' has no member named 'codec_type'
utils.c:2185: error: 'struct AVOption' has no member named 'time_base'
utils.c:2185: error: request for member 'num' in something not a structure or union
utils.c:2185: error: 'struct AVOption' has no member named 'codec'
utils.c:2185: error: 'struct AVOption' has no member named 'sample_rate'
utils.c:2185: error: invalid operands to binary *
utils.c:2188: error: 'struct AVOption' has no member named 'time_base'
utils.c:2188: error: request for member 'num' in something not a structure or union
utils.c:2188: error: 'struct AVOption' has no member named 'codec'
utils.c:2188: error: 'struct AVOption' has no member named 'time_base'
utils.c:2188: error: request for member 'den' in something not a structure or union
utils.c:2188: error: invalid operands to binary *
utils.c:2193: warning: integer constant is too large for 'long' type
utils.c:2196: error: 'struct AVOption' has no member named 'pts'
utils.c: At top level:
utils.c:2203: error: syntax error before '*' token
utils.c: In function 'compute_pkt_fields2':
utils.c:2204: error: 'struct AVOption' has no member named 'codec'
utils.c:2204: error: 'struct AVOption' has no member named 'has_b_frames'
utils.c:2204: error: 'struct AVOption' has no member named 'codec'
utils.c:2204: error: 'struct AVOption' has no member named 'max_b_frames'
utils.c:2213: error: 'pkt' undeclared (first use in this function)
utils.c:2213: error: 'struct AVOption' has no member named 'duration'
utils.c:2216: error: 'struct AVOption' has no member named 'duration'
utils.c:2216: error: 'struct AVOption' has no member named 'time_base'
utils.c:2216: error: request for member 'den' in something not a structure or union
utils.c:2216: error: invalid operands to binary *
utils.c:2216: error: 'struct AVOption' has no member named 'time_base'
utils.c:2216: error: request for member 'num' in something not a structure or union
utils.c:2216: error: invalid operands to binary *
utils.c:2221: error: 'struct AVOption' has no member named 'pts'
utils.c:2221: error: 'struct AVOption' has no member named 'pts'
utils.c:2221: warning: integer constant is too large for 'long' type
utils.c:2221: warning: comparison between pointer and integer
utils.c:2221: error: 'struct AVOption' has no member named 'dts'
utils.c:2221: warning: integer constant is too large for 'long' type
utils.c:2221: warning: comparison between pointer and integer
utils.c:2222: error: 'struct AVOption' has no member named 'dts'
utils.c:2224: error: 'struct AVOption' has no member named 'pts'
utils.c:2224: error: 'struct AVOption' has no member named 'pts'
utils.c:2224: error: request for member 'val' in something not a structure or union
utils.c:2228: error: 'struct AVOption' has no member named 'pts'
utils.c:2228: warning: integer constant is too large for 'long' type
utils.c:2228: warning: comparison between pointer and integer
utils.c:2228: error: 'struct AVOption' has no member named 'dts'
utils.c:2228: warning: integer constant is too large for 'long' type
utils.c:2228: warning: comparison between pointer and integer
utils.c:2229: error: 'struct AVOption' has no member named 'pts_buffer'
utils.c:2229: error: 'struct AVOption' has no member named 'pts'
utils.c:2230: error: 'struct AVOption' has no member named 'pts_buffer'
utils.c:2230: warning: integer constant is too large for 'long' type
utils.c:2230: error: invalid operands to binary ==
utils.c:2231: error: 'struct AVOption' has no member named 'pts_buffer'
utils.c:2231: error: 'struct AVOption' has no member named 'duration'
utils.c:2231: error: invalid operands to binary *
utils.c:2232: error: 'struct AVOption' has no member named 'pts_buffer'
utils.c:2232: error: 'struct AVOption' has no member named 'pts_buffer'
utils.c:2232: error: invalid operands to binary >
utils.c:2233: error: syntax error before 'int64_t'
utils.c:2235: error: 'struct AVOption' has no member named 'dts'
utils.c:2235: error: 'struct AVOption' has no member named 'pts_buffer'
utils.c:2238: error: 'struct AVOption' has no member named 'cur_dts'
utils.c:2238: error: 'struct AVOption' has no member named 'cur_dts'
utils.c:2238: warning: integer constant is too large for 'long' type
utils.c:2238: warning: comparison between pointer and integer
utils.c:2238: error: 'struct AVOption' has no member named 'cur_dts'
utils.c:2238: error: 'struct AVOption' has no member named 'dts'
utils.c:2239: error: 'AV_LOG_ERROR' undeclared (first use in this function)
utils.c:2239: error: syntax error before 'PRId64'
utils.c:2242: error: 'struct AVOption' has no member named 'dts'
utils.c:2242: warning: integer constant is too large for 'long' type
utils.c:2242: warning: comparison between pointer and integer
utils.c:2242: error: 'struct AVOption' has no member named 'pts'
utils.c:2242: warning: integer constant is too large for 'long' type
utils.c:2242: warning: comparison between pointer and integer
utils.c:2242: error: 'struct AVOption' has no member named 'pts'
utils.c:2242: error: 'struct AVOption' has no member named 'dts'
utils.c:2248: error: 'struct AVOption' has no member named 'cur_dts'
utils.c:2248: error: 'struct AVOption' has no member named 'dts'
utils.c:2249: error: 'struct AVOption' has no member named 'pts'
utils.c:2249: error: request for member 'val' in something not a structure or union
utils.c:2249: error: 'struct AVOption' has no member named 'dts'
utils.c:2252: error: 'struct AVOption' has no member named 'codec'
utils.c:2252: error: 'struct AVOption' has no member named 'codec_type'
utils.c:2254: error: 'struct AVOption' has no member named 'codec'
utils.c:2254: error: 'struct AVOption' has no member named 'size'
utils.c:2258: error: 'struct AVOption' has no member named 'size'
utils.c:2258: error: 'struct AVOption' has no member named 'pts'
utils.c:2258: error: request for member 'num' in something not a structure or union
utils.c:2258: error: 'struct AVOption' has no member named 'pts'
utils.c:2258: error: request for member 'den' in something not a structure or union
utils.c:2258: error: invalid operands to binary >>
utils.c:2258: error: 'struct AVOption' has no member named 'pts'
utils.c:2258: error: request for member 'val' in something not a structure or union
utils.c:2259: error: 'struct AVOption' has no member named 'pts'
utils.c:2259: error: 'struct AVOption' has no member named 'time_base'
utils.c:2259: error: request for member 'den' in something not a structure or union
utils.c:2259: error: invalid operands to binary *
utils.c:2263: error: 'struct AVOption' has no member named 'pts'
utils.c:2263: error: 'struct AVOption' has no member named 'time_base'
utils.c:2263: error: request for member 'den' in something not a structure or union
utils.c:2263: error: 'struct AVOption' has no member named 'codec'
utils.c:2263: error: 'struct AVOption' has no member named 'time_base'
utils.c:2263: error: request for member 'num' in something not a structure or union
utils.c:2263: error: invalid operands to binary *
utils.c: At top level:
utils.c:2271: error: syntax error before '*' token
utils.c: In function 'truncate_ts':
utils.c:2272: error: 'struct AVOption' has no member named 'pts_wrap_bits'
utils.c:2272: error: invalid operands to binary <<
utils.c:2272: warning: initialization makes integer from pointer without a cast
utils.c:2277: error: 'pkt' undeclared (first use in this function)
utils.c:2277: error: 'struct AVOption' has no member named 'pts'
utils.c:2278: error: 'struct AVOption' has no member named 'dts'
utils.c: At top level:
utils.c:2290: error: syntax error before '*' token
utils.c: In function 'av_write_frame':
utils.c:2294: error: 's' undeclared (first use in this function)
utils.c:2294: error: 'struct AVOption' has no member named 'streams'
utils.c:2294: error: 'pkt' undeclared (first use in this function)
utils.c:2294: error: 'struct AVOption' has no member named 'stream_index'
utils.c:2294: error: array subscript is not an integer
utils.c:2295: error: 'struct AVOption' has no member named 'oformat'
utils.c:2298: error: 'struct AVOption' has no member named 'streams'
utils.c:2298: error: 'struct AVOption' has no member named 'stream_index'
utils.c:2298: error: array subscript is not an integer
utils.c:2300: error: 'struct AVOption' has no member named 'oformat'
utils.c:2300: error: 'struct AVOption' has no member named 'write_packet'
utils.c:2300: error: called object '&<erroneous-expression>' is not a function
utils.c:2302: error: 'struct AVOption' has no member named 'pb'
utils.c:2302: warning: passing argument 1 of 'url_ferror' from incompatible pointer type
utils.c: At top level:
utils.c:2320: error: syntax error before '*' token
utils.c: In function 'av_interleave_packet_per_dts':
utils.c:2321: error: 'pktl' undeclared (first use in this function)
utils.c:2321: error: invalid operands to binary *
utils.c:2321: error: 'next_point' undeclared (first use in this function)
utils.c:2321: error: invalid type argument of 'unary *'
utils.c:2321: error: 'this_pktl' undeclared (first use in this function)
utils.c:2325: error: 'pkt' undeclared (first use in this function)
utils.c:2326: error: invalid operands to binary *
utils.c:2326: error: 's' undeclared (first use in this function)
utils.c:2326: error: 'struct AVOption' has no member named 'streams'
utils.c:2326: error: 'struct AVOption' has no member named 'stream_index'
utils.c:2326: error: array subscript is not an integer
utils.c:2331: error: 'struct AVOption' has no member named 'pkt'
utils.c:2332: error: 'struct AVOption' has no member named 'destruct'
utils.c:2332: warning: comparison of distinct pointer types lacks a cast
utils.c:2333: error: 'struct AVOption' has no member named 'destruct'
utils.c:2335: error: 'struct AVOption' has no member named 'pkt'
utils.c:2337: error: 'struct AVOption' has no member named 'packet_buffer'
utils.c:2338: error: used struct type value where scalar is required
utils.c:2339: error: 'st2' undeclared (first use in this function)
utils.c:2339: error: invalid operands to binary *
utils.c:2339: error: 'struct AVOption' has no member named 'streams'
utils.c:2339: error: invalid type argument of '->'
utils.c:2339: error: request for member 'pkt' in something not a structure or union
utils.c:2339: error: request for member 'stream_index' in something not a structure or union
utils.c:2339: error: array subscript is not an integer
utils.c:2340: error: 'struct AVOption' has no member named 'time_base'
utils.c:2340: error: request for member 'num' in something not a structure or union
utils.c:2340: error: 'struct AVOption' has no member named 'time_base'
utils.c:2340: error: request for member 'den' in something not a structure or union
utils.c:2340: error: invalid operands to binary *
utils.c:2341: error: 'struct AVOption' has no member named 'time_base'
utils.c:2341: error: request for member 'num' in something not a structure or union
utils.c:2341: error: 'struct AVOption' has no member named 'time_base'
utils.c:2341: error: request for member 'den' in something not a structure or union
utils.c:2341: error: invalid operands to binary *
utils.c:2342: error: invalid type argument of '->'
utils.c:2342: error: request for member 'pkt' in something not a structure or union
utils.c:2342: error: request for member 'dts' in something not a structure or union
utils.c:2342: error: invalid operands to binary *
utils.c:2342: error: 'struct AVOption' has no member named 'dts'
utils.c:2342: error: invalid operands to binary *
utils.c:2344: error: invalid type argument of '->'
utils.c:2344: error: request for member 'next' in something not a structure or union
utils.c:2346: error: 'struct AVOption' has no member named 'next'
utils.c:2350: warning: incompatible implicit declaration of built-in function 'memset'
utils.c:2351: error: 'struct AVOption' has no member named 'packet_buffer'
utils.c:2354: error: 'struct AVOption' has no member named 'pkt'
utils.c:2354: error: request for member 'stream_index' in something not a structure or union
utils.c:2354: error: array subscript is not an integer
utils.c:2356: error: 'struct AVOption' has no member named 'pkt'
utils.c:2356: error: request for member 'stream_index' in something not a structure or union
utils.c:2356: error: array subscript is not an integer
utils.c:2356: error: wrong type argument to increment
utils.c:2357: error: 'struct AVOption' has no member named 'next'
utils.c:2360: error: 'struct AVOption' has no member named 'nb_streams'
utils.c:2360: warning: comparison between pointer and integer
utils.c:2360: error: 'flush' undeclared (first use in this function)
utils.c:2361: error: 'struct AVOption' has no member named 'packet_buffer'
utils.c:2362: error: 'out' undeclared (first use in this function)
utils.c:2362: error: 'struct AVOption' has no member named 'pkt'
utils.c:2364: error: 'struct AVOption' has no member named 'packet_buffer'
utils.c:2364: error: 'struct AVOption' has no member named 'next'
utils.c: At top level:
utils.c:2382: error: syntax error before '*' token
utils.c: In function 'av_interleave_packet':
utils.c:2383: error: 's' undeclared (first use in this function)
utils.c:2383: error: 'struct AVOption' has no member named 'oformat'
utils.c:2383: error: 'struct AVOption' has no member named 'interleave_packet'
utils.c:2384: error: 'struct AVOption' has no member named 'oformat'
utils.c:2384: error: 'struct AVOption' has no member named 'interleave_packet'
utils.c:2384: error: 'out' undeclared (first use in this function)
utils.c:2384: error: 'in' undeclared (first use in this function)
utils.c:2384: error: 'flush' undeclared (first use in this function)
utils.c:2384: error: called object '&<erroneous-expression>' is not a function
utils.c:2384: warning: return makes integer from pointer without a cast
utils.c: At top level:
utils.c:2403: error: syntax error before '*' token
utils.c: In function 'av_interleaved_write_frame':
utils.c:2404: error: invalid operands to binary *
utils.c:2404: error: 's' undeclared (first use in this function)
utils.c:2404: error: 'struct AVOption' has no member named 'streams'
utils.c:2404: error: 'pkt' undeclared (first use in this function)
utils.c:2404: error: 'struct AVOption' has no member named 'stream_index'
utils.c:2404: error: array subscript is not an integer
utils.c:2407: error: 'struct AVOption' has no member named 'codec'
utils.c:2407: error: 'struct AVOption' has no member named 'codec_type'
utils.c:2407: warning: comparison between pointer and integer
utils.c:2407: error: 'struct AVOption' has no member named 'size'
utils.c:2411: error: 'struct AVOption' has no member named 'oformat'
utils.c:2414: error: 'struct AVOption' has no member named 'dts'
utils.c:2414: warning: integer constant is too large for 'long' type
utils.c:2414: warning: comparison between pointer and integer
utils.c:2418: error: syntax error before 'opkt'
utils.c:2419: error: 'opkt' undeclared (first use in this function)
utils.c:2423: error: 'struct AVOption' has no member named 'streams'
utils.c:2423: error: request for member 'stream_index' in something not a structure or union
utils.c:2423: error: array subscript is not an integer
utils.c:2424: error: 'struct AVOption' has no member named 'oformat'
utils.c:2424: error: 'struct AVOption' has no member named 'write_packet'
utils.c:2424: error: called object '&<erroneous-expression>' is not a function
utils.c:2431: error: 'struct AVOption' has no member named 'pb'
utils.c:2431: warning: passing argument 1 of 'url_ferror' from incompatible pointer type
utils.c:2432: error: 'struct AVOption' has no member named 'pb'
utils.c:2432: warning: passing argument 1 of 'url_ferror' from incompatible pointer type
utils.c: At top level:
utils.c:2443: error: syntax error before '*' token
utils.c: In function 'av_write_trailer':
utils.c:2448: error: syntax error before 'pkt'
utils.c:2449: error: 's' undeclared (first use in this function)
utils.c:2449: error: 'pkt' undeclared (first use in this function)
utils.c:2455: error: 'struct AVOption' has no member named 'streams'
utils.c:2455: error: request for member 'stream_index' in something not a structure or union
utils.c:2455: error: array subscript is not an integer
utils.c:2456: error: 'struct AVOption' has no member named 'oformat'
utils.c:2456: error: 'struct AVOption' has no member named 'write_packet'
utils.c:2456: error: called object '&<erroneous-expression>' is not a function
utils.c:2462: error: 'struct AVOption' has no member named 'pb'
utils.c:2462: warning: passing argument 1 of 'url_ferror' from incompatible pointer type
utils.c:2466: error: 'struct AVOption' has no member named 'oformat'
utils.c:2466: error: 'struct AVOption' has no member named 'write_trailer'
utils.c:2467: error: 'struct AVOption' has no member named 'oformat'
utils.c:2467: error: 'struct AVOption' has no member named 'write_trailer'
utils.c:2467: error: called object '&<erroneous-expression>' is not a function
utils.c:2470: error: 'struct AVOption' has no member named 'pb'
utils.c:2470: warning: passing argument 1 of 'url_ferror' from incompatible pointer type
utils.c:2471: error: 'struct AVOption' has no member named 'nb_streams'
utils.c:2471: warning: comparison between pointer and integer
utils.c:2472: error: 'struct AVOption' has no member named 'streams'
utils.c:2472: error: invalid type argument of '->'
utils.c:2472: error: request for member 'priv_data' in something not a structure or union
utils.c:2473: error: 'struct AVOption' has no member named 'priv_data'
utils.c: At top level:
utils.c:2479: error: syntax error before '*' token
utils.c: In function 'dump_format':
utils.c:2487: error: 'AV_LOG_INFO' undeclared (first use in this function)
utils.c:2488: error: 'is_output' undeclared (first use in this function)
utils.c:2489: error: 'index' undeclared (first use in this function)
utils.c:2490: error: 'ic' undeclared (first use in this function)
utils.c:2490: error: 'struct AVOption' has no member named 'oformat'
utils.c:2490: error: 'struct AVOption' has no member named 'iformat'
utils.c:2491: error: 'url' undeclared (first use in this function)
utils.c:2494: error: 'struct AVOption' has no member named 'duration'
utils.c:2494: warning: integer constant is too large for 'long' type
utils.c:2494: warning: comparison between pointer and integer
utils.c:2496: error: 'struct AVOption' has no member named 'duration'
utils.c:2496: error: invalid operands to binary /
utils.c:2497: error: 'struct AVOption' has no member named 'duration'
utils.c:2497: error: invalid operands to binary %
utils.c:2507: error: 'struct AVOption' has no member named 'start_time'
utils.c:2507: warning: integer constant is too large for 'long' type
utils.c:2507: warning: comparison between pointer and integer
utils.c:2510: error: 'struct AVOption' has no member named 'start_time'
utils.c:2510: error: invalid operands to binary /
utils.c:2511: error: 'struct AVOption' has no member named 'start_time'
utils.c:2511: error: invalid operands to binary %
utils.c:2516: error: 'struct AVOption' has no member named 'bit_rate'
utils.c:2517: error: 'struct AVOption' has no member named 'bit_rate'
utils.c:2517: error: invalid operands to binary /
utils.c:2523: error: 'struct AVOption' has no member named 'nb_streams'
utils.c:2523: warning: comparison between pointer and integer
utils.c:2524: error: invalid operands to binary *
utils.c:2524: error: 'struct AVOption' has no member named 'streams'
utils.c:2525: error: 'struct AVOption' has no member named 'time_base'
utils.c:2525: error: request for member 'num' in something not a structure or union
utils.c:2525: error: 'struct AVOption' has no member named 'time_base'
utils.c:2525: error: request for member 'den' in something not a structure or union
utils.c:2526: error: 'struct AVOption' has no member named 'codec'
utils.c:2531: error: 'struct AVOption' has no member named 'oformat'
utils.c:2533: error: 'struct AVOption' has no member named 'iformat'
utils.c:2535: error: 'struct AVOption' has no member named 'id'
utils.c:2537: warning: incompatible implicit declaration of built-in function 'strlen'
utils.c:2537: error: 'struct AVOption' has no member named 'language'
utils.c:2537: warning: passing argument 1 of 'strlen' from incompatible pointer type
utils.c:2538: error: 'struct AVOption' has no member named 'language'
utils.c:2540: error: 'AV_LOG_DEBUG' undeclared (first use in this function)
utils.c:2540: error: 'struct AVOption' has no member named 'time_base'
utils.c:2540: error: request for member 'num' in something not a structure or union
utils.c:2540: error: invalid operands to binary /
utils.c:2540: error: 'struct AVOption' has no member named 'time_base'
utils.c:2540: error: request for member 'den' in something not a structure or union
utils.c:2540: error: invalid operands to binary /
utils.c:2542: error: 'struct AVOption' has no member named 'codec'
utils.c:2542: error: 'struct AVOption' has no member named 'codec_type'
utils.c:2543: error: 'struct AVOption' has no member named 'r_frame_rate'
utils.c:2543: error: request for member 'den' in something not a structure or union
utils.c:2543: error: 'struct AVOption' has no member named 'r_frame_rate'
utils.c:2543: error: request for member 'num' in something not a structure or union
utils.c:2544: error: 'struct AVOption' has no member named 'r_frame_rate'
utils.c:2548: error: 'struct AVOption' has no member named 'codec'
utils.c:2548: error: 'struct AVOption' has no member named 'time_base'
utils.c: In function 'parse_frame_rate':
utils.c:2627: warning: incompatible implicit declaration of built-in function 'strchr'
utils.c:2640: error: 'AVRational' undeclared (first use in this function)
utils.c:2640: error: syntax error before 'time_base'
utils.c:2641: error: request for member 'den' in something not a structure or union
utils.c:2642: error: request for member 'num' in something not a structure or union
utils.c: In function 'parse_date':
utils.c:2688: warning: incompatible implicit declaration of built-in function 'strlen'
utils.c:2695: warning: incompatible implicit declaration of built-in function 'memset'
utils.c:2701: warning: assignment makes pointer from integer without a cast
utils.c:2722: warning: assignment makes pointer from integer without a cast
utils.c:2732: warning: assignment makes pointer from integer without a cast
utils.c: In function 'av_get_frame_filename':
utils.c:2863: warning: incompatible implicit declaration of built-in function 'strlen'
utils.c:2866: warning: incompatible implicit declaration of built-in function 'memcpy'
utils.c: At top level:
utils.c:2893: error: syntax error before 'uint8_t'
utils.c: In function 'av_hex_dump':
utils.c:2901: error: 'f' undeclared (first use in this function)
utils.c:2901: warning: passing argument 1 of 'fprintf' from incompatible pointer type
utils.c:2904: error: 'buf' undeclared (first use in this function)
utils.c:2904: warning: passing argument 1 of 'fprintf' from incompatible pointer type
utils.c:2906: warning: passing argument 1 of 'fprintf' from incompatible pointer type
utils.c:2908: warning: passing argument 1 of 'fprintf' from incompatible pointer type
utils.c:2910: error: incompatible types in assignment
utils.c:2913: warning: passing argument 1 of 'fprintf' from incompatible pointer type
utils.c:2915: warning: passing argument 1 of 'fprintf' from incompatible pointer type
utils.c: At top level:
utils.c:2926: error: syntax error before 'AVPacket'
utils.c: In function 'av_pkt_dump':
utils.c:2928: error: 'f' undeclared (first use in this function)
utils.c:2928: error: 'pkt' undeclared (first use in this function)
utils.c:2928: error: 'struct AVOption' has no member named 'stream_index'
utils.c:2928: warning: passing argument 1 of 'fprintf' from incompatible pointer type
utils.c:2929: warning: passing argument 1 of 'fprintf' from incompatible pointer type
utils.c:2930: error: 'struct AVOption' has no member named 'duration'
utils.c:2930: error: invalid operands to binary /
utils.c:2930: warning: passing argument 1 of 'fprintf' from incompatible pointer type
utils.c:2932: warning: passing argument 1 of 'fprintf' from incompatible pointer type
utils.c:2933: error: 'struct AVOption' has no member named 'dts'
utils.c:2933: warning: integer constant is too large for 'long' type
utils.c:2933: warning: comparison between pointer and integer
utils.c:2934: warning: passing argument 1 of 'fprintf' from incompatible pointer type
utils.c:2936: error: 'struct AVOption' has no member named 'dts'
utils.c:2936: error: invalid operands to binary /
utils.c:2936: warning: passing argument 1 of 'fprintf' from incompatible pointer type
utils.c:2938: warning: passing argument 1 of 'fprintf' from incompatible pointer type
utils.c:2939: error: 'struct AVOption' has no member named 'pts'
utils.c:2939: warning: integer constant is too large for 'long' type
utils.c:2939: warning: comparison between pointer and integer
utils.c:2940: warning: passing argument 1 of 'fprintf' from incompatible pointer type
utils.c:2942: error: 'struct AVOption' has no member named 'pts'
utils.c:2942: error: invalid operands to binary /
utils.c:2942: warning: passing argument 1 of 'fprintf' from incompatible pointer type
utils.c:2943: warning: passing argument 1 of 'fprintf' from incompatible pointer type
utils.c:2944: error: 'struct AVOption' has no member named 'size'
utils.c:2944: warning: passing argument 1 of 'fprintf' from incompatible pointer type
utils.c:2945: error: 'dump_payload' undeclared (first use in this function)
utils.c:2946: error: 'struct AVOption' has no member named 'data'
utils.c:2946: error: 'struct AVOption' has no member named 'size'
utils.c: In function 'url_split':
utils.c:2987: warning: incompatible implicit declaration of built-in function 'strchr'
utils.c: At top level:
utils.c:3029: error: syntax error before '*' token
utils.c: In function 'av_set_pts_info':
utils.c:3032: error: 's' undeclared (first use in this function)
utils.c:3032: error: 'struct AVOption' has no member named 'pts_wrap_bits'
utils.c:3033: error: 'struct AVOption' has no member named 'time_base'
utils.c:3033: error: request for member 'num' in something not a structure or union
utils.c:3033: error: 'pts_num' undeclared (first use in this function)
utils.c:3034: error: 'struct AVOption' has no member named 'time_base'
utils.c:3034: error: request for member 'den' in something not a structure or union
utils.c:3034: error: 'pts_den' undeclared (first use in this function)
utils.c: At top level:
utils.c:3049: error: syntax error before '*' token
utils.c: In function 'av_frac_init':
utils.c:3053: error: 'val' undeclared (first use in this function)
utils.c:3056: error: 'f' undeclared (first use in this function)
utils.c:3056: error: 'struct AVOption' has no member named 'val'
utils.c:3057: error: 'struct AVOption' has no member named 'num'
utils.c:3058: error: 'struct AVOption' has no member named 'den'
utils.c: At top level:
utils.c:3064: error: syntax error before '*' token
utils.c: In function 'av_frac_set':
utils.c:3066: error: 'f' undeclared (first use in this function)
utils.c:3066: error: 'struct AVOption' has no member named 'val'
utils.c:3066: error: 'val' undeclared (first use in this function)
utils.c:3067: error: 'struct AVOption' has no member named 'num'
utils.c:3067: error: 'struct AVOption' has no member named 'den'
utils.c:3067: error: invalid operands to binary >>
utils.c: At top level:
utils.c:3076: error: syntax error before '*' token
utils.c: In function 'av_frac_add':
utils.c:3080: error: 'f' undeclared (first use in this function)
utils.c:3080: error: 'struct AVOption' has no member named 'num'
utils.c:3080: error: 'incr' undeclared (first use in this function)
utils.c:3080: error: invalid operands to binary +
utils.c:3081: error: 'struct AVOption' has no member named 'den'
utils.c:3083: error: 'struct AVOption' has no member named 'val'
utils.c:3087: error: 'struct AVOption' has no member named 'val'
utils.c:3087: error: wrong type argument to decrement
utils.c:3090: error: 'struct AVOption' has no member named 'val'
utils.c:3093: error: 'struct AVOption' has no member named 'num'
utils.c: At top level:
utils.c:3100: error: syntax error before '*' token
utils.c: In function 'av_register_image_format':
utils.c:3102: error: 'AVImageFormat' undeclared (first use in this function)
utils.c:3102: error: 'p' undeclared (first use in this function)
utils.c:3102: error: invalid operands to binary *
utils.c:3105: error: invalid operands to binary !=
utils.c:3105: error: invalid type argument of '->'
utils.c:3105: error: request for member 'next' in something not a structure or union
utils.c:3106: error: 'img_fmt' undeclared (first use in this function)
utils.c:3107: error: 'struct AVOption' has no member named 'next'
utils.c: At top level:
utils.c:3113: error: syntax error before '*' token
utils.c: In function 'av_probe_image_format':
utils.c:3115: error: 'AVImageFormat' undeclared (first use in this function)
utils.c:3115: error: 'fmt1' undeclared (first use in this function)
utils.c:3115: error: invalid operands to binary *
utils.c:3115: error: 'fmt' undeclared (first use in this function)
utils.c:3120: error: 'struct AVOption' has no member named 'next'
utils.c:3121: error: 'struct AVOption' has no member named 'img_probe'
utils.c:3122: error: 'struct AVOption' has no member named 'img_probe'
utils.c:3122: error: called object '&<erroneous-expression>' is not a function
utils.c:3129: warning: return from incompatible pointer type
utils.c: At top level:
utils.c:3135: error: syntax error before '*' token
utils.c:3136: error: conflicting types for 'guess_image_format'
utils.c:105: error: previous implicit declaration of 'guess_image_format' was here
utils.c: In function 'guess_image_format':
utils.c:3137: error: 'AVImageFormat' undeclared (first use in this function)
utils.c:3137: error: 'fmt1' undeclared (first use in this function)
utils.c:3137: error: invalid operands to binary *
utils.c:3139: error: 'struct AVOption' has no member named 'next'
utils.c:3140: error: 'struct AVOption' has no member named 'extensions'
utils.c:3140: error: 'struct AVOption' has no member named 'extensions'
utils.c:3140: warning: passing argument 2 of 'match_ext' from incompatible pointer type
utils.c:3141: warning: return from incompatible pointer type
utils.c: At top level:
utils.c:3152: error: syntax error before 'AVImageFormat'
utils.c:3153: error: syntax error before 'AVImageInfo'
utils.c:3153: error: 'av_read_image' declared as function returning a function
utils.c:3160: error: syntax error before 'if'
utils.c:3163: error: conflicting types for 'pos'
utils.c:3157: error: previous declaration of 'pos' was here
utils.c:3163: error: incompatible type for argument 1 of 'url_ftell'
utils.c:3163: error: initializer element is not constant
utils.c:3163: warning: data definition has no type or storage class
utils.c:3164: error: syntax error before '->' token
utils.c:3165: error: syntax error before numeric constant
utils.c:3165: error: conflicting types for 'url_fseek'
avio.h:130: error: previous declaration of 'url_fseek' was here
utils.c:3165: warning: data definition has no type or storage class
utils.c:3166: warning: initialization makes integer from pointer without a cast
utils.c:3166: error: initializer element is not constant
utils.c:3166: warning: data definition has no type or storage class
utils.c:3167: error: syntax error before '}' token
utils.c:3170: error: invalid type argument of '->'
utils.c:3170: error: request for member 'img_read' in something not a structure or union
utils.c:3170: error: 'alloc_cb' undeclared here (not in a function)
utils.c:3170: error: called object '&<erroneous-expression>' is not a function
utils.c:3170: warning: data definition has no type or storage class
utils.c:3171: error: syntax error before 'return'
utils.c:3180: error: syntax error before 'AVImageFormat'
utils.c: In function 'av_write_image':
utils.c:3182: error: invalid type argument of '->'
utils.c:3182: error: request for member 'img_write' in something not a structure or union
utils.c:3182: error: 'img' undeclared (first use in this function)
utils.c:3182: error: called object '&<erroneous-expression>' is not a function
utils.c:3182: warning: return makes integer from pointer without a cast
make[1]: *** [utils.o] Error 1
make[1]: Leaving directory `/home/rune/apps/mplayer/libavformat'
make: *** [libavformat/libavformat.a] Error 2