-
196229·text·105 B·2006-10-10 12:27 UTC
Math.sqrt(Math.pow(sideA, 2) + Math.pow(sideB, 2) - 2 * sideA * sideB * Math.toRadians(Math.cos(angleC)))
-
196226·text·3.8 KB·2006-10-10 12:26 UTC
# Xorg configuration created by system-config-display
Section "ServerLayout"
Identifier "single head configuration"
Screen 0 "Screen0" 0 0
InputDevice "Mouse0" "CorePointer"
-
196224·text·326 B·2006-10-10 12:24 UTC
]# pacman -Qs kernel26
local/kernel26 2.6.17.13-3
The Linux Kernel and modules
local/kernel26ck 2.6.18.ck1-2
The Linux Kernel and modules (Con Kolivas high performance ck-patchset with
-
196221·text·642 B·2006-10-10 12:23 UTC
on *:TEXT:brb*:#: {
inc %timer.away 1
set %timeraway. [ $+ [ $nick ] ] %timer.away
msg $chan 7,1 $+ $nick will be right back, reason: $$2-
set %awayreason. [ $+ [ $nick ] ] $$2-
set %a
-
196214·text·3.2 KB·2006-10-10 12:13 UTC
<snip>
source/blender/python/api2_2x/NMesh.h:52: warning: data definition has no type or storage class
source/blender/python/api2_2x/NMesh.h:53: error: syntax error before NMVert_Type
source/
-
196213·text·247 B·2006-10-10 12:12 UTC
Sei > eine fundierte Relation ueber einer Menge M und sei A(m) eine Aussage ueber Objekte m aus M.
Falls fuer alle m aus M gilt:
Wenn A(k) fuer alle k aus M mit m>k gilt, dann gilt auch A(m).
-
196212·text·631 B·2006-10-10 12:12 UTC
on *:TEXT:brb*:#: {
inc %timer.away 1
set %timeraway. [ $+ [ $nick ] ] %timer.away
msg $chan 7,1 $+ $nick will be right back, reason: $$2-
set %awayreason. [ $+ [ $nick ] ] $$2-
set %a
-
196206·text·489 B·2006-10-10 11:59 UTC
collect2: ld returned 1 exit status
make[1]: *** [glmovie] Error 1
make[1]: Leaving directory `/var/tmp/portage/smpeg-0.4.4-r7/work/smpeg-0.4.4'
make: *** [all-recursive] Error 1
!!! ERROR: medi
-
196204·text·879 B·2006-10-10 11:58 UTC
# pacman -S nvidia && modprobe nvidia
:: nvidia-1.0.8774-2: is up to date. Upgrade anyway? [Y/n] y
Targets: nvidia-1.0.8774-2
Total Package Size: 1.5 MB
Proceed with upgrade? [Y/n] y
c
-
196203·text·5.3 KB·2006-10-10 11:56 UTC
<snip>
In file included from source/blender/imbuf/intern/dynlibtiff.c:46:
source/blender/imbuf/intern/dynlibtiff.h:47:20: error: tiffio.h: No such file or directory
In file included from source
-
196197·text·812 B·2006-10-10 11:53 UTC
multistar:/home/jonerik/xmlgallery# dpkg -i libmodxslt0_2005072700-1_i386.deb
(Reading database ... 35808 files and directories currently installed.)
Preparing to replace libmodxslt0 2005072700-1 (
-
196194·apache·34.9 KB·2006-10-10 11:52 UTC
-
196193·text·2.4 KB·2006-10-10 11:52 UTC
^M [codec_gsm.so] => (GSM06.10/PCM16 (signed linear) Codec Translator)
^M == Parsing '/usr/local/etc/openpbx.org/codecs.conf': Found
^M -- codec_gsm: using generic PLC
Oct 10 13:51:12 WARNING[3
-
196183·mirc·321 B·2006-10-10 11:48 UTC
on *:SOCKREAD:pckck*:{
if ($sockerr) {
/echo -a Socket error
}
:nextread
var %read
sockread -f %read
if (!$sockbr) { break }
if (<br> isin %read) || (<i> isin %read) || (<b>
-
196179·text·1.1 KB·2006-10-10 11:43 UTC
# pacman -Sy kernel26
:: Synchronizing package databases...
:: current is up to date
:: extra is up to date
:: community is up to date
:: kernel26-2.6.17.13-3: local version is newer. Upgrade an
-
196176·text·919 B·2006-10-10 11:36 UTC
multistar:/home/jonerik/xmlgallery# dpkg -i libapache2-modxslt_2005072700-1_i386.deb >> /www/htdocs/multistar.nixport.net/libapache2-modxslt
dpkg: dependency problems prevent configuration of libapac
-
196171·text·352 B·2006-10-10 11:30 UTC
/\ /\ /\ /\ /\
/ 0\/ 1\/ 2\/ 3\/ 4\
\ /\ /\ /\ /\ /
\/ 5\/ 6\/ 7\/ 8\/
/\ /\ /\ /\ /\
/ 9\/10\/11\/12\/13\
\ /\ /\ /\ /\ /
\/14\/15\/16\/17\/
/\ /\ /\ /\ /\
/1
-
196167·text·264 B·2006-10-10 11:28 UTC
Oct 10 10:15:02 m24s27 pam_limits[7763]: setrlimit limit #6 to soft=-1, hard=-1 failed: Operation not permitted; uid=0 euid=0
^\w{3} [ :0-9]{11} [._[:alnum:]-]+ pam_limits\[[0-9]+\]: setrlimit limi
-
196166·text·324 B·2006-10-10 11:27 UTC
SET SESSION TRANSACTION ISOLATION LEVEL REPEATABLE READ
BEGIN
SELECT x FROM y == 'test'
-- meantime other connection
updates y set x='othertest'
SET SESSION TRANSACTION ISOLATION LEVEL REA
-
196165·text·329 B·2006-10-10 11:26 UTC
SET SESSION TRANSACTION ISOLATION LEVEL REPEATABLE READ
BEGIN
SELECT x FROM y == 'test'
-- meantime other connection
updates y set x='othertest'
SET SESSION TRANSACTION ISOLATION LEVEL
RE
-
196164·text·915 B·2006-10-10 11:24 UTC
Windows Registry Editor Version 5.00
[HKEY_LOCAL_MACHINE\SOFTWARE\Blizzard Entertainment]
[HKEY_LOCAL_MACHINE\SOFTWARE\Blizzard Entertainment\Diablo II]
"SmallInstall"=dword:00000000
"InstallP
-
196161·text·15.1 KB·2006-10-10 11:22 UTC
<snip>
scons: Reading SConscript files ...
Command-line arguments
WITH_BF_VERSE = 1
Command-line targets
No targets given, using default
Using config file: config/linux2-config.p
-
196158·c·814 B·2006-10-10 11:20 UTC
#include <stdio.h>
#include <stdlib.h>
#include <sys/types.h>
#include <dirent.h>
int main(int argc, char** argv)
{
char c[200];
int t;
if (argc < 2) {
fprintf(stderr, "Read the hel
-
196154·c·1.1 KB·2006-10-10 11:11 UTC
/***************************************************************************
* quota-usage.c
*
* Tue Oct 10 15:08:40 2006
* Copyright 2006 Mustafa A. Hashmi
* mustafa.hashmi@
-
196145·text·9.5 KB·2006-10-10 10:51 UTC
http_port 3128
icp_port 3130
# htcp_port 4827
# icp_query_timeout 0
# maximum_icp_query_timeout 2000
# mcast_icp_query_timeout 2000
# dead_peer_timeout 10 seconds
acl QUERY urlpath_regex cgi-bi
-
196144·text·1.4 KB·2006-10-10 10:50 UTC
Archive_Tar 1.3.1 stable
Auth 1.3.0 stable
Auth_HTTP 2.1.6 stable
Auth_SASL 1.0.2 stable
Console_Getopt
-
196143·text·1.0 KB·2006-10-10 10:48 UTC
#Plonecustom
.hoje{
color:red;
}
.dia{
color:blue;
}
#Zpt
<metal:block tal:repeat="items fp_sql">
<tr tal:define="pintar repeat/items/even;
data items/col_dtn
-
196142·text·1.3 KB·2006-10-10 10:47 UTC
root@hydra:/home/anjo/Desktop/custom_rockbox/rockbox-devel/build# ../tools/configure Enter target platform:
==Archos== ==iriver== ==Apple iPod==
0) Player/Studio 10) H1
-
196141·text·922 B·2006-10-10 10:45 UTC
# line_item.rb
class LineItem < ActiveRecord::Base
belongs_to :product
def self.for_product(product)
item = self.new
item.quantity = 1
item.product = product
item.unit_price = pro
-
196137·text·255 B·2006-10-10 10:40 UTC
You have a nil object when you didn't expect it!
You might have expected an instance of Array.
The error occured while evaluating nil.<<
#{RAILS_ROOT}/app/models/cart.rb:12:in `add_product'
-
196133·text·951 B·2006-10-10 10:28 UTC
<metal:block tal:repeat="items fp_sql">
<tr tal:define="pintar repeat/items/even;
data items/col_dtnascimento;
dataN python:context.ZopeTime(data).str
-
196130·text·1.2 KB·2006-10-10 10:25 UTC
procedure TForm1.RvSystem1Print(Sender: TObject);
var szamlalo : integer;
valto : boolean;
begin
szamlalo:=1;
valto:=true;
with Sender as TBaseReport do
begin
AdoQuery1.Disable
-
196127·apache·431 B·2006-10-10 10:22 UTC
NameVirtualHost *:80
<VirtualHost *:80>
ServerAdmin root@localhost
DocumentRoot /home/guim/public_html/obm/php
ServerName obm-panthere
ErrorLog /var/log/apache/obm-error.log
-
196125·text·2.0 KB·2006-10-10 10:21 UTC
landell_rtp.c: In function 'landell_rtp_dispose':
landell_rtp.c:158: warning: unused variable 'self'
landell_rtp.c: In function 'landell_rtp_stop':
landell_rtp.c:208: warning: unused variable 'ses
-
196121·text·22.4 KB·2006-10-10 10:15 UTC
X Window System Version 7.1.1
Release Date: 12 May 2006
X Protocol Version 11, Revision 0, Release 7.1.1
Build Operating System: Linux 2.6.15.7 i686
Current Operating System: Linux kristallei-n
-
196111·text·4.7 KB·2006-10-10 09:58 UTC
# /etc/X11/xorg.conf (xorg X Window System server configuration file)
#
# This file was generated by dexconf, the Debian X Configuration tool, using
# values from the debconf database.
#
# Edit t
-
196110·text·17.6 KB·2006-10-10 09:55 UTC
X Window System Version 7.1.1
Release Date: 12 May 2006
X Protocol Version 11, Revision 0, Release 7.1.1
Build Operating System: Linux 2.6.15.7 i686
Current Operating System: Linux kristallei-n
-
196108·text·43.6 KB·2006-10-10 09:54 UTC
-
196104·text·791 B·2006-10-10 09:50 UTC
Probability Factors v1.0
By Rune Jacobsen
CPU found and utilised.
Eating RAM
----> Error 615: Enough memory
----> Error 341: CPU too fast
Initialising CPUSlow 1.1
...done!
Trying to calculat
-
196102·text·756 B·2006-10-10 09:47 UTC
Oct 10 11:46:59 odysseus kernel: usb 1-2: new high speed USB device using ehci_hcd and address 5
Oct 10 11:47:00 odysseus kernel: usb 1-2: configuration #1 chosen from 1 choice
Oct 10 11:47:00 odyss
-
196101·text·467 B·2006-10-10 09:46 UTC
configure:4208: checking for initscr in -lncurses
configure:4243: gcc -o conftest conftest.c -lncurses >&5
configure:4249: $? = 0
configure:4256: test -z "$ac_c_werror_flag" || test ! -s conf
-
196100·text·782 B·2006-10-10 09:41 UTC
root@0[zaptel-1.4]# make menuselect
**************************************************
*** Install ncurses to use the menu interface! ***
**************************************************
menusel
-
196098·php·426 B·2006-10-10 09:37 UTC
$directives = array(
'RewriteRule ^'.$baseUri.'(\d{4})/(\d{2})/(\d{2})$ '.$baseUri.'index.php?controller=weblog&year=$1&month=$2&day=$3 [L]',
'RewriteRule ^'.$baseUri.'users(?:/([a-z]+)(?:/(
-
196090·text·195 B·2006-10-10 09:23 UTC
10-OCT-2006 16:23:27 * log_file * 0
10-OCT-2006 16:23:27 * 1153
TNS-01153: Failed to process string: (CONNECT_DATA=((
echo
echo " WORKING"
echo
NL-00303: syntax error in NV string
-
196089·text·5.5 KB·2006-10-10 09:22 UTC
[Tue Oct 10 05:20:05 2006] [error] Can't locate TWiki/UI/View.pm in @INC (@INC contains: . /usr/local/lib/perl5/5.8.8/i686-linux-thread-multi /usr/local/lib/perl5/5.8.8 /usr/local/lib/perl5/site_perl/
-
196087·perl·2.1 KB·2006-10-10 09:15 UTC
# TWiki Enterprise Collaboration Platform, http://TWiki.org/
#
# This program is free software; you can redistribute it and/or
# modify it under the terms of the GNU General Public License
# as pu
-
196084·text·2.1 KB·2006-10-10 09:06 UTC
PHP Warning: Could not convert item label from UTF-8 in C:\PHP-Gtk2\lib\pear\Gn
ope\PHPGtk2demos\components\stock-browser2.php on line 173
Warning: Could not convert item label from UTF-8 in C:\P
-
196075·text·250 B·2006-10-10 08:54 UTC
:Loading root filesystem module ... -e
ERROR - failed to parse block device name for '/dev/hda1'
--------------------------------------------------
with rootfstype=jfs
it says:
FATAL
-
196070·text·536 B·2006-10-10 08:46 UTC
[oscar@mrmustard ~]$ mkinitcpio -k 2.6.17-beyond -M
Modules autodetected:
cdrom
ide-cd
ide-core
ide-disk
alim15x3
generic
natsemi
bcm43xx
pcmcia_core
rsrc_nonstatic
yenta_socket
usbcore
-
196069·text·2.3 KB·2006-10-10 08:41 UTC
# vim:set ft=sh
# MODULES
# The following modules are loaded before any boot hooks are
# run. Advanced users may wish to specify all system modules
# in this array. For instance:
# MODULES=
-
196064·text·13.1 KB·2006-10-10 08:32 UTC
Θέμα 1 [2]
Οι χρόνοι άφιξης (ΧΑ) στο σύστημα ^
-
196063·text·800 B·2006-10-10 08:31 UTC
lc.server# make install clean
===> Installing for irssi-0.8.10_3
===> irssi-0.8.10_3 depends on executable: irssi-themes - not found
===> Verifying install for irssi-themes in /usr/ports/x11-
-
196062·text·186 B·2006-10-10 08:31 UTC
ipfw add divert 10001 log tcp from me to X.X.X.X
ipfw add divert 10001 log tcp from X.X.X.X 80 to me
natd -l -port 10001 -interface lo0 -reverse -redirect_port tcp 127.0.0.1:10080 80
-
196057·text·613 B·2006-10-10 08:25 UTC
int fin(int nb, int count)
{
int c;
int modulo;
modulo = 1;
c = 1;
while (c != count)
{
modulo = modulo * 10;
c++;
}
my_putchar((nb / modulo) + 48);
-
196056·apache·998 B·2006-10-10 08:25 UTC
#log snip, access log
10.1.30.111 - fire [10/Oct/2006:10:22:04 +0200] "PUT /projects/vw_linkmall/Fire/Test%20Folder/3am_add.swf HTTP/1.1" 201 222 "-" "DataFreeway/1.37.i386 DAV/2 (compatible; Mozil
-
196049·php·231 B·2006-10-10 08:18 UTC
if (isset($_REQUEST['page']) and ctype_digit($_REQUEST['page'])) {
$page = (int)$_REQUEST['page'];
} else {
$page = 666;
}
$posts = get_posts($_REQUEST['page']);
foreach($posts as $pos
-
196042·text·678 B·2006-10-10 08:12 UTC
class store
{
function sale_item($inventory_id, $item_cost, $user_id)
{
}
function buy_item($item_id, $store_id, $user_id)
{
}
function item_info($item_id, $data_info = fals
-
196041·php·96 B·2006-10-10 08:11 UTC
$posts = get_posts(@$_REQUEST['page']);
foreach($posts as $post) {
echo $post['ID'];
}
-
196040·text·1.3 KB·2006-10-10 08:08 UTC
# makefile for POSIX library for Lua
# change these to reflect your Lua installation
LUA= $(TOOLCHAIN)/arm-linux
LUAINC= $(LUA)/include
LUALIB= $(LUA)/lib
LUABIN= $(LUA)/bin
# no need to cha
-
196039·text·1.2 KB·2006-10-10 07:57 UTC
# makefile for POSIX library for Lua
# change these to reflect your Lua installation
LUA= $(TOOLCHAIN)/arm-linux
LUAINC= $(LUA)/include
LUALIB= $(LUA)/lib
LUABIN= $(LUA)/bin
# no need to cha
-
196037·text·762 B·2006-10-10 07:52 UTC
function update_stats($user_id, $stats_array)
{
global $db;
if (!is_array($stats_array))
{
message_die(GAME_ERROR, 'ERROR: Invalid Stats recieved.');
}
$sql_array = array();
foreac
-
196036·text·769 B·2006-10-10 07:51 UTC
function update_stats($user_id, $stats_array)
{
global $db;
if (!is_array($stats_array))
{
message_die(GAME_ERROR, 'ERROR: $stats_array must be an array.');
}
$sql_array = array();
-
196034·text·763 B·2006-10-10 07:51 UTC
function update_stats($user_id, $stats_array)
{
global $db;
if (!is_array($stats_array))
{
message_die(GAME_ERROR, 'ERROR: $stats must be an array.');
}
$sql_array = array();
forea
-
196033·text·759 B·2006-10-10 07:50 UTC
function update_stats($user_id, $stats_array)
{
global $db;
if (!is_array($stats_array))
{
message_die(GAME_ERROR, 'ERROR: $stats must be an array.');
}
$sql_array = array();
forea
-
196028·text·648 B·2006-10-10 07:43 UTC
function update_stats($user_id, $stats)
{
if (!is_array($stats))
trigger_error('$stats must be an array', E_USER_ERROR);
$sql_array = array();
foreach ($stats as $k=>$v)
{
if (is_int(
-
196026·text·3.0 KB·2006-10-10 07:41 UTC
// are we moving images up or down?
for (i = 0; i < len; i++)
{
if ( drop_targets[i] == target_img )
{
above = true;
hold_index = i;
break;
} else if ( drop_targets[
-
196024·text·455 B·2006-10-10 07:39 UTC
function update_stats($user_id, $stats)
{
if (!is_array($stats))
trigger_error('$stats must be an array', E_USER_ERROR);
$sql_array = array();
foreach ($stats as $k=>$v)
{
$sql_array[
-
196023·php·726 B·2006-10-10 07:36 UTC
function registerRoutes() {
$registry = Registry::getInstance();
$app = $registry->get('application');
$site = $registry->get('site');
$app->addRoute('user', new Uri(array
-
196022·text·452 B·2006-10-10 07:34 UTC
function update_stats ( $user_id, $stats_array )
{
global $db;
$_i = count($stats_array);
$i = 1;
$sql .= "UPDATE beta_users_stats SET ";
foreach($stats_array as $stat => $value )
{
-
196021·php·427 B·2006-10-10 07:34 UTC
function registerActions() {
$registry = Registry::getInstance();
$app = $registry->get('application');
$app->registerAction('POST', __CLASS__, 'login');
$app->registerAction('
-
196017·php·519 B·2006-10-10 07:30 UTC
$registry = Registry::getInstance();
$registry->set('application', new Application(dirname(__FILE__)));
$registry->set('site', new Site);
foreach ( Registry::getInstance()->get('application')->
-
196009·text·48 B·2006-10-10 07:07 UTC
+mailman:mailman:1012:108:/usr/local/mailman:-::
-
196008·text·621 B·2006-10-10 07:02 UTC
DB Error (Inserting into dd_schedule):
Query was:
INSERT INTO dd_schedule (programid,stationid,scheduletime,duration,repeat,stereo,subtitled,hdtv,closecaptioned,tvrating,partnumber,parttotal,endtime
-
196005·text·1.8 KB·2006-10-10 06:41 UTC
<!DOCTYPE html
PUBLIC "-//W3C//DTD XHTML 1.0 Strict//EN"
"http://www.w3.org/TR/xhtml1/DTD/xhtml1-strict.dtd">
<html xmlns="http://www.w3.org/1999/xhtml" lang="en" xml:lang="en">
<head><?cs
-
196004·text·8.1 KB·2006-10-10 06:41 UTC
....
[ 25%] Building C object CMakeFiles/doomsday.dir/external/lzss/unix/src/lzss.o
/usr/bin/gcc -m32 -I/usr/include/SDL -I/home/nick/Programming/deng/doomsday/external/lzss/portable/include -I/hom
-
196003·bash·542 B·2006-10-10 06:41 UTC
[root@localhost 160a]# freevo
Error: VIDEO_SHOW_DATA_DIR not found
failed to load plugin video.mplayer
start 'freevo plugins -l' to get a list of plugins
Traceback (most recent call last):
File
-
195999·c·832 B·2006-10-10 06:34 UTC
void loadProfile (gint profileNumber)
{
gchar *settingsfile=g_strconcat(g_get_home_dir(),"/.beryl/settings",NULL);
gchar *profilefile=g_strconcat(g_get_home_dir(),profiles[profileNumber],NU
-
195995·text·4.2 KB·2006-10-10 06:24 UTC
root@admin-desktop:~# sudo apt-get update
Get:1 http://security.ubuntu.com dapper-security Release.gpg [191B]
Hit http://security.ubuntu.com dapper-security Release
Hit http://security.ubuntu.com d
-
195994·text·140 B·2006-10-10 06:21 UTC
October 2006
Su Mo Tu We Th Fr Sa
1 2 3 4 5 6 7
8 9 10 11 12 13 14
15 16 17 18 19 20 21
22 23 24 25 26 27 28
29 30 31
-
195993·text·140 B·2006-10-10 06:20 UTC
October 2006
Su Mo Tu We Th Fr Sa
1 2 3 4 5 6 7
8 9 10 11 12 13 14
15 16 17 18 19 20 21
22 23 24 25 26 27 28
29 30 31
-
195992·text·1.2 KB·2006-10-10 06:19 UTC
function update_primary_stats ( $user_id, $strength = 0, $speed = 0, $dexterity = 0, $intelligence = 0, $leadership = 0, $communication = 0, $stamina = 0, $defense = 0, $stealth = 0, $respect = 0, $en
-
195990·nasm·278 B·2006-10-10 06:14 UTC
; name Pr6
org 0
Pr6a:
mov R0, #8
mov R1, #1h
mov R2, #16
uloz:
mov @R0, 1
inc R0
inc R1
djnz R2, uloz
Pr6b:
mov R0, #8h
mov R1, #18h
mov R2, #16
prenes:
mov a, @R0
-
195982·bash·5.0 KB·2006-10-10 06:02 UTC
#! /bin/bash
### BEGIN INIT INFO
# Provides: tor
# Required-Start: $local_fs, $remote_fs, $network, $named, $time
# Required-Stop: $local_fs, $remote_fs, $network, $named, $time
-
195972·text·771 B·2006-10-10 05:55 UTC
dan@ubuntu:~$ sudo apt-get install build-essential
Reading package lists... Done
Building dependency tree... Done
Some packages could not be installed. This may mean that you have
requested an imp
-
195971·php·1.4 KB·2006-10-10 05:55 UTC
<? function show_form($email="",$message="",$subject="") { ?>
<h2>Send Me an E-mail</h2>
<form action="<?echo $_SERVER[PHP_SELF]; ?>" method="post">
Your E-mail address:<br>
<input type=text
-
195970·text·126 B·2006-10-10 05:55 UTC
Errors were encountered while processing:
nautilus
ubuntu-desktop
E: Sub-process /usr/bin/dpkg returned an error code (1)
-
195969·text·126 B·2006-10-10 05:54 UTC
Errors were encountered while processing:
nautilus
ubuntu-desktop
E: Sub-process /usr/bin/dpkg returned an error code (1)
-
195967·text·5.4 KB·2006-10-10 05:48 UTC
#!/bin/bash
# Version 1.0, initial release!
# Remember, the -h option (and making a mistake) gives a usage summary!
#
# Firewire channel changing and test script, re-written by fryfrog at gmail.co
-
195966·text·2.6 KB·2006-10-10 05:48 UTC
[01:47:09] [Kinya]: INFO(255) for Kinya (YTVrZZ46) in #azureus-support - 2.5.0.0 installed in c:\progra~1\azureus\ using SWT 3232/win32 - Windows XP Service Pack 2 5.1 x86
[01:47:12] [Kinya]: Java: 1
-
195965·text·8.7 KB·2006-10-10 05:47 UTC
import impsoft.ibot.methods.Script;
import java.awt.event.MouseListener;
import java.lang.reflect.Field;
import java.lang.reflect.Method;
import java.lang.reflect.Modifier;
import java.net.URL;
-
195953·text·539 B·2006-10-10 05:27 UTC
LABEL=/ / ext3 defaults 1 1
devpts /dev/pts devpts gid=5,mode=620 0 0
tmpfs /dev/shm
-
195950·text·456 B·2006-10-10 05:26 UTC
torify ssh 66.0.59.58 -v
OpenSSH_4.3p2, OpenSSL 0.9.8a 11 Oct 2005
debug1: Reading configuration data /etc/ssh/ssh_config
debug1: Applying options for *
debug1: Connecting to 66.0.59.58 [66.0.59.5
-
195948·text·82 B·2006-10-10 05:26 UTC
cp /usr/share/doc/tsocks-1.8/tsocks.conf.simple.example /etc/tor/tor-tsocks.conf
-
195947·text·539 B·2006-10-10 05:23 UTC
LABEL=/ / ext3 defaults 1 1
devpts /dev/pts devpts gid=5,mode=620 0 0
tmpfs /dev/shm
-
195944·text·327 B·2006-10-10 05:18 UTC
<Momo81> tienes porblemas con alsa?
<Momo81> inetnta esto
<Momo81> si no le reconoce alsa es q no esta dele alsa espcio tab si no pues isntale #apt-get install alsa-base alsa-utils alsa-oss y luego
-
195930·text·614 B·2006-10-10 05:00 UTC
########################################
# Name : generate_los
# Type : Class Method
# Usage : $maze->generate_los()
# Purpose : Generates a LOS for the bot.
# Returns :
-
195926·text·583 B·2006-10-10 04:51 UTC
sub new {
my ($class, $height, $width) = shift @_;
my $self = bless {}, $class;
$self->{height} = $height;
$self->{width} = $width;
$self->{bot_coord} = [0,0];
# The
-
195915·text·3.2 KB·2006-10-10 04:37 UTC
[00:35:45] [Kinya_]: INFO(255) for Kinya_ (YTVrZZ46) in #azureus-support - 2.5.0.0 installed in c:\progra~1\azureus\ using SWT 3232/win32 - Windows XP Service Pack 2 5.1 x86
[00:35:48] [Kinya_]: Java
-
195913·text·449 B·2006-10-10 04:36 UTC
[outbound]
exten => _Z1NXXNXXXXXX,1,Set(TRUNK=${EXTEN:0:1})
exten => _Z1NXXNXXXXXX,n,Set(TRUNK=${IF(${TRUNK}=5?SIP/broadband/+)})
exten => _Z1NXXNXXXXXX,n,Set(TRUNK=${IF(${TRUNK}=6?ZAP/1/)})
exten
-
195911·text·252 B·2006-10-10 04:35 UTC
[root@myhost wine]# git bisect start
[root@myhost wine]# git bisect bad
[root@myhost wine]# git bisect good wine-0.9.22
Bisecting: 196 revisions left to test after this
[c41a9784bf3e57bbc6dec0f1c8