All pastes #196125 Raw Edit

Landellbuild

public text v1 · immutable
·published 2006-10-10 10:21 UTC
rendered paste body
 landell_rtp.c: In function 'landell_rtp_dispose':
landell_rtp.c:158: warning: unused variable 'self'
landell_rtp.c: In function 'landell_rtp_stop':
landell_rtp.c:208: warning: unused variable 'session'
landell_rtp.c: In function 'landell_rtp_stream_init':
landell_rtp.c:331: warning: unused variable 'codec'
landell_rtp.c: In function 'landell_rtp_close_stream':
landell_rtp.c:401: error: 'FARSIGHT_STREAM_STATE_STOPPED' undeclared (first use in this function)
landell_rtp.c:401: error: (Each undeclared identifier is reported only once
landell_rtp.c:401: error: for each function it appears in.)
landell_rtp.c: In function 'new_active_candidate_pair':
landell_rtp.c:448: warning: unused variable 'self'
landell_rtp.c: In function 'new_native_candidate':
landell_rtp.c:479: warning: unused variable 'password'
landell_rtp.c:479: warning: unused variable 'username'
landell_rtp.c:475: warning: unused variable 'priv'
landell_rtp.c: In function 'state_changed':
landell_rtp.c:550: error: 'FARSIGHT_STREAM_STATE_STOPPED' undeclared (first use in this function)
landell_rtp.c:554: error: 'FARSIGHT_STREAM_STATE_PLAYING' undeclared (first use in this function)
landell_rtp.c:549: warning: enumeration value 'FARSIGHT_STREAM_STATE_DISCONNECTED' not handled in switch
landell_rtp.c:549: warning: enumeration value 'FARSIGHT_STREAM_STATE_CONNECTING' not handled in switch
landell_rtp.c:549: warning: enumeration value 'FARSIGHT_STREAM_STATE_CONNECTED' not handled in switch
landell_rtp.c: In function 'landell_rtp_destroy':
landell_rtp.c:642: warning: passing argument 1 of 'g_object_run_dispose' from incompatible pointer type
make[3]: *** [landell_rtp.lo] Error 1
make[3]: Leaving directory `/home/build/rpmbuild/BUILD/landell-0.2.0/rtp'
make[2]: *** [all] Error 2
make[2]: Leaving directory `/home/build/rpmbuild/BUILD/landell-0.2.0/rtp'
make[1]: *** [all-recursive] Error 1
make[1]: Leaving directory `/home/build/rpmbuild/BUILD/landell-0.2.0'
make: *** [all] Error 2
error: Bad exit status from /var/tmp/rpm-tmp.21893 (%build)