rendered paste bodymake[1]: Entering directory `/home/htpc/SVN/mythtv/programs'
cd mythtv/ && make -f Makefile
make[2]: Entering directory `/home/htpc/SVN/mythtv/programs/mythtv'
make[2]: Nothing to be done for `first'.
make[2]: Leaving directory `/home/htpc/SVN/mythtv/programs/mythtv'
cd mythfrontend/ && make -f Makefile
make[2]: Entering directory `/home/htpc/SVN/mythtv/programs/mythfrontend'
sh "/home/htpc/SVN/mythtv/version.sh" "/home/htpc/SVN/mythtv" ": http://svn.mythtv.org/svn/trunk/mythtv/version.pro "
g++ -o mythfrontend version.o main.o manualbox.o playbackbox.o viewscheduled.o globalsettings.o manualschedule.o programrecpriority.o channelrecpriority.o statusbox.o networkcontrol.o mediarenderer.o mythfexml.o custompriority.o mythappearance.o moc_manualbox.o moc_playbackbox.o moc_viewscheduled.o moc_globalsettings.o moc_manualschedule.o moc_programrecpriority.o moc_channelrecpriority.o moc_statusbox.o moc_networkcontrol.o moc_custompriority.o moc_mythappearance.o -L/usr/lib -L../../libs/libmyth -L../../libs/libmythtv -L../../libs/libavutil -L../../libs/libavcodec -L../../libs/libavformat -L../../libs/libmythfreemheg -L../../libs/libmythui -L../../libs/libmythupnp -L../../libs/libmythlivemedia -lmythtv-0.22 -lmythavformat-0.22 -lmythavutil-0.22 -lmythavcodec-0.22 -lmythfreemheg-0.22 -lmythupnp-0.22 -lmythlivemedia-0.22 -lmyth-0.22 -lmythui-0.22 -lfreetype -lz -lmp3lame -lasound -L/usr/X11R6/lib -L/usr/X11R6/lib -lXinerama -lXv -lX11 -lXext -lXxf86vm -lXrandr -lXvMCW -lXvMC -lGL -lGLU -lpthread -lGLU -lGL -lQt3Support -lQtSql -lQtXml -lQtOpenGL -lQtGui -lQtNetwork -lQtCore
mythappearance.o: In function `MythAppearance::keyPressEvent(QKeyEvent*)':
mythappearance.cpp:(.text+0x2a45): undefined reference to `MythScreenType::keyPressEvent(QKeyEvent*)'
collect2: ld returned 1 exit status
make[2]: *** [mythfrontend] Error 1
make[2]: Leaving directory `/home/htpc/SVN/mythtv/programs/mythfrontend'
make[1]: *** [sub-mythfrontend-make_default] Error 2
make[1]: Leaving directory `/home/htpc/SVN/mythtv/programs'
make: *** [sub-programs-make_default-ordered] Error 2