All pastes #995817 Raw Edit

Unnamed

public text v1 · immutable
#995817 ·published 2008-04-24 14:47 UTC
rendered paste body
powa:/home/leaker/eth32nix/etdos/etdos# make
cd zzip && make                             
make[1]: Entering directory `/home/leaker/eth32nix/etdos/etdos/zzip'
gcc -I.. -Os -D_USE_MMAP -fomit-frame-pointer -Wall -Wstrict-prototypes -c -o zip.o zip.c
In file included from ../zzip/zzip.h:22,                                                 
                 from ../zzip/lib.h:21,                                                  
                 from zip.c:14:                                                          
../zzip/types.h:30:23: error: zzip/conf.h: No such file or directory                     
In file included from ../zzip/zzip.h:22,                                                 
                 from ../zzip/lib.h:21,                                                  
                 from zip.c:14:                                                          
../zzip/types.h:40: error: expected ‘=’, ‘,’, ‘;’, ‘asm’ or ‘__attribute__’ before ‘zzip_off64_t’
../zzip/types.h:41: error: expected ‘=’, ‘,’, ‘;’, ‘asm’ or ‘__attribute__’ before ‘zzip_off_t’  
../zzip/types.h:42: error: expected ‘=’, ‘,’, ‘;’, ‘asm’ or ‘__attribute__’ before ‘zzip_size_t’ 
../zzip/types.h:43: error: expected ‘=’, ‘,’, ‘;’, ‘asm’ or ‘__attribute__’ before ‘zzip_ssize_t’
In file included from ../zzip/lib.h:21,                                                          
                 from zip.c:14:                                                                  
../zzip/zzip.h:77: error: expected ‘=’, ‘,’, ‘;’, ‘asm’ or ‘__attribute__’ before ‘*’ token      
../zzip/zzip.h:78: error: expected ‘=’, ‘,’, ‘;’, ‘asm’ or ‘__attribute__’ before ‘zzip_char_t’  
../zzip/zzip.h:97: error: expected ‘=’, ‘,’, ‘;’, ‘asm’ or ‘__attribute__’ before ‘zzip_char_t’  
../zzip/zzip.h:99: error: expected ‘=’, ‘,’, ‘;’, ‘asm’ or ‘__attribute__’ before ‘zzip_char_t’  
../zzip/zzip.h:101: error: expected ‘=’, ‘,’, ‘;’, ‘asm’ or ‘__attribute__’ before ‘int’         
../zzip/zzip.h:110: error: expected ‘=’, ‘,’, ‘;’, ‘asm’ or ‘__attribute__’ before ‘int’         
../zzip/zzip.h:112: error: expected ‘=’, ‘,’, ‘;’, ‘asm’ or ‘__attribute__’ before ‘void’        
../zzip/zzip.h:114: error: expected ‘=’, ‘,’, ‘;’, ‘asm’ or ‘__attribute__’ before ‘zzip_char_t’ 
../zzip/zzip.h:117: error: expected ‘=’, ‘,’, ‘;’, ‘asm’ or ‘__attribute__’ before ‘ZZIP_DIR’    
../zzip/zzip.h:119: error: expected ‘=’, ‘,’, ‘;’, ‘asm’ or ‘__attribute__’ before ‘int’         
../zzip/zzip.h:121: error: expected ‘=’, ‘,’, ‘;’, ‘asm’ or ‘__attribute__’ before ‘int’         
../zzip/zzip.h:123: error: expected ‘=’, ‘,’, ‘;’, ‘asm’ or ‘__attribute__’ before ‘int’         
../zzip/zzip.h:125: error: expected ‘=’, ‘,’, ‘;’, ‘asm’ or ‘__attribute__’ before ‘void’        
../zzip/zzip.h:127: error: expected ‘=’, ‘,’, ‘;’, ‘asm’ or ‘__attribute__’ before ‘int’         
../zzip/zzip.h:134: error: expected ‘=’, ‘,’, ‘;’, ‘asm’ or ‘__attribute__’ before ‘ZZIP_DIR’    
../zzip/zzip.h:136: error: expected ‘=’, ‘,’, ‘;’, ‘asm’ or ‘__attribute__’ before ‘int’         
../zzip/zzip.h:143: error: expected ‘=’, ‘,’, ‘;’, ‘asm’ or ‘__attribute__’ before ‘ZZIP_DIR’    
../zzip/zzip.h:145: error: expected ‘=’, ‘,’, ‘;’, ‘asm’ or ‘__attribute__’ before ‘ZZIP_DIR’    
../zzip/zzip.h:147: error: expected ‘=’, ‘,’, ‘;’, ‘asm’ or ‘__attribute__’ before ‘int’                                                  
../zzip/zzip.h:149: error: expected ‘=’, ‘,’, ‘;’, ‘asm’ or ‘__attribute__’ before ‘int’                                                  
../zzip/zzip.h:158: error: expected ‘=’, ‘,’, ‘;’, ‘asm’ or ‘__attribute__’ before ‘ZZIP_DIR’                                             
../zzip/zzip.h:160: error: expected ‘=’, ‘,’, ‘;’, ‘asm’ or ‘__attribute__’ before ‘int’                                                  
../zzip/zzip.h:162: error: expected ‘=’, ‘,’, ‘;’, ‘asm’ or ‘__attribute__’ before ‘ZZIP_DIRENT’                                          
../zzip/zzip.h:164: error: expected ‘=’, ‘,’, ‘;’, ‘asm’ or ‘__attribute__’ before ‘void’                                                 
../zzip/zzip.h:166: error: expected ‘=’, ‘,’, ‘;’, ‘asm’ or ‘__attribute__’ before ‘zzip_off_t’                                           
../zzip/zzip.h:168: error: expected ‘=’, ‘,’, ‘;’, ‘asm’ or ‘__attribute__’ before ‘void’                                                 
../zzip/zzip.h:175: error: expected ‘=’, ‘,’, ‘;’, ‘asm’ or ‘__attribute__’ before ‘ZZIP_FILE’                                            
../zzip/zzip.h:177: error: expected ‘=’, ‘,’, ‘;’, ‘asm’ or ‘__attribute__’ before ‘int’                                                  
../zzip/zzip.h:179: error: expected ‘=’, ‘,’, ‘;’, ‘asm’ or ‘__attribute__’ before ‘zzip_ssize_t’                                         
../zzip/zzip.h:182: error: expected ‘=’, ‘,’, ‘;’, ‘asm’ or ‘__attribute__’ before ‘ZZIP_FILE’                                            
../zzip/zzip.h:184: error: expected ‘=’, ‘,’, ‘;’, ‘asm’ or ‘__attribute__’ before ‘int’                                                  
../zzip/zzip.h:186: error: expected ‘=’, ‘,’, ‘;’, ‘asm’ or ‘__attribute__’ before ‘zzip_ssize_t’                                         
../zzip/zzip.h:193: error: expected ‘=’, ‘,’, ‘;’, ‘asm’ or ‘__attribute__’ before ‘ZZIP_FILE’                                            
../zzip/zzip.h:195: error: expected ‘=’, ‘,’, ‘;’, ‘asm’ or ‘__attribute__’ before ‘ZZIP_FILE’                                            
../zzip/zzip.h:197: error: expected ‘=’, ‘,’, ‘;’, ‘asm’ or ‘__attribute__’ before ‘zzip_size_t’                                          
../zzip/zzip.h:200: error: expected ‘=’, ‘,’, ‘;’, ‘asm’ or ‘__attribute__’ before ‘int’                                                  
../zzip/zzip.h:206: error: expected ‘=’, ‘,’, ‘;’, ‘asm’ or ‘__attribute__’ before ‘int’                                                  
../zzip/zzip.h:208: error: expected ‘=’, ‘,’, ‘;’, ‘asm’ or ‘__attribute__’ before ‘zzip_off_t’                                           
../zzip/zzip.h:210: error: expected ‘=’, ‘,’, ‘;’, ‘asm’ or ‘__attribute__’ before ‘zzip_off_t’                                           
../zzip/zzip.h:217: error: expected ‘=’, ‘,’, ‘;’, ‘asm’ or ‘__attribute__’ before ‘int’                                                  
../zzip/zzip.h:220: error: expected ‘=’, ‘,’, ‘;’, ‘asm’ or ‘__attribute__’ before ‘int’                                                  
../zzip/zzip.h:222: error: expected ‘=’, ‘,’, ‘;’, ‘asm’ or ‘__attribute__’ before ‘int’                                                  
../zzip/zzip.h:236: error: expected ‘=’, ‘,’, ‘;’, ‘asm’ or ‘__attribute__’ before ‘*’ token                                              
../zzip/zzip.h:239: error: expected ‘=’, ‘,’, ‘;’, ‘asm’ or ‘__attribute__’ before ‘ZZIP_FILE’                                            
../zzip/zzip.h:244: error: expected ‘=’, ‘,’, ‘;’, ‘asm’ or ‘__attribute__’ before ‘ZZIP_FILE’                                            
../zzip/zzip.h:248: error: expected ‘=’, ‘,’, ‘;’, ‘asm’ or ‘__attribute__’ before ‘ZZIP_DIR’                                             
../zzip/zzip.h:252: error: expected ‘=’, ‘,’, ‘;’, ‘asm’ or ‘__attribute__’ before ‘ZZIP_DIR’                                             
In file included from ../zzip/lib.h:22,                                                                                                   
                 from zip.c:14:                                                                                                           
../zzip/plugin.h:45: error: expected ‘)’ before ‘*’ token                                                                                 
../zzip/plugin.h:46: error: expected ‘;’ before ‘int’                                                                                     
../zzip/plugin.h:74: error: expected ‘=’, ‘,’, ‘;’, ‘asm’ or ‘__attribute__’ before ‘zzip_off_t’                                          
../zzip/plugin.h:78: error: expected ‘=’, ‘,’, ‘;’, ‘asm’ or ‘__attribute__’ before ‘zzip_plugin_io_t’                                    
../zzip/plugin.h:87: error: expected ‘=’, ‘,’, ‘;’, ‘asm’ or ‘__attribute__’ before ‘int’                                                 
In file included from ../zzip/lib.h:23,                                                                                                   
                 from zip.c:14:                                                                                                           
../zzip/stdint.h:28:5: error: #error unable to typedef int16_t from either int or short                                                   
../zzip/stdint.h:37:5: error: #error unable to typedef int32_t from either int or long                                                    
In file included from ../zzip/lib.h:23,                                                                                                   
                 from zip.c:14:                                                                                                           
../zzip/stdint.h:38: error: conflicting types for ‘int32_t’                                                                               
/usr/include/sys/types.h:197: error: previous declaration of ‘int32_t’ was here                                                           
../zzip/stdint.h:41: error: expected ‘=’, ‘,’, ‘;’, ‘asm’ or ‘__attribute__’ before ‘uint64_t’                                            
../zzip/stdint.h:41: error: expected ‘=’, ‘,’, ‘;’, ‘asm’ or ‘__attribute__’ before ‘int64_t’                                             
In file included from zip.c:14:                                                                                                           
../zzip/lib.h:66: error: expected specifier-qualifier-list before ‘zzip_strings_t’                                                        
../zzip/lib.h:73: error: expected ‘)’ before ‘*’ token                                                                                    
../zzip/lib.h:81: error: expected declaration specifiers or ‘...’ before ‘zzip_strings_t’                                                 
../zzip/lib.h:81: warning: type defaults to ‘int’ in declaration of ‘zzip_plugin_io_t’                                                    
../zzip/lib.h:81: error: expected ‘;’, ‘,’ or ‘)’ before ‘io’                                                                             
../zzip/lib.h:84: error: expected ‘)’ before ‘*’ token                                                                                    
In file included from zip.c:15:                                                                                                           
../zzip/file.h:68: error: expected specifier-qualifier-list before ‘zzip_size_t’                                                          
In file included from zip.c:16:                                                                                                           
../zzip/format.h:37: error: expected declaration specifiers or ‘...’ before ‘(’ token                                                     
../zzip/format.h:37: warning: function declaration isn’t a prototype                                                                      
../zzip/format.h:43: error: expected declaration specifiers or ‘...’ before ‘(’ token                                                     
../zzip/format.h:43: warning: function declaration isn’t a prototype                                                                      
../zzip/format.h:43: error: conflicting types for ‘__zzip_attribute__’                                                                    
../zzip/format.h:37: error: previous declaration of ‘__zzip_attribute__’ was here                                                         
../zzip/format.h:77: error: expected declaration specifiers or ‘...’ before ‘(’ token                                                     
../zzip/format.h:77: warning: function declaration isn’t a prototype                                                                      
../zzip/format.h:77: error: conflicting types for ‘__zzip_attribute__’                                                                    
../zzip/format.h:37: error: previous declaration of ‘__zzip_attribute__’ was here                                                         
../zzip/format.h:93: error: expected declaration specifiers or ‘...’ before ‘(’ token                                                     
../zzip/format.h:93: warning: function declaration isn’t a prototype                                                                      
../zzip/format.h:93: error: conflicting types for ‘__zzip_attribute__’                                                                    
../zzip/format.h:37: error: previous declaration of ‘__zzip_attribute__’ was here                                                         
../zzip/format.h:127: error: expected declaration specifiers or ‘...’ before ‘(’ token                                                    
../zzip/format.h:127: warning: function declaration isn’t a prototype                                                                     
../zzip/format.h:127: error: conflicting types for ‘__zzip_attribute__’                                                                   
../zzip/format.h:37: error: previous declaration of ‘__zzip_attribute__’ was here                                                         
../zzip/format.h:151: error: expected declaration specifiers or ‘...’ before ‘(’ token                                                    
../zzip/format.h:151: warning: function declaration isn’t a prototype                                                                     
../zzip/format.h:151: error: conflicting types for ‘__zzip_attribute__’                                                                   
../zzip/format.h:37: error: previous declaration of ‘__zzip_attribute__’ was here                                                         
../zzip/format.h:169: error: expected declaration specifiers or ‘...’ before ‘(’ token                                                    
../zzip/format.h:169: warning: function declaration isn’t a prototype                                                                     
../zzip/format.h:169: error: conflicting types for ‘__zzip_attribute__’                                                                   
../zzip/format.h:37: error: previous declaration of ‘__zzip_attribute__’ was here                                                         
../zzip/format.h:177: error: expected declaration specifiers or ‘...’ before ‘(’ token                                                    
../zzip/format.h:177: warning: function declaration isn’t a prototype                                                                     
../zzip/format.h:177: error: conflicting types for ‘__zzip_attribute__’                                                                   
../zzip/format.h:37: error: previous declaration of ‘__zzip_attribute__’ was here                                                         
../zzip/format.h:197: error: expected declaration specifiers or ‘...’ before ‘(’ token                                                    
../zzip/format.h:197: warning: function declaration isn’t a prototype                                                                     
../zzip/format.h:197: error: conflicting types for ‘__zzip_attribute__’                                                                   
../zzip/format.h:37: error: previous declaration of ‘__zzip_attribute__’ was here                                                         
In file included from zip.c:17:                                                                                                           
../zzip/fetch.h: In function ‘__zzip_get32’:                                                                                              
../zzip/fetch.h:18: error: expected declaration specifiers before ‘__zzip_attribute__’                                                    
../zzip/fetch.h:19: error: expected ‘=’, ‘,’, ‘;’, ‘asm’ or ‘__attribute__’ before ‘__zzip_attribute__’                                   
../zzip/fetch.h:20: error: storage class specified for parameter ‘__zzip_set32’                                                           
../zzip/fetch.h:21: error: storage class specified for parameter ‘__zzip_set16’                                                           
../zzip/fetch.h:23: error: expected ‘=’, ‘,’, ‘;’, ‘asm’ or ‘__attribute__’ before ‘__zzip_get64’                                         
../zzip/fetch.h:24: error: expected declaration specifiers or ‘...’ before ‘uint64_t’                                                     
../zzip/fetch.h:24: error: storage class specified for parameter ‘__zzip_set64’                                                           
In file included from zip.c:19:                                                                                                           
/usr/include/ctype.h:82: error: storage class specified for parameter ‘__ctype_b_loc’                                                     
/usr/include/ctype.h:84: error: storage class specified for parameter ‘__ctype_tolower_loc’                                               
/usr/include/ctype.h:86: error: storage class specified for parameter ‘__ctype_toupper_loc’                                               
/usr/include/ctype.h:102: error: storage class specified for parameter ‘isalnum’                                                          
/usr/include/ctype.h:103: error: storage class specified for parameter ‘isalpha’                                                          
/usr/include/ctype.h:104: error: storage class specified for parameter ‘iscntrl’                                                          
/usr/include/ctype.h:105: error: storage class specified for parameter ‘isdigit’                                                          
/usr/include/ctype.h:106: error: storage class specified for parameter ‘islower’                                                          
/usr/include/ctype.h:107: error: storage class specified for parameter ‘isgraph’                                                          
/usr/include/ctype.h:108: error: storage class specified for parameter ‘isprint’                                                          
/usr/include/ctype.h:109: error: storage class specified for parameter ‘ispunct’                                                          
/usr/include/ctype.h:110: error: storage class specified for parameter ‘isspace’                                                          
/usr/include/ctype.h:111: error: storage class specified for parameter ‘isupper’                                                          
/usr/include/ctype.h:112: error: storage class specified for parameter ‘isxdigit’                                                         
/usr/include/ctype.h:116: error: storage class specified for parameter ‘tolower’                                                          
/usr/include/ctype.h:119: error: storage class specified for parameter ‘toupper’                                                          
/usr/include/ctype.h:142: error: storage class specified for parameter ‘isascii’                                                          
/usr/include/ctype.h:146: error: storage class specified for parameter ‘toascii’                                                          
/usr/include/ctype.h:150: error: storage class specified for parameter ‘_toupper’                                                         
/usr/include/ctype.h:151: error: storage class specified for parameter ‘_tolower’                                                         
In file included from /usr/include/errno.h:36,                                                                                            
                 from zip.c:20:                                                                                                           
/usr/include/bits/errno.h:43: error: storage class specified for parameter ‘__errno_location’                                             
In file included from zip.c:21:                                                                                                           
/usr/include/stdlib.h:102: error: storage class specified for parameter ‘div_t’                                                           
/usr/include/stdlib.h:110: error: storage class specified for parameter ‘ldiv_t’                                                          
/usr/include/stdlib.h:140: error: storage class specified for parameter ‘__ctype_get_mb_cur_max’                                          
/usr/include/stdlib.h:146: error: storage class specified for parameter ‘atof’                                                            
/usr/include/stdlib.h:149: error: storage class specified for parameter ‘atoi’                                                            
/usr/include/stdlib.h:152: error: storage class specified for parameter ‘atol’                                                            
/usr/include/stdlib.h:158: error: expected declaration specifiers before ‘__extension__’                                                  
/usr/include/stdlib.h:167: error: storage class specified for parameter ‘strtod’                                                          
/usr/include/stdlib.h:186: error: storage class specified for parameter ‘strtol’                                                          
/usr/include/stdlib.h:190: error: storage class specified for parameter ‘strtoul’                                                         
/usr/include/stdlib.h:195: error: expected declaration specifiers before ‘__extension__’                                                  
/usr/include/stdlib.h:200: error: expected declaration specifiers before ‘__extension__’                                                  
/usr/include/stdlib.h:209: error: expected declaration specifiers before ‘__extension__’                                                  
/usr/include/stdlib.h:214: error: expected declaration specifiers before ‘__extension__’                                                  
/usr/include/stdlib.h:311: error: storage class specified for parameter ‘l64a’                                                            
/usr/include/stdlib.h:315: error: storage class specified for parameter ‘a64l’                                                            
/usr/include/stdlib.h:327: error: storage class specified for parameter ‘random’                                                          
/usr/include/stdlib.h:330: error: storage class specified for parameter ‘srandom’                                                         
/usr/include/stdlib.h:337: error: storage class specified for parameter ‘initstate’                                                       
/usr/include/stdlib.h:341: error: storage class specified for parameter ‘setstate’                                                        
/usr/include/stdlib.h:361: error: storage class specified for parameter ‘random_r’                                                        
/usr/include/stdlib.h:364: error: storage class specified for parameter ‘srandom_r’                                                       
/usr/include/stdlib.h:369: error: storage class specified for parameter ‘initstate_r’                                                     
/usr/include/stdlib.h:373: error: storage class specified for parameter ‘setstate_r’                                                      
/usr/include/stdlib.h:380: error: storage class specified for parameter ‘rand’                                                            
/usr/include/stdlib.h:382: error: storage class specified for parameter ‘srand’                                                           
/usr/include/stdlib.h:387: error: storage class specified for parameter ‘rand_r’                                                          
/usr/include/stdlib.h:395: error: storage class specified for parameter ‘drand48’                                                         
/usr/include/stdlib.h:396: error: storage class specified for parameter ‘erand48’                                                         
/usr/include/stdlib.h:399: error: storage class specified for parameter ‘lrand48’                                                         
/usr/include/stdlib.h:401: error: storage class specified for parameter ‘nrand48’                                                         
/usr/include/stdlib.h:404: error: storage class specified for parameter ‘mrand48’                                                         
/usr/include/stdlib.h:406: error: storage class specified for parameter ‘jrand48’                                                         
/usr/include/stdlib.h:409: error: storage class specified for parameter ‘srand48’                                                         
/usr/include/stdlib.h:411: error: storage class specified for parameter ‘seed48’                                                          
/usr/include/stdlib.h:412: error: storage class specified for parameter ‘lcong48’                                                         
/usr/include/stdlib.h:429: error: storage class specified for parameter ‘drand48_r’                                                       
/usr/include/stdlib.h:432: error: storage class specified for parameter ‘erand48_r’                                                       
/usr/include/stdlib.h:437: error: storage class specified for parameter ‘lrand48_r’                                                       
/usr/include/stdlib.h:441: error: storage class specified for parameter ‘nrand48_r’                                                       
/usr/include/stdlib.h:446: error: storage class specified for parameter ‘mrand48_r’                                                       
/usr/include/stdlib.h:450: error: storage class specified for parameter ‘jrand48_r’                                                       
/usr/include/stdlib.h:454: error: storage class specified for parameter ‘srand48_r’                                                       
/usr/include/stdlib.h:457: error: storage class specified for parameter ‘seed48_r’                                                        
/usr/include/stdlib.h:461: error: storage class specified for parameter ‘lcong48_r’                                                       
/usr/include/stdlib.h:471: error: storage class specified for parameter ‘malloc’                                                          
/usr/include/stdlib.h:474: error: storage class specified for parameter ‘calloc’                                                          
/usr/include/stdlib.h:486: error: storage class specified for parameter ‘realloc’                                                         
/usr/include/stdlib.h:488: error: storage class specified for parameter ‘free’                                                            
/usr/include/stdlib.h:493: error: storage class specified for parameter ‘cfree’                                                           
In file included from /usr/include/stdlib.h:497,                                                                                          
                 from zip.c:21:                                                                                                           
/usr/include/alloca.h:33: error: storage class specified for parameter ‘alloca’                                                           
In file included from zip.c:21:                                                                                                           
/usr/include/stdlib.h:502: error: storage class specified for parameter ‘valloc’                                                          
/usr/include/stdlib.h:508: error: storage class specified for parameter ‘posix_memalign’                                                  
/usr/include/stdlib.h:513: error: storage class specified for parameter ‘abort’                                                           
/usr/include/stdlib.h:517: error: storage class specified for parameter ‘atexit’                                                          
/usr/include/stdlib.h:524: error: storage class specified for parameter ‘on_exit’                                                         
/usr/include/stdlib.h:531: error: storage class specified for parameter ‘exit’                                                            
/usr/include/stdlib.h:545: error: storage class specified for parameter ‘getenv’                                                          
/usr/include/stdlib.h:551: error: storage class specified for parameter ‘__secure_getenv’                                                 
/usr/include/stdlib.h:557: error: storage class specified for parameter ‘putenv’                                                          
/usr/include/stdlib.h:564: error: storage class specified for parameter ‘setenv’                                                          
/usr/include/stdlib.h:567: error: storage class specified for parameter ‘unsetenv’                                                        
/usr/include/stdlib.h:574: error: storage class specified for parameter ‘clearenv’                                                        
/usr/include/stdlib.h:583: error: storage class specified for parameter ‘mktemp’                                                          
/usr/include/stdlib.h:594: error: storage class specified for parameter ‘mkstemp’                                                         
/usr/include/stdlib.h:614: error: storage class specified for parameter ‘mkdtemp’                                                         
/usr/include/stdlib.h:645: error: storage class specified for parameter ‘system’                                                          
/usr/include/stdlib.h:663: error: storage class specified for parameter ‘realpath’                                                        
/usr/include/stdlib.h:670: error: storage class specified for parameter ‘__compar_fn_t’                                                   
/usr/include/stdlib.h:681: error: expected declaration specifiers or ‘...’ before ‘__compar_fn_t’                                         
/usr/include/stdlib.h:682: error: storage class specified for parameter ‘bsearch’                                                         
/usr/include/stdlib.h:682: error: nonnull argument with out-of-range operand number (argument 1, operand 5)                               
/usr/include/stdlib.h:687: error: expected declaration specifiers or ‘...’ before ‘__compar_fn_t’                                         
/usr/include/stdlib.h:687: error: storage class specified for parameter ‘qsort’                                                           
/usr/include/stdlib.h:687: error: nonnull argument with out-of-range operand number (argument 1, operand 4)                               
/usr/include/stdlib.h:691: error: storage class specified for parameter ‘abs’                                                             
/usr/include/stdlib.h:692: error: storage class specified for parameter ‘labs’                                                            
/usr/include/stdlib.h:705: error: expected ‘=’, ‘,’, ‘;’, ‘asm’ or ‘__attribute__’ before ‘div’                                           
/usr/include/stdlib.h:707: error: expected ‘=’, ‘,’, ‘;’, ‘asm’ or ‘__attribute__’ before ‘ldiv’                                          
/usr/include/stdlib.h:728: error: storage class specified for parameter ‘ecvt’                                                            
/usr/include/stdlib.h:734: error: storage class specified for parameter ‘fcvt’                                                            
/usr/include/stdlib.h:740: error: storage class specified for parameter ‘gcvt’                                                            
/usr/include/stdlib.h:747: error: storage class specified for parameter ‘qecvt’                                                           
/usr/include/stdlib.h:750: error: storage class specified for parameter ‘qfcvt’                                                           
/usr/include/stdlib.h:752: error: storage class specified for parameter ‘qgcvt’                                                           
/usr/include/stdlib.h:759: error: storage class specified for parameter ‘ecvt_r’                                                          
/usr/include/stdlib.h:762: error: storage class specified for parameter ‘fcvt_r’                                                          
/usr/include/stdlib.h:767: error: storage class specified for parameter ‘qecvt_r’                                                         
/usr/include/stdlib.h:771: error: storage class specified for parameter ‘qfcvt_r’                                                         
/usr/include/stdlib.h:779: error: storage class specified for parameter ‘mblen’                                                           
/usr/include/stdlib.h:783: error: storage class specified for parameter ‘mbtowc’                                                          
/usr/include/stdlib.h:786: error: storage class specified for parameter ‘wctomb’                                                          
/usr/include/stdlib.h:791: error: storage class specified for parameter ‘mbstowcs’                                                        
/usr/include/stdlib.h:795: error: storage class specified for parameter ‘wcstombs’                                                        
/usr/include/stdlib.h:804: error: storage class specified for parameter ‘rpmatch’                                                         
/usr/include/stdlib.h:832: error: storage class specified for parameter ‘posix_openpt’                                                    
/usr/include/stdlib.h:868: error: storage class specified for parameter ‘getloadavg’                                                      
In file included from zip.c:22:                                                                                                           
/usr/include/string.h:40: error: storage class specified for parameter ‘memcpy’                                                           
/usr/include/string.h:44: error: storage class specified for parameter ‘memmove’                                                          
/usr/include/string.h:53: error: storage class specified for parameter ‘memccpy’                                                          
/usr/include/string.h:59: error: storage class specified for parameter ‘memset’                                                           
/usr/include/string.h:63: error: storage class specified for parameter ‘memcmp’                                                           
/usr/include/string.h:67: error: storage class specified for parameter ‘memchr’                                                           
/usr/include/string.h:85: error: storage class specified for parameter ‘strcpy’                                                           
/usr/include/string.h:89: error: storage class specified for parameter ‘strncpy’                                                          
/usr/include/string.h:93: error: storage class specified for parameter ‘strcat’                                                           
/usr/include/string.h:96: error: storage class specified for parameter ‘strncat’                                                          
/usr/include/string.h:100: error: storage class specified for parameter ‘strcmp’                                                          
/usr/include/string.h:103: error: storage class specified for parameter ‘strncmp’                                                         
/usr/include/string.h:107: error: storage class specified for parameter ‘strcoll’                                                         
/usr/include/string.h:111: error: storage class specified for parameter ‘strxfrm’                                                         
/usr/include/string.h:131: error: storage class specified for parameter ‘strdup’                                                          
/usr/include/string.h:168: error: storage class specified for parameter ‘strchr’
/usr/include/string.h:171: error: storage class specified for parameter ‘strrchr’
/usr/include/string.h:185: error: storage class specified for parameter ‘strcspn’
/usr/include/string.h:189: error: storage class specified for parameter ‘strspn’
/usr/include/string.h:192: error: storage class specified for parameter ‘strpbrk’
/usr/include/string.h:195: error: storage class specified for parameter ‘strstr’
/usr/include/string.h:200: error: storage class specified for parameter ‘strtok’
/usr/include/string.h:208: error: storage class specified for parameter ‘__strtok_r’
/usr/include/string.h:212: error: storage class specified for parameter ‘strtok_r’
/usr/include/string.h:243: error: storage class specified for parameter ‘strlen’
/usr/include/string.h:256: error: storage class specified for parameter ‘strerror’
/usr/include/string.h:270: error: storage class specified for parameter ‘strerror_r’
/usr/include/string.h:294: error: storage class specified for parameter ‘__bzero’
/usr/include/string.h:299: error: storage class specified for parameter ‘bcopy’
/usr/include/string.h:302: error: storage class specified for parameter ‘bzero’
/usr/include/string.h:306: error: storage class specified for parameter ‘bcmp’
/usr/include/string.h:310: error: storage class specified for parameter ‘index’
/usr/include/string.h:314: error: storage class specified for parameter ‘rindex’
/usr/include/string.h:318: error: storage class specified for parameter ‘ffs’
/usr/include/string.h:332: error: storage class specified for parameter ‘strcasecmp’
/usr/include/string.h:336: error: storage class specified for parameter ‘strncasecmp’
/usr/include/string.h:356: error: storage class specified for parameter ‘strsep’
zip.c:51: error: expected specifier-qualifier-list before ‘zzip_off64_t’
zip.c:55: warning: empty declaration
zip.c:80: error: expected declaration specifiers or ‘...’ before ‘zzip_off_t’
zip.c:81: error: expected ‘;’, ‘,’ or ‘)’ before ‘trailer’
zip.c:86: error: expected declaration specifiers or ‘...’ before ‘zzip_plugin_io_t’
zip.c:88: error: expected declaration specifiers before ‘_zzip_inline’
zip.c:171: error: expected declaration specifiers or ‘...’ before ‘zzip_off_t’
zip.c:172: error: expected ‘;’, ‘,’ or ‘)’ before ‘trailer’
zip.c:345: error: expected declaration specifiers before ‘_zzip_inline’
zip.c:363: error: expected declaration specifiers or ‘...’ before ‘zzip_plugin_io_t’
zip.c:364: error: expected ‘=’, ‘,’, ‘;’, ‘asm’ or ‘__attribute__’ before ‘{’ token
zip.c:500: error: expected ‘=’, ‘,’, ‘;’, ‘asm’ or ‘__attribute__’ before ‘*’ token
zip.c:526: error: expected ‘)’ before ‘*’ token
zip.c:545: error: expected ‘)’ before ‘*’ token
zip.c:562: error: expected ‘=’, ‘,’, ‘;’, ‘asm’ or ‘__attribute__’ before ‘{’ token
zip.c:582: error: expected ‘=’, ‘,’, ‘;’, ‘asm’ or ‘__attribute__’ before ‘{’ token
zip.c:598: error: expected ‘=’, ‘,’, ‘;’, ‘asm’ or ‘__attribute__’ before ‘{’ token
zip.c:602: error: storage class specified for parameter ‘__zzip_dir_parse’
zip.c:610: error: expected declaration specifiers or ‘...’ before ‘zzip_strings_t’
zip.c:610: warning: type defaults to ‘int’ in declaration of ‘zzip_plugin_io_t’
zip.c:610: error: expected ‘;’, ‘,’ or ‘)’ before ‘io’
zip.c:635: error: expected ‘=’, ‘,’, ‘;’, ‘asm’ or ‘__attribute__’ before ‘{’ token
zip.c:675: error: expected ‘)’ before ‘*’ token
zip.c:703: error: expected ‘)’ before ‘*’ token
zip.c:713: error: expected ‘)’ before ‘*’ token
zip.c:745: error: expected ‘=’, ‘,’, ‘;’, ‘asm’ or ‘__attribute__’ before ‘{’ token
zip.c:762: error: old-style parameter declarations in prototyped function definition
zip.c:762: error: expected ‘{’ at end of input
zip.c:762: warning: no return statement in function returning non-void
make[1]: *** [all] Error 1
make[1]: Leaving directory `/home/leaker/eth32nix/etdos/etdos/zzip'
make: *** [all] Error 2
powa:/home/leaker/eth32nix/etdos/etdos#