CC libpthread/linuxthreads.old/attr.os
In file included from libpthread/linuxthreads.old/internals.h:30,
from libpthread/linuxthreads.old/attr.c:26:
./libpthread/linuxthreads.old/sysdeps/alpha/pt-machine.h:31:22: error: asm/pal.h: No such file or directory
In file included from libpthread/linuxthreads.old/internals.h:30,
from libpthread/linuxthreads.old/attr.c:26:
./libpthread/linuxthreads.old/sysdeps/alpha/pt-machine.h:42: error: invalid register name for 'stack_pointer'
In file included from ./include/sys/procfs.h:31,
from libpthread/linuxthreads.old/../linuxthreads.old_db/proc_service.h:20,
from libpthread/linuxthreads.old/../linuxthreads.old_db/thread_dbP.h:9,
from libpthread/linuxthreads.old/internals.h:32,
from libpthread/linuxthreads.old/attr.c:26:
./include/sys/user.h:27:21: error: asm/reg.h: No such file or directory
In file included from ./include/sys/procfs.h:31,
from libpthread/linuxthreads.old/../linuxthreads.old_db/proc_service.h:20,
from libpthread/linuxthreads.old/../linuxthreads.old_db/thread_dbP.h:9,
from libpthread/linuxthreads.old/internals.h:32,
from libpthread/linuxthreads.old/attr.c:26:
./include/sys/user.h:31: error: 'EF_SIZE' undeclared here (not in a function)
In file included from /System/Links/Headers/asm/elf.h:9,
from ./include/sys/procfs.h:32,
from libpthread/linuxthreads.old/../linuxthreads.old_db/proc_service.h:20,
from libpthread/linuxthreads.old/../linuxthreads.old_db/thread_dbP.h:9,
from libpthread/linuxthreads.old/internals.h:32,
from libpthread/linuxthreads.old/attr.c:26:
/System/Links/Headers/asm/user.h:90: error: redefinition of 'struct user'
In file included from libpthread/linuxthreads.old/attr.c:26:
libpthread/linuxthreads.old/internals.h: In function 'thread_self':
libpthread/linuxthreads.old/internals.h:388: error: 'PAL_rduniq' undeclared (first use in this function)
libpthread/linuxthreads.old/internals.h:388: error: (Each undeclared identifier is reported only once
libpthread/linuxthreads.old/internals.h:388: error: for each function it appears in.)
make: *** [libpthread/linuxthreads.old/attr.os] Error 1
Compile: Build failed