All pastes #994283 Raw Edit

Anonymous

public text v1 · immutable
#994283 ·published 2008-04-23 08:22 UTC
rendered paste body
cc -MM  -Wdisabled-optimization -Wno-pointer-sign -Wdeclaration-after-statement -I. -I.. -I../libavutil -Wall -Wno-switch -Wpointer-arith -Wredundant-decls -O4 -march=native -mtune=native -pipe -ffast-math -fomit-frame-pointer -D_REENTRANT -D_LARGEFILE_SOURCE -D_FILE_OFFSET_BITS=64 -D_LARGEFILE64_SOURCE -DHAVE_CONFIG_H -I/usr/include/directfb   -I/usr/include/freetype2 -I/usr/include -fno-omit-frame-pointer -mno-omit-leaf-frame-pointer driver.c afl.c vfl.c dshow/DS_AudioDecoder.c dshow/DS_Filter.c dshow/DS_VideoDecoder.c dshow/allocator.c dshow/mediatype.c dshow/cmediasample.c dshow/guids.c dshow/inputpin.c dshow/outputpin.c dmo/DMO_AudioDecoder.c dmo/DMO_VideoDecoder.c dmo/buffer.c dmo/dmo.c dmo/dmo_guids.c | sed "s,[0-9a-z._-]*: \([a-z0-9/]*/\)[^/]* ,\1&," > .depend
In file included from wine/winbase.h:5,
                 from win32.h:12,
                 from driver.c:18:
wine/winnt.h:623:2: error: #error You need to define a CONTEXT for your CPU
wine/winnt.h:750:2: error: #error You need to define DEFINE_REGS_ENTRYPOINT macros for your CPU
wine/winnt.h:761:3: error: #error You must define GET_IP for this CPU
In file included from wine/winbase.h:5,
                 from afl.c:27:
wine/winnt.h:623:2: error: #error You need to define a CONTEXT for your CPU
wine/winnt.h:750:2: error: #error You need to define DEFINE_REGS_ENTRYPOINT macros for your CPU
wine/winnt.h:761:3: error: #error You must define GET_IP for this CPU
In file included from wine/winbase.h:5,
                 from win32.h:12,
                 from vfl.c:14:
wine/winnt.h:623:2: error: #error You need to define a CONTEXT for your CPU
wine/winnt.h:750:2: error: #error You need to define DEFINE_REGS_ENTRYPOINT macros for your CPU
wine/winnt.h:761:3: error: #error You must define GET_IP for this CPU
In file included from ./wine/winbase.h:5,
                 from ./wine/winreg.h:7,
                 from dshow/libwin32.h:10,
                 from dshow/DS_AudioDecoder.c:9:
./wine/winnt.h:623:2: error: #error You need to define a CONTEXT for your CPU
./wine/winnt.h:750:2: error: #error You need to define DEFINE_REGS_ENTRYPOINT macros for your CPU
./wine/winnt.h:761:3: error: #error You must define GET_IP for this CPU
In file included from ./wine/pe_image.h:4,
                 from ./wine/module.h:11,
                 from dshow/guids.h:14,
                 from dshow/iunk.h:9,
                 from dshow/interfaces.h:10,
                 from dshow/inputpin.h:4,
                 from dshow/DS_Filter.h:4,
                 from dshow/DS_Filter.c:7:
./wine/winnt.h:623:2: error: #error You need to define a CONTEXT for your CPU
./wine/winnt.h:750:2: error: #error You need to define DEFINE_REGS_ENTRYPOINT macros for your CPU
./wine/winnt.h:761:3: error: #error You must define GET_IP for this CPU
In file included from ./wine/pe_image.h:4,
                 from ./wine/module.h:11,
                 from dshow/guids.h:14,
                 from dshow/DS_VideoDecoder.c:8:
./wine/winnt.h:623:2: error: #error You need to define a CONTEXT for your CPU
./wine/winnt.h:750:2: error: #error You need to define DEFINE_REGS_ENTRYPOINT macros for your CPU
./wine/winnt.h:761:3: error: #error You must define GET_IP for this CPU
In file included from ./wine/pe_image.h:4,
                 from ./wine/module.h:11,
                 from dshow/guids.h:14,
                 from dshow/iunk.h:9,
                 from dshow/interfaces.h:10,
                 from dshow/allocator.h:4,
                 from dshow/allocator.c:7:
./wine/winnt.h:623:2: error: #error You need to define a CONTEXT for your CPU
./wine/winnt.h:750:2: error: #error You need to define DEFINE_REGS_ENTRYPOINT macros for your CPU
./wine/winnt.h:761:3: error: #error You must define GET_IP for this CPU
In file included from ./wine/pe_image.h:4,
                 from ./wine/module.h:11,
                 from dshow/guids.h:14,
                 from dshow/mediatype.h:10,
                 from dshow/mediatype.c:27:
./wine/winnt.h:623:2: error: #error You need to define a CONTEXT for your CPU
./wine/winnt.h:750:2: error: #error You need to define DEFINE_REGS_ENTRYPOINT macros for your CPU
./wine/winnt.h:761:3: error: #error You must define GET_IP for this CPU
In file included from ./wine/pe_image.h:4,
                 from ./wine/module.h:11,
                 from dshow/guids.h:14,
                 from dshow/iunk.h:9,
                 from dshow/interfaces.h:10,
                 from dshow/cmediasample.h:4,
                 from dshow/cmediasample.c:6:
./wine/winnt.h:623:2: error: #error You need to define a CONTEXT for your CPU
./wine/winnt.h:750:2: error: #error You need to define DEFINE_REGS_ENTRYPOINT macros for your CPU
./wine/winnt.h:761:3: error: #error You must define GET_IP for this CPU
In file included from ./wine/pe_image.h:4,
                 from ./wine/module.h:11,
                 from dshow/guids.h:14,
                 from dshow/guids.c:1:
./wine/winnt.h:623:2: error: #error You need to define a CONTEXT for your CPU
./wine/winnt.h:750:2: error: #error You need to define DEFINE_REGS_ENTRYPOINT macros for your CPU
./wine/winnt.h:761:3: error: #error You must define GET_IP for this CPU
In file included from ./wine/pe_image.h:4,
                 from ./wine/module.h:11,
                 from dshow/guids.h:14,
                 from dshow/iunk.h:9,
                 from dshow/interfaces.h:10,
                 from dshow/inputpin.h:4,
                 from dshow/inputpin.c:6:
./wine/winnt.h:623:2: error: #error You need to define a CONTEXT for your CPU
./wine/winnt.h:750:2: error: #error You need to define DEFINE_REGS_ENTRYPOINT macros for your CPU
./wine/winnt.h:761:3: error: #error You must define GET_IP for this CPU
In file included from ./wine/pe_image.h:4,
                 from ./wine/module.h:11,
                 from dshow/guids.h:14,
                 from dshow/iunk.h:9,
                 from dshow/interfaces.h:10,
                 from dshow/allocator.h:4,
                 from dshow/outputpin.h:6,
                 from dshow/outputpin.c:8:
./wine/winnt.h:623:2: error: #error You need to define a CONTEXT for your CPU
./wine/winnt.h:750:2: error: #error You need to define DEFINE_REGS_ENTRYPOINT macros for your CPU
./wine/winnt.h:761:3: error: #error You must define GET_IP for this CPU
In file included from ./wine/winbase.h:5,
                 from ./wine/winreg.h:7,
                 from ./dshow/libwin32.h:10,
                 from dmo/DMO_AudioDecoder.c:8:
./wine/winnt.h:623:2: error: #error You need to define a CONTEXT for your CPU
./wine/winnt.h:750:2: error: #error You need to define DEFINE_REGS_ENTRYPOINT macros for your CPU
./wine/winnt.h:761:3: error: #error You must define GET_IP for this CPU
In file included from ./wine/pe_image.h:4,
                 from ./wine/module.h:11,
                 from ./dshow/guids.h:14,
                 from dmo/DMO_VideoDecoder.c:8:
./wine/winnt.h:623:2: error: #error You need to define a CONTEXT for your CPU
./wine/winnt.h:750:2: error: #error You need to define DEFINE_REGS_ENTRYPOINT macros for your CPU
./wine/winnt.h:761:3: error: #error You must define GET_IP for this CPU
In file included from ./wine/pe_image.h:4,
                 from ./wine/module.h:11,
                 from ./dshow/guids.h:14,
                 from dmo/dmo_guids.h:4,
                 from dmo/DMO_Filter.h:4,
                 from dmo/buffer.c:1:
./wine/winnt.h:623:2: error: #error You need to define a CONTEXT for your CPU
./wine/winnt.h:750:2: error: #error You need to define DEFINE_REGS_ENTRYPOINT macros for your CPU
./wine/winnt.h:761:3: error: #error You must define GET_IP for this CPU
In file included from ./wine/pe_image.h:4,
                 from ./wine/module.h:11,
                 from ./dshow/guids.h:14,
                 from dmo/dmo_guids.h:4,
                 from dmo/DMO_Filter.h:4,
                 from dmo/dmo.c:7:
./wine/winnt.h:623:2: error: #error You need to define a CONTEXT for your CPU
./wine/winnt.h:750:2: error: #error You need to define DEFINE_REGS_ENTRYPOINT macros for your CPU
./wine/winnt.h:761:3: error: #error You must define GET_IP for this CPU
In file included from ./wine/pe_image.h:4,
                 from ./wine/module.h:11,
                 from ./dshow/guids.h:14,
                 from dmo/dmo_guids.h:4,
                 from dmo/dmo_guids.c:1:
./wine/winnt.h:623:2: error: #error You need to define a CONTEXT for your CPU
./wine/winnt.h:750:2: error: #error You need to define DEFINE_REGS_ENTRYPOINT macros for your CPU
./wine/winnt.h:761:3: error: #error You must define GET_IP for this CPU
make[1]: Leaving directory `/home/rune/apps/mplayer/mplayer/loader'
make[1]: Entering directory `/home/rune/apps/mplayer/mplayer/loader'
cc  -Wdisabled-optimization -Wno-pointer-sign -Wdeclaration-after-statement -I. -I.. -I../libavutil -Wall -Wno-switch -Wpointer-arith -Wredundant-decls -O4 -march=native -mtune=native -pipe -ffast-math -fomit-frame-pointer -D_REENTRANT -D_LARGEFILE_SOURCE -D_FILE_OFFSET_BITS=64 -D_LARGEFILE64_SOURCE -DHAVE_CONFIG_H -I/usr/include/directfb   -I/usr/include/freetype2 -I/usr/include -fno-omit-frame-pointer -mno-omit-leaf-frame-pointer   -c -o driver.o driver.c
In file included from wine/winbase.h:5,
                 from win32.h:12,
                 from driver.c:18:
wine/winnt.h:623:2: error: #error You need to define a CONTEXT for your CPU
In file included from wine/winbase.h:5,
                 from win32.h:12,
                 from driver.c:18:
wine/winnt.h:626: error: expected '=', ',', ';', 'asm' or '__attribute__' before '*' token
wine/winnt.h:750:2: error: #error You need to define DEFINE_REGS_ENTRYPOINT macros for your CPU
wine/winnt.h:761:3: error: #error You must define GET_IP for this CPU
wine/winnt.h:1015: error: expected specifier-qualifier-list before 'PCONTEXT'
wine/winnt.h:1028: error: expected declaration specifiers or '...' before 'PCONTEXT'
In file included from win32.h:12,
                 from driver.c:18:
wine/winbase.h:544: warning: 'packed' attribute ignored for field of type 'CHAR[8]'
In file included from win32.h:12,
                 from driver.c:18:
wine/winbase.h:1338: error: expected declaration specifiers or '...' before 'CONTEXT'
wine/winbase.h:1477: warning: type defaults to 'int' in declaration of 'CONTEXT'
wine/winbase.h:1477: error: expected ';', ',' or ')' before '*' token
In file included from win32.h:13,
                 from driver.c:18:
com.h:53: warning: '__stdcall__' attribute ignored
com.h:54: warning: '__stdcall__' attribute ignored
com.h:55: warning: '__stdcall__' attribute ignored
com.h:65: warning: '__stdcall__' attribute ignored
com.h:66: warning: '__stdcall__' attribute ignored
com.h:67: warning: '__stdcall__' attribute ignored
com.h:68: warning: '__stdcall__' attribute ignored
com.h:83: warning: '__stdcall__' attribute ignored
com.h:84: warning: '__stdcall__' attribute ignored
com.h:85: warning: '__stdcall__' attribute ignored
In file included from driver.c:20:
wine/pe_image.h:60: warning: 'packed' attribute ignored for field of type 'BYTE'
wine/pe_image.h:62: warning: 'packed' attribute ignored for field of type 'BYTE'
wine/pe_image.h:64: warning: 'packed' attribute ignored for field of type 'BYTE'
wine/pe_image.h:66: warning: 'packed' attribute ignored for field of type 'BYTE'
wine/pe_image.h:67: warning: 'packed' attribute ignored for field of type 'BYTE'
wine/pe_image.h:69: warning: 'packed' attribute ignored for field of type 'BYTE'
driver.c: In function 'SendDriverMessage':
driver.c:91: warning: cast to pointer from integer of different size
driver.c: In function 'DrvClose':
driver.c:126: warning: cast to pointer from integer of different size
driver.c: In function 'DrvOpen':
driver.c:173: warning: cast from pointer to integer of different size
driver.c:182: warning: cast from pointer to integer of different size
driver.c:187: warning: cast from pointer to integer of different size
driver.c:189: warning: cast from pointer to integer of different size
driver.c:194: warning: cast from pointer to integer of different size
driver.c:198: warning: cast from pointer to integer of different size
make[1]: *** [driver.o] Error 1
make[1]: Leaving directory `/home/rune/apps/mplayer/mplayer/loader'
make: *** [recurse] Error 2