All pastes #994279 Raw Edit

Stuff

public text v1 · immutable
#994279 ·published 2008-04-23 08:20 UTC
rendered paste body
make  
make  all-recursive
make[1]: Entering directory `/home/chitransh/checkout/gnome2/gconf'
Making all in gconf
make[2]: Entering directory `/home/chitransh/checkout/gnome2/gconf/gconf'
make  all-am
make[3]: Entering directory `/home/chitransh/checkout/gnome2/gconf/gconf'
/bin/sh ../libtool --tag=CC   --mode=link gcc  -g -O2 -Wall   -o gconf-sanity-check-2 gconf-sanity-check.o   -Wl,--export-dynamic -pthread -L/opt/gnome2/lib -lORBit-2 -lgthread-2.0 -lrt -lgtk-x11-2.0 -lgdk-x11-2.0 -latk-1.0 -lgdk_pixbuf-2.0 -lpangocairo-1.0 -lpango-1.0 -lcairo -lgobject-2.0 -lgmodule-2.0 -ldl -lglib-2.0 -lxml2   libgconf-2.la 
gcc -g -O2 -Wall -o .libs/gconf-sanity-check-2 gconf-sanity-check.o -Wl,--export-dynamic -pthread  -L/opt/gnome2/lib /usr/lib/libgtk-x11-2.0.so /usr/lib/libgdk-x11-2.0.so /opt/gnome2/lib/libatk-1.0.so /usr/lib/libgdk_pixbuf-2.0.so /usr/lib/libgmodule-2.0.so /usr/lib/libgobject-2.0.so /usr/lib/libglib-2.0.so /opt/gnome2/lib/libpangocairo-1.0.so /opt/gnome2/lib/libpangoft2-1.0.so /opt/gnome2/lib/libpango-1.0.so /opt/gnome2/lib/libcairo.so /opt/gnome2/lib/libfontconfig.so /usr/lib/libfreetype.so -lexpat /usr/lib/libpng12.so /usr/lib/libXrender.so /usr/lib/libX11.so /usr/lib/libxcb-xlib.so /usr/lib/libxcb.so /usr/lib/libXau.so /opt/gnome2/lib/libpixman-1.so /opt/gnome2/lib/libxml2.so -lz -lm ./.libs/libgconf-2.so /opt/gnome2/lib/libORBit-2.so /opt/gnome2/lib/libgmodule-2.0.so -ldl /opt/gnome2/lib/libgthread-2.0.so -lpthread -lrt /opt/gnome2/lib/libgobject-2.0.so /opt/gnome2/lib/libglib-2.0.so  -Wl,--rpath -Wl,/opt/gnome2/lib
/opt/gnome2/lib/libatk-1.0.so: undefined reference to `g_assertion_message_expr'
/opt/gnome2/lib/libpango-1.0.so: undefined reference to `g_assertion_message'
collect2: ld returned 1 exit status
make[3]: *** [gconf-sanity-check-2] Error 1
make[3]: Leaving directory `/home/chitransh/checkout/gnome2/gconf/gconf'
make[2]: *** [all] Error 2
make[2]: Leaving directory `/home/chitransh/checkout/gnome2/gconf/gconf'
make[1]: *** [all-recursive] Error 1
make[1]: Leaving directory `/home/chitransh/checkout/gnome2/gconf'
make: *** [all] Error 2
*** error during stage build of gconf: ########## Error running make   *** [21/56]

  [1] rerun stage build
  [2] ignore error and continue to install
  [3] give up on module
  [4] start shell
  [5] go to stage force_checkout
  [6] go to stage configure
  [7] go to stage force_clean
  [8] go to stage force_distclean
choice: