All pastes #993659 Raw Edit

Unnamed

public text v1 · immutable
#993659 ·published 2008-04-22 19:37 UTC
rendered paste body
nvidia-installer log file '/var/log/nvidia-installer.log'
creation time: Tue Apr 22 20:25:42 2008

option status:
  license pre-accepted    : false
  update                  : false
  force update            : false
  expert                  : false
  uninstall               : false
  driver info             : false
  precompiled interfaces  : true
  no ncurses color        : false
  query latest version    : false
  OpenGL header files     : true
  no questions            : false
  silent                  : false
  no recursion            : false
  no backup               : false
  kernel module only      : false
  sanity                  : false
  add this kernel         : false
  no runlevel check       : false
  no network              : false
  no ABI note             : false
  no RPMs                 : false
  no kernel module        : false
  force SELinux           : default
  no X server check       : false
  force tls               : (not specified)
  force compat32 tls      : (not specified)
  X install prefix        : (not specified)
  X library install path  : (not specified)
  X module install path   : (not specified)
  OpenGL install prefix   : (not specified)
  OpenGL install libdir   : (not specified)
  compat32 install chroot : (not specified)
  compat32 install prefix : (not specified)
  compat32 install libdir : (not specified)
  utility install prefix  : (not specified)
  utility install libdir  : (not specified)
  doc install prefix      : (not specified)
  kernel name             : (not specified)
  kernel include path     : (not specified)
  kernel source path      : (not specified)
  kernel output path      : (not specified)
  kernel install path     : (not specified)
  proc mount point        : /proc
  ui                      : (not specified)
  tmpdir                  : /tmp
  ftp mirror              : ftp://download.nvidia.com
  RPM file list           : (not specified)

Unable to load: nvidia-installer ncurses user interface

Using built-in stream user interface
WARNING: Skipping the runlevel check (the utility `runlevel` failed to run).
-> License accepted.
-> No precompiled kernel interface was found to match your kernel; would you li
   ke the installer to attempt to download a kernel interface for your kernel f
   rom the NVIDIA ftp site (ftp://download.nvidia.com)? (Answer: No)
-> No precompiled kernel interface was found to match your kernel; this means
   that the installer will need to compile a new kernel interface.
-> Performing CC sanity check with CC="cc".
-> Performing CC version check with CC="cc".
-> The CC version check failed:
   
   The compiler used to compile the kernel (gcc 4.1) does not exactly match the
   current compiler (gcc 4.2).  The Linux 2.6 kernel module loader rejects kern
   el modules built with a version of gcc that does not exactly match that of t
   he compiler used to build the running kernel.
   
   If you know what you are doing and want to ignore the gcc version check, sel
   ect "No" to continue installation.  Otherwise, select "Yes" to abort install
   ation, set the CC environment variable to the name of the compiler used to c
   ompile your kernel, and restart installation.  Abort now? (Answer: No)
-> Kernel source path: '/usr/src/linux'
-> Kernel output path: '/usr/src/linux'
-> Performing rivafb check.
-> Performing nvidiafb check.
-> Performing Xen check.
-> Cleaning kernel module build directory.
   executing: 'cd ./usr/src/nv; make clean'...
   rm -f -f nv.o nv-vm.o os-agp.o os-interface.o os-registry.o nv-i2c.o nvacpi.
   o nv.o nv-vm.o os-agp.o os-interface.o os-registry.o nv-i2c.o nvacpi.o nvidi
   a.mod.o
   rm -f -f build-in.o nv-linux.o *.d .*.{cmd,flags}
   rm -f -f nvidia.{o,ko,mod.{o,c}} nv_compiler.h *~
   rm -f -f stprof stprof.o symtab.h Modules.symvers
   rm -f -rf .tmp_versions
   rm -f Makefile
-> Building kernel module:
   executing: 'cd ./usr/src/nv; make module SYSSRC=/usr/src/linux SYSOUT=/usr/s
   rc/linux'...
   sh ./conftest.sh "cc" "cc" /usr/src/linux /usr/src/linux cc_sanity_check ful
   l_output
   sh ./conftest.sh "cc" "cc" /usr/src/linux /usr/src/linux select_makefile ful
   l_output
   make --no-print-directory -f Makefile module
   
   NVIDIA: calling KBUILD...
   make CC=cc  KBUILD_VERBOSE=1 -C /usr/src/linux SUBDIRS=/tmp/selfgz2660/NVIDI
   A-Linux-x86_64-100.14.11-pkg2/usr/src/nv modules
   test -e include/linux/autoconf.h -a -e include/config/auto.conf || (		\
   	echo;								\
   	echo "  ERROR: Kernel configuration is invalid.";		\
   	echo "         include/linux/autoconf.h or include/config/auto.conf are mis
   sing.";	\
   	echo "         Run 'make oldconfig && make prepare' on kernel src to fix it
   .";	\
   	echo;								\
   	/bin/false)
   mkdir -p /tmp/selfgz2660/NVIDIA-Linux-x86_64-100.14.11-pkg2/usr/src/nv/.tmp_
   versions
   rm -f /tmp/selfgz2660/NVIDIA-Linux-x86_64-100.14.11-pkg2/usr/src/nv/.tmp_ver
   sions/*
   make -f scripts/Makefile.build obj=/tmp/selfgz2660/NVIDIA-Linux-x86_64-100.1
   4.11-pkg2/usr/src/nv
   echo \#define NV_COMPILER \"`cc -v 2>&1 | tail -n 1`\" > /tmp/selfgz2660/NVI
   DIA-Linux-x86_64-100.14.11-pkg2/usr/src/nv/nv_compiler.h
     cc -Wp,-MD,/tmp/selfgz2660/NVIDIA-Linux-x86_64-100.14.11-pkg2/usr/src/nv/.
   nv.o.d  -nostdinc -isystem /usr/lib/gcc/i486-linux-gnu/4.2.3/include -D__KER
   NEL__ -Iinclude  -include include/linux/autoconf.h -Wall -Wundef -Wstrict-pr
   ototypes -Wno-trigraphs -fno-strict-aliasing -fno-common -Os  -m64 -mno-red-
   zone -mcmodel=kernel -pipe -Wno-sign-compare -fno-asynchronous-unwind-tables
   -funit-at-a-time -mno-sse -mno-mmx -mno-sse2 -mno-3dnow -maccumulate-outgoin
   g-args -DCONFIG_AS_CFI=1 -DCONFIG_AS_CFI_SIGNAL_FRAME=1 -fomit-frame-pointer
    -fno-stack-protector -Wdeclaration-after-statement -Wno-pointer-sign -I/tmp
   /selfgz2660/NVIDIA-Linux-x86_64-100.14.11-pkg2/usr/src/nv -Wall -Wimplicit -
   Wreturn-type -Wswitch -Wformat -Wchar-subscripts -Wparentheses -Wpointer-ari
   th  -Wno-multichar  -Werror  -O -fno-common -msoft-float -mcmodel=kernel -mn
   o-red-zone        -MD   -Wsign-compare -Wno-cast-qual -Wno-error -D_LOOSE_KE
   RNEL_NAMES -D__KERNEL__ -DMO
   DULE  -DNVRM -DNV_VERSION_STRING=\"100.14.11\" -UDEBUG -U_DEBUG -DNDEBUG -DN
   V_SIGNAL_STRUCT_RLIM -DNV_MULTIPLE_BRIDGE_AGPGART_PRESENT -DNV_PCI_GET_CLASS
   _PRESENT -DNV_SYSCTL_MAX_MAP_COUNT_PRESENT -DNV_PM_MESSAGE_T_PRESENT -DNV_PC
   I_CHOOSE_STATE_PRESENT -DNV_VM_INSERT_PAGE_PRESENT -DNV_OLD_MM_KGDB_BREAKPOI
   NT_PRESENT -DNV_REMAP_PFN_RANGE_PRESENT -DNV_CHANGE_PAGE_ATTR_PRESENT -DNV_A
   CQUIRE_CONSOLE_SEM_PRESENT -DNV_VMAP_4_PRESENT  -DMODULE -D"KBUILD_STR(s)=#s
   " -D"KBUILD_BASENAME=KBUILD_STR(nv)"  -D"KBUILD_MODNAME=KBUILD_STR(nvidia)" 
   -c -o /tmp/selfgz2660/NVIDIA-Linux-x86_64-100.14.11-pkg2/usr/src/nv/.tmp_nv.
   o /tmp/selfgz2660/NVIDIA-Linux-x86_64-100.14.11-pkg2/usr/src/nv/nv.c
   In file included from include/asm/system.h:4,
                    from include/asm/processor.h:18,
                    from include/asm/thread_info.h:16,
                    from include/linux/thread_info.h:21,
                    from include/linux/preempt.h:9,
                    from include/linux/spinlock.h:49,
                    from include/linux/capability.h:47,
                    from include/linux/sched.h:46,
                    from include/linux/utsname.h:35,
                    from /tmp/selfgz2660/NVIDIA-Linux-x86_64-100.14.11-pkg2/usr
   /src/nv/nv-linux.h:19,
                    from /tmp/selfgz2660/NVIDIA-Linux-x86_64-100.14.11-pkg2/usr
   /src/nv/nv.c:14:
   include/linux/kernel.h:126: warning: conflicting types for built-in function
   'snprintf'
   include/linux/kernel.h:128: warning: conflicting types for built-in function
   'vsnprintf'
   In file included from include/linux/string.h:21,
                    from include/linux/bitmap.h:8,
                    from include/linux/cpumask.h:86,
                    from include/asm/processor.h:22,
                    from include/asm/thread_info.h:16,
                    from include/linux/thread_info.h:21,
                    from include/linux/preempt.h:9,
                    from include/linux/spinlock.h:49,
                    from include/linux/capability.h:47,
                    from include/linux/sched.h:46,
                    from include/linux/utsname.h:35,
                    from /tmp/selfgz2660/NVIDIA-Linux-x86_64-100.14.11-pkg2/usr
   /src/nv/nv-linux.h:19,
                    from /tmp/selfgz2660/NVIDIA-Linux-x86_64-100.14.11-pkg2/usr
   /src/nv/nv.c:14:
   include/asm/string.h:44: warning: conflicting types for built-in function 's
   trncpy'
   include/asm/string.h:80: warning: conflicting types for built-in function 's
   trncat'
   include/asm/string.h:125: warning: conflicting types for built-in function '
   strncmp'
   include/asm/string.h:189: warning: conflicting types for built-in function '
   strlen'
   include/asm/string.h:326: warning: conflicting types for built-in function '
   memmove'
   In file included from include/linux/bitmap.h:8,
                    from include/linux/cpumask.h:86,
                    from include/asm/processor.h:22,
                    from include/asm/thread_info.h:16,
                    from include/linux/thread_info.h:21,
                    from include/linux/preempt.h:9,
                    from include/linux/spinlock.h:49,
                    from include/linux/capability.h:47,
                    from include/linux/sched.h:46,
                    from include/linux/utsname.h:35,
                    from /tmp/selfgz2660/NVIDIA-Linux-x86_64-100.14.11-pkg2/usr
   /src/nv/nv-linux.h:19,
                    from /tmp/selfgz2660/NVIDIA-Linux-x86_64-100.14.11-pkg2/usr
   /src/nv/nv.c:14:
   include/linux/string.h:54: warning: conflicting types for built-in function 
   'strncasecmp'
   include/linux/string.h:82: warning: conflicting types for built-in function 
   'strspn'
   include/linux/string.h:85: warning: conflicting types for built-in function 
   'strcspn'
   include/linux/string.h:101: warning: conflicting types for built-in function
   '__builtin_memcmp'
   In file included from include/linux/list.h:8,
                    from include/linux/wait.h:22,
                    from include/asm/semaphore.h:41,
                    from include/linux/sched.h:59,
                    from include/linux/utsname.h:35,
                    from /tmp/selfgz2660/NVIDIA-Linux-x86_64-100.14.11-pkg2/usr
   /src/nv/nv-linux.h:19,
                    from /tmp/selfgz2660/NVIDIA-Linux-x86_64-100.14.11-pkg2/usr
   /src/nv/nv.c:14:
   include/linux/prefetch.h: In function 'prefetch_range':
   include/linux/prefetch.h:62: warning: pointer of type 'void *' used in arith
   metic
   In file included from include/linux/irq.h:23,
                    from include/asm/hardirq.h:5,
                    from include/linux/hardirq.h:7,
                    from include/linux/interrupt.h:11,
                    from /tmp/selfgz2660/NVIDIA-Linux-x86_64-100.14.11-pkg2/usr
   /src/nv/nv-linux.h:79,
                    from /tmp/selfgz2660/NVIDIA-Linux-x86_64-100.14.11-pkg2/usr
   /src/nv/nv.c:14:
   include/asm/irq.h:15:25: error: irq_vectors.h: No such file or directory
   In file included from include/asm/hardirq.h:5,
                    from include/linux/hardirq.h:7,
                    from include/linux/interrupt.h:11,
                    from /tmp/selfgz2660/NVIDIA-Linux-x86_64-100.14.11-pkg2/usr
   /src/nv/nv-linux.h:79,
                    from /tmp/selfgz2660/NVIDIA-Linux-x86_64-100.14.11-pkg2/usr
   /src/nv/nv.c:14:
   include/linux/irq.h: At top level:
   include/linux/irq.h:178: error: 'NR_IRQS' undeclared here (not in a function
   )
   In file included from include/linux/interrupt.h:11,
                    from /tmp/selfgz2660/NVIDIA-Linux-x86_64-100.14.11-pkg2/usr
   /src/nv/nv-linux.h:79,
                    from /tmp/selfgz2660/NVIDIA-Linux-x86_64-100.14.11-pkg2/usr
   /src/nv/nv.c:14:
   include/linux/hardirq.h:40:27: warning: "NR_IRQS" is not defined
   make[3]: *** [/tmp/selfgz2660/NVIDIA-Linux-x86_64-100.14.11-pkg2/usr/src/nv/
   nv.o] Error 1
   make[2]: *** [_module_/tmp/selfgz2660/NVIDIA-Linux-x86_64-100.14.11-pkg2/usr
   /src/nv] Error 2
   NVIDIA: left KBUILD.
   nvidia.ko failed to build!
   make[1]: *** [module] Error 1
   make: *** [module] Error 2
-> Error.
ERROR: Unable to build the NVIDIA kernel module.
ERROR: Installation has failed.  Please see the file
       '/var/log/nvidia-installer.log' for details.  You may find suggestions
       on fixing installation problems in the README available on the Linux
       driver download page at www.nvidia.com.