rendered paste bodyotifier.dir/devicenotifier.o
[ 39%] Built target plasma_applet_pager
[ 39%] [ 39%] Building CXX object plasma/applets/devicenotifier/CMakeFiles/plasma_applet_devicenotifier.dir/notifierview.o
Built target plasma_applet_systemtray
[ 39%] Generating ui_tasksConfig.h
[ 39%] Generating plasma_applet_tasks_automoc.cpp
Generating taskgroupitem.moc
Generating tasks.moc
Generating windowtaskitem.moc
Generating abstracttaskitem.moc
Scanning dependencies of target plasma_applet_tasks
/var/tmp/paludis/kde-base-plasma-scm/work/plasma/plasma/applets/devicenotifier/notifierview.cpp:82: warning: unused parameter 'event'
[ 40%] Generating ksmserver_interface.cpp, ksmserver_interface.h
[ 40%] Generating screensaver_interface.cpp, screensaver_interface.h
[ 40%] Generating screensaver_interface.moc
[ 40%] Building CXX object plasma/applets/tasks/CMakeFiles/plasma_applet_tasks.dir/plasma_applet_tasks_automoc.o
[ 40%] Building CXX object plasma/applets/tasks/CMakeFiles/plasma_applet_tasks.dir/abstracttaskitem.o
[ 41%] Generating ksmserver_interface.moc
[ 41%] Generating plasma_applet_lockout_automoc.cpp
Generating lockout.moc
Scanning dependencies of target plasma_applet_lockout
[ 42%] Building CXX object plasma/applets/lock_logout/CMakeFiles/plasma_applet_lockout.dir/plasma_applet_lockout_automoc.o
[ 42%] Building CXX object plasma/applets/lock_logout/CMakeFiles/plasma_applet_lockout.dir/lockout.o
Linking CXX shared module ../../../lib/plasma_applet_devicenotifier.so
[ 43%] Building CXX object plasma/applets/tasks/CMakeFiles/plasma_applet_tasks.dir/taskgroupitem.o
[ 43%] Built target plasma_applet_devicenotifier
[ 43%] Building CXX object plasma/applets/tasks/CMakeFiles/plasma_applet_tasks.dir/windowtaskitem.o
[ 43%] Building CXX object plasma/applets/lock_logout/CMakeFiles/plasma_applet_lockout.dir/screensaver_interface.o
[ 44%] Building CXX object plasma/applets/tasks/CMakeFiles/plasma_applet_tasks.dir/tasks.o
[ 45%] Generating plasma_applet_trash_automoc.cpp
Generating trash.moc
Scanning dependencies of target plasma_applet_trash
[ 46%] Building CXX object plasma/applets/lock_logout/CMakeFiles/plasma_applet_lockout.dir/ksmserver_interface.o
[ 46%] Building CXX object plasma/applets/trash/CMakeFiles/plasma_applet_trash.dir/plasma_applet_trash_automoc.o
[ 46%] Building CXX object plasma/applets/trash/CMakeFiles/plasma_applet_trash.dir/trash.o
Linking CXX shared module ../../../lib/plasma_applet_tasks.so
Linking CXX shared module ../../../lib/plasma_applet_lockout.so
CMakeFiles/plasma_applet_tasks.dir/abstracttaskitem.o: In function `AbstractTaskItem::setupBackgroundSvg(QObject*)':
abstracttaskitem.cpp:(.text+0x10ad): undefined reference to `Plasma::PanelSvg::setCacheAllRenderedPanels(bool)'
collect2: ld returned 1 exit status
make[2]: *** [lib/plasma_applet_tasks.so] Error 1
make[1]: *** [plasma/applets/tasks/CMakeFiles/plasma_applet_tasks.dir/all] Error 2
make[1]: *** Waiting for unfinished jobs....
[ 46%] Built target plasma_applet_lockout
Linking CXX shared module ../../../lib/plasma_applet_trash.so
[ 46%] Built target plasma_applet_trash
make: *** [all] Error 2
!!! ERROR in kde-base/plasma-scm:
!!! In cmake-utils_src_make at line 1142
!!! Make failed!
!!! Call stack:
!!! * cmake-utils_src_make (/var/tmp/paludis/kde-base-plasma-scm/temp/loadsaveenv:1142)
!!! * kde4-base_src_make (/var/tmp/paludis/kde-base-plasma-scm/temp/loadsaveenv:3137)
!!! * kde4-meta_src_make (/var/tmp/paludis/kde-base-plasma-scm/temp/loadsaveenv:3408)
!!! * kde4-meta_src_compile (/var/tmp/paludis/kde-base-plasma-scm/temp/loadsaveenv:3362)
!!! * src_compile (/var/tmp/paludis/kde-base-plasma-scm/temp/loadsaveenv:4244)
!!! * ebuild_f_compile (/usr/libexec/paludis/1/src_compile.bash:49)
!!! * ebuild_main (/usr/libexec/paludis/ebuild.bash:462)
!!! * main (/usr/libexec/paludis/ebuild.bash:480)
diefunc: making ebuild PID 22294 exit with error
die trap: exiting with error.
Install error:
* In program paludis -i1 plasma:
* When performing install action from command line:
* When executing install task:
* When installing 'kde-base/plasma-scm:kde-svn::kde4-experimental':
* Install error: Install failed for 'kde-base/plasma-scm:kde-svn::kde4-experimental'
Summary of failures:
* kde-base/plasma-scm:kde-svn::kde4-experimental: failure
Total: 1 package, 0 successes, 0 skipped, 1 failure, 0 unreached
Resume command: paludis --log-level qa --preserve-world --install --serialised 0.25 'package;=kde-base/plasma-scm:kde-svn::kde4-experimental;installed;has_all_deps;P'
* No unread news items found
* Searching for configuration files requiring action...
* No configuration file updates required
root|starbox ~ [529]