rendered paste bodybash-3.00# cat config.log
This file contains any messages produced by compilers while
running configure, to aid debugging if configure makes a mistake.
It was created by clamav configure devel, which was
generated by GNU Autoconf 2.61. Invocation command line was
$ ./configure
## --------- ##
## Platform. ##
## --------- ##
hostname = proxy1
uname -m = sun4u
uname -r = 5.10
uname -s = SunOS
uname -v = Generic_127111-11
/usr/bin/uname -p = sparc
/bin/uname -X = System = SunOS
Node = proxy1
Release = 5.10
KernelID = Generic_127111-11
Machine = sun4u
BusType = <unknown>
Serial = <unknown>
Users = <unknown>
OEM# = 0
Origin# = 1
NumCPU = 1
/bin/arch = sun4
/usr/bin/arch -k = sun4u
/usr/convex/getsysinfo = unknown
/usr/bin/hostinfo = unknown
/bin/machine = unknown
/usr/bin/oslevel = unknown
/bin/universe = unknown
PATH: /bin
PATH: /usr/bin
PATH: /usr/local/bin
PATH: /usr/sfw/bin
## ----------- ##
## Core tests. ##
## ----------- ##
configure:2028: checking build system type
configure:2046: result: sparc-sun-solaris2.10
configure:2068: checking host system type
configure:2083: result: sparc-sun-solaris2.10
configure:2105: checking target system type
configure:2120: result: sparc-sun-solaris2.10
configure:2205: result: creating target.h - canonical system defines
configure:2351: checking for a BSD-compatible install
configure:2407: result: config/install-sh -c
configure:2418: checking whether build environment is sane
configure:2461: result: yes
configure:2489: checking for a thread-safe mkdir -p
configure:2528: result: config/install-sh -c -d
configure:2541: checking for gawk
configure:2571: result: no
configure:2541: checking for mawk
configure:2571: result: no
configure:2541: checking for nawk
configure:2557: found /bin/nawk
configure:2568: result: nawk
configure:2579: checking whether make sets $(MAKE)
configure:2600: result: yes
configure:2803: checking for gawk
configure:2830: result: nawk
configure:2854: checking for a BSD-compatible install
configure:2910: result: config/install-sh -c
configure:2921: checking whether ln -s works
configure:2925: result: yes
configure:2932: checking whether make sets $(MAKE)
configure:2953: result: yes
configure:3048: checking for style of include used by make
configure:3076: result: GNU
configure:3146: checking for gcc
configure:3162: found /usr/local/bin/gcc
configure:3173: result: gcc
configure:3411: checking for C compiler version
configure:3418: gcc --version >&5
gcc (GCC) 3.4.6
Copyright (C) 2006 Free Software Foundation, Inc.
This is free software; see the source for copying conditions. There is NO
warranty; not even for MERCHANTABILITY or FITNESS FOR A PARTICULAR PURPOSE.
configure:3421: $? = 0
configure:3428: gcc -v >&5
Reading specs from /usr/local/lib/gcc/sparc-sun-solaris2.10/3.4.6/specs
Configured with: ../configure --with-as=/usr/ccs/bin/as --with-ld=/usr/ccs/bin/ld --enable-shared --enable-languages=c,c++,f77
Thread model: posix
gcc version 3.4.6
configure:3431: $? = 0
configure:3438: gcc -V >&5
gcc: `-V' option must have argument
configure:3441: $? = 1
configure:3464: checking for C compiler default output file name
configure:3491: gcc conftest.c >&5
configure:3494: $? = 0
configure:3532: result: a.out
configure:3549: checking whether the C compiler works
configure:3559: ./a.out
configure:3562: $? = 0
configure:3579: result: yes
configure:3586: checking whether we are cross compiling
configure:3588: result: no
configure:3591: checking for suffix of executables
configure:3598: gcc -o conftest conftest.c >&5
configure:3601: $? = 0
configure:3625: result:
configure:3631: checking for suffix of object files
configure:3657: gcc -c conftest.c >&5
configure:3660: $? = 0
configure:3683: result: o
configure:3687: checking whether we are using the GNU C compiler
configure:3716: gcc -c conftest.c >&5
configure:3722: $? = 0
configure:3739: result: yes
configure:3744: checking whether gcc accepts -g
configure:3774: gcc -c -g conftest.c >&5
configure:3780: $? = 0
configure:3879: result: yes
configure:3896: checking for gcc option to accept ISO C89
configure:3970: gcc -c -g -O2 conftest.c >&5
configure:3976: $? = 0
configure:3999: result: none needed
configure:4019: checking dependency style of gcc
configure:4110: result: gcc3
configure:4125: checking for a sed that does not truncate output
configure:4181: result: /bin/sed
configure:4184: checking for grep that handles long lines and -e
configure:4258: result: /usr/sfw/bin/ggrep
configure:4263: checking for egrep
configure:4341: result: /usr/sfw/bin/ggrep -E
configure:4357: checking for ld used by gcc
configure:4424: result: /usr/ccs/bin/ld
configure:4433: checking if the linker (/usr/ccs/bin/ld) is GNU ld
configure:4448: result: no
configure:4453: checking for /usr/ccs/bin/ld option to reload object files
configure:4460: result: -r
configure:4478: checking for BSD-compatible nm
configure:4527: result: /usr/ccs/bin/nm -p
configure:4531: checking how to recognize dependent libraries
configure:4717: result: pass_all
configure:4930: gcc -c -g -O2 conftest.c >&5
configure:4933: $? = 0
configure:4962: checking how to run the C preprocessor
configure:5002: gcc -E conftest.c
configure:5008: $? = 0
configure:5039: gcc -E conftest.c
conftest.c:10:28: ac_nonexistent.h: No such file or directory
configure:5045: $? = 1
configure: failed program was:
| /* confdefs.h. */
| #define PACKAGE_NAME "clamav"
| #define PACKAGE_TARNAME "clamav"
| #define PACKAGE_VERSION "devel"
| #define PACKAGE_STRING "clamav devel"
| #define PACKAGE_BUGREPORT "http://bugs.clamav.net/"
| #define PACKAGE PACKAGE_NAME
| #define VERSION "0.93"
| /* end confdefs.h. */
| #include <ac_nonexistent.h>
configure:5078: result: gcc -E
configure:5107: gcc -E conftest.c
configure:5113: $? = 0
configure:5144: gcc -E conftest.c
conftest.c:10:28: ac_nonexistent.h: No such file or directory
configure:5150: $? = 1
configure: failed program was:
| /* confdefs.h. */
| #define PACKAGE_NAME "clamav"
| #define PACKAGE_TARNAME "clamav"
| #define PACKAGE_VERSION "devel"
| #define PACKAGE_STRING "clamav devel"
| #define PACKAGE_BUGREPORT "http://bugs.clamav.net/"
| #define PACKAGE PACKAGE_NAME
| #define VERSION "0.93"
| /* end confdefs.h. */
| #include <ac_nonexistent.h>
configure:5188: checking for ANSI C header files
configure:5218: gcc -c -g -O2 conftest.c >&5
configure:5224: $? = 0
configure:5323: gcc -o conftest -g -O2 conftest.c >&5
configure:5326: $? = 0
configure:5332: ./conftest
configure:5335: $? = 0
configure:5352: result: yes
configure:5376: checking for sys/types.h
configure:5397: gcc -c -g -O2 conftest.c >&5
configure:5403: $? = 0
configure:5419: result: yes
configure:5376: checking for sys/stat.h
configure:5397: gcc -c -g -O2 conftest.c >&5
configure:5403: $? = 0
configure:5419: result: yes
configure:5376: checking for stdlib.h
configure:5397: gcc -c -g -O2 conftest.c >&5
configure:5403: $? = 0
configure:5419: result: yes
configure:5376: checking for string.h
configure:5397: gcc -c -g -O2 conftest.c >&5
configure:5403: $? = 0
configure:5419: result: yes
configure:5376: checking for memory.h
configure:5397: gcc -c -g -O2 conftest.c >&5
configure:5403: $? = 0
configure:5419: result: yes
configure:5376: checking for strings.h
configure:5397: gcc -c -g -O2 conftest.c >&5
configure:5403: $? = 0
configure:5419: result: yes
configure:5376: checking for inttypes.h
configure:5397: gcc -c -g -O2 conftest.c >&5
configure:5403: $? = 0
configure:5419: result: yes
configure:5376: checking for stdint.h
configure:5397: gcc -c -g -O2 conftest.c >&5
configure:5403: $? = 0
configure:5419: result: yes
configure:5376: checking for unistd.h
configure:5397: gcc -c -g -O2 conftest.c >&5
configure:5403: $? = 0
configure:5419: result: yes
configure:5446: checking dlfcn.h usability
configure:5463: gcc -c -g -O2 conftest.c >&5
configure:5469: $? = 0
configure:5483: result: yes
configure:5487: checking dlfcn.h presence
configure:5502: gcc -E conftest.c
configure:5508: $? = 0
configure:5522: result: yes
configure:5555: checking for dlfcn.h
configure:5563: result: yes
configure:5579: checking the maximum length of command line arguments
configure:5691: result: 786240
configure:5703: checking command to parse /usr/ccs/bin/nm -p output from gcc object
configure:5808: gcc -c -g -O2 conftest.c >&5
configure:5811: $? = 0
configure:5815: /usr/ccs/bin/nm -p conftest.o \| sed -n -e 's/^.*[ ]\([BDRT][BDRT]*\)[ ][ ]*\([_A-Za-z][_A-Za-z0-9]*\)$/\1 \2 \2/p' \> conftest.nm
configure:5818: $? = 0
configure:5870: gcc -o conftest -g -O2 conftest.c conftstm.o >&5
configure:5873: $? = 0
configure:5911: result: ok
configure:5915: checking for objdir
configure:5930: result: .libs
configure:6022: checking for ar
configure:6052: result: no
configure:6118: checking for ranlib
configure:6148: result: no
configure:6214: checking for strip
configure:6244: result: no
configure:6839: checking if gcc supports -fno-rtti -fno-exceptions
configure:6857: gcc -c -g -O2 -fno-rtti -fno-exceptions conftest.c >&5
cc1: warning: command line option "-fno-rtti" is valid for C++/ObjC++ but not for C
configure:6861: $? = 0
configure:6874: result: no
configure:6889: checking for gcc option to produce PIC
configure:7121: result: -fPIC
configure:7129: checking if gcc PIC flag -fPIC works
configure:7147: gcc -c -g -O2 -fPIC -DPIC conftest.c >&5
configure:7151: $? = 0
configure:7164: result: yes
configure:7192: checking if gcc static flag -static works
configure:7220: result: no
configure:7230: checking if gcc supports -c -o file.o
configure:7251: gcc -c -g -O2 -o out/conftest2.o conftest.c >&5
configure:7255: $? = 0
configure:7277: result: yes
configure:7303: checking whether the gcc linker (/usr/ccs/bin/ld) supports shared libraries
configure:8284: result: yes
configure:8305: checking whether -lc should be explicitly linked in
configure:8310: gcc -c -g -O2 conftest.c >&5
configure:8313: $? = 0
configure:8328: gcc -shared -Wl,-h -Wl,conftest -o conftest conftest.o -v 2\>\&1 \| grep -lc \>/dev/null 2\>\&1
configure:8331: $? = 1
configure:8343: result: yes
configure:8351: checking dynamic linker characteristics
configure:8965: result: solaris2.10 ld.so
configure:8989: checking how to hardcode library paths into programs
configure:9014: result: immediate
configure:9028: checking whether stripping libraries is possible
configure:9050: result: no
configure:9835: checking if libtool supports shared libraries
configure:9837: result: yes
configure:9840: checking whether to build shared libraries
configure:9861: result: yes
configure:9864: checking whether to build static libraries
configure:9868: result: yes
configure:9962: creating libtool
configure:10397: checking for ANSI C header files
configure:10561: result: yes
configure:10571: checking for C/C++ restrict keyword
configure:10607: gcc -c -g -O2 conftest.c >&5
conftest.c:25: error: syntax error before "ip"
conftest.c: In function `foo':
conftest.c:26: error: `ip' undeclared (first use in this function)
conftest.c:26: error: (Each undeclared identifier is reported only once
conftest.c:26: error: for each function it appears in.)
conftest.c: In function `main':
conftest.c:32: error: syntax error before "t"
conftest.c:33: error: `t' undeclared (first use in this function)
configure:10613: $? = 1
configure: failed program was:
| /* confdefs.h. */
| #define PACKAGE_NAME "clamav"
| #define PACKAGE_TARNAME "clamav"
| #define PACKAGE_VERSION "devel"
| #define PACKAGE_STRING "clamav devel"
| #define PACKAGE_BUGREPORT "http://bugs.clamav.net/"
| #define PACKAGE PACKAGE_NAME
| #define VERSION "0.93"
| #define STDC_HEADERS 1
| #define HAVE_SYS_TYPES_H 1
| #define HAVE_SYS_STAT_H 1
| #define HAVE_STDLIB_H 1
| #define HAVE_STRING_H 1
| #define HAVE_MEMORY_H 1
| #define HAVE_STRINGS_H 1
| #define HAVE_INTTYPES_H 1
| #define HAVE_STDINT_H 1
| #define HAVE_UNISTD_H 1
| #define HAVE_DLFCN_H 1
| #define SCANBUFF 131072
| #define FILEBUFF 8192
| #define STDC_HEADERS 1
| /* end confdefs.h. */
| typedef int * int_ptr;
| int foo (int_ptr restrict ip) {
| return ip[0];
| }
| int
| main ()
| {
| int s[1];
| int * restrict t = s;
| t[0] = 0;
| return foo(t)
| ;
| return 0;
| }
configure:10607: gcc -c -g -O2 conftest.c >&5
configure:10613: $? = 0
configure:10631: result: __restrict
configure:10646: checking for an ANSI C-conforming const
configure:10721: gcc -c -g -O2 conftest.c >&5
configure:10727: $? = 0
configure:10742: result: yes
configure:10752: checking for inline
configure:10778: gcc -c -g -O2 conftest.c >&5
configure:10784: $? = 0
configure:10802: result: inline
configure:10821: checking whether FPU byte ordering is bigendian
configure:10851: gcc -c -g -O2 conftest.c >&5
configure:10857: $? = 0
configure:10882: result: yes
configure:10904: checking whether byte ordering is bigendian
configure:10937: gcc -c -g -O2 conftest.c >&5
conftest.c: In function `main':
conftest.c:33: error: `bogus' undeclared (first use in this function)
conftest.c:33: error: (Each undeclared identifier is reported only once
conftest.c:33: error: for each function it appears in.)
conftest.c:33: error: syntax error before "endian"
configure:10943: $? = 1
configure: failed program was:
| /* confdefs.h. */
| #define PACKAGE_NAME "clamav"
| #define PACKAGE_TARNAME "clamav"
| #define PACKAGE_VERSION "devel"
| #define PACKAGE_STRING "clamav devel"
| #define PACKAGE_BUGREPORT "http://bugs.clamav.net/"
| #define PACKAGE PACKAGE_NAME
| #define VERSION "0.93"
| #define STDC_HEADERS 1
| #define HAVE_SYS_TYPES_H 1
| #define HAVE_SYS_STAT_H 1
| #define HAVE_STDLIB_H 1
| #define HAVE_STRING_H 1
| #define HAVE_MEMORY_H 1
| #define HAVE_STRINGS_H 1
| #define HAVE_INTTYPES_H 1
| #define HAVE_STDINT_H 1
| #define HAVE_UNISTD_H 1
| #define HAVE_DLFCN_H 1
| #define SCANBUFF 131072
| #define FILEBUFF 8192
| #define STDC_HEADERS 1
| #define restrict __restrict
| #define FPU_WORDS_BIGENDIAN 1
| /* end confdefs.h. */
| #include <sys/types.h>
| #include <sys/param.h>
|
| int
| main ()
| {
| #if ! (defined BYTE_ORDER && defined BIG_ENDIAN && defined LITTLE_ENDIAN && BYTE_ORDER && BIG_ENDIAN && LITTLE_ENDIAN)
| bogus endian macros
| #endif
|
| ;
| return 0;
| }
configure:11090: gcc -o conftest -g -O2 conftest.c >&5
configure:11093: $? = 0
configure:11099: ./conftest
configure:11102: $? = 1
configure: program exited with status 1
configure: failed program was:
| /* confdefs.h. */
| #define PACKAGE_NAME "clamav"
| #define PACKAGE_TARNAME "clamav"
| #define PACKAGE_VERSION "devel"
| #define PACKAGE_STRING "clamav devel"
| #define PACKAGE_BUGREPORT "http://bugs.clamav.net/"
| #define PACKAGE PACKAGE_NAME
| #define VERSION "0.93"
| #define STDC_HEADERS 1
| #define HAVE_SYS_TYPES_H 1
| #define HAVE_SYS_STAT_H 1
| #define HAVE_STDLIB_H 1
| #define HAVE_STRING_H 1
| #define HAVE_MEMORY_H 1
| #define HAVE_STRINGS_H 1
| #define HAVE_INTTYPES_H 1
| #define HAVE_STDINT_H 1
| #define HAVE_UNISTD_H 1
| #define HAVE_DLFCN_H 1
| #define SCANBUFF 131072
| #define FILEBUFF 8192
| #define STDC_HEADERS 1
| #define restrict __restrict
| #define FPU_WORDS_BIGENDIAN 1
| /* end confdefs.h. */
| #include <stdio.h>
| #ifdef HAVE_SYS_TYPES_H
| # include <sys/types.h>
| #endif
| #ifdef HAVE_SYS_STAT_H
| # include <sys/stat.h>
| #endif
| #ifdef STDC_HEADERS
| # include <stdlib.h>
| # include <stddef.h>
| #else
| # ifdef HAVE_STDLIB_H
| # include <stdlib.h>
| # endif
| #endif
| #ifdef HAVE_STRING_H
| # if !defined STDC_HEADERS && defined HAVE_MEMORY_H
| # include <memory.h>
| # endif
| # include <string.h>
| #endif
| #ifdef HAVE_STRINGS_H
| # include <strings.h>
| #endif
| #ifdef HAVE_INTTYPES_H
| # include <inttypes.h>
| #endif
| #ifdef HAVE_STDINT_H
| # include <stdint.h>
| #endif
| #ifdef HAVE_UNISTD_H
| # include <unistd.h>
| #endif
| int
| main ()
| {
|
| /* Are we little or big endian? From Harbison&Steele. */
| union
| {
| long int l;
| char c[sizeof (long int)];
| } u;
| u.l = 1;
| return u.c[sizeof (long int) - 1] == 1;
|
| ;
| return 0;
| }
configure:11121: result: yes
configure:11166: checking for a supported version of gcc
configure:11178: result: ok (3.4.6)
configure:11186: checking for gcc bug PR27603
configure:11222: gcc -o conftest -g -O2 conftest.c >&5
configure:11225: $? = 0
configure:11231: ./conftest
configure:11234: $? = 0
configure:11236: result: ok, bug not present
configure:11253: checking for gcc bug PR26763-2
configure:11291: gcc -o conftest -g -O2 conftest.c >&5
configure:11294: $? = 0
configure:11300: ./conftest
configure:11303: $? = 0
configure:11305: result: ok, bug not present
configure:11322: checking for valid code generation of CLI_ISCONTAINED
configure:11399: gcc -o conftest -g -O2 conftest.c >&5
configure:11402: $? = 0
configure:11408: ./conftest
configure:11411: $? = 0
configure:11413: result: ok, bug not present
configure:11430: checking for gcc bug PR28045
configure:11471: gcc -o conftest -g -O2 conftest.c >&5
configure:11474: $? = 0
configure:11480: ./conftest
configure:11483: $? = 0
configure:11485: result: ok, bug not present
configure:11502: checking for ld --version-script
configure:11531: gcc -g -O2 -fPIC -DPIC -shared
-o conftest.so conftest.c
-Wl,--version-script,conftest.map
1>&5
/usr/ccs/bin/ld: illegal option -- version-script
usage: ld [-6:abc:d:e:f:h:il:mo:p:rstu:z:B:CD:F:GI:L:M:N:P:Q:R:S:VY:?] file(s)
[-64] enforce a 64-bit link-edit
[-a] create an absolute file
[-b] do not do special PIC relocations in a.out
[-B direct | nodirect]
establish direct bindings, or inhibit direct binding
to, the object being created
[-B dynamic | static]
search for shared libraries|archives
[-B eliminate] eliminate unqualified global symbols from the
symbol table
[-B group] relocate object from within group
[-B local] reduce unqualified global symbols to local
[-B reduce] process symbol reductions
[-B symbolic] bind external references to definitions when creating
shared objects
[-c name] record configuration file `name'
[-C] demangle C++ symbol name diagnostics
[-d y | n] operate in dynamic|static mode
[-D token,...] print diagnostic messages
[-e epsym] use `epsym' as entry point address
[-f name] specify library for which this file is an auxiliary
filter
[-F name] specify library for which this file is a filter
[-G] create a shared object
[-h name] use `name' as internal shared object identifier
[-i] ignore LD_LIBRARY_PATH setting
[-I name] use `name' as path of interpreter
[-l x] search for libx.so or libx.a
[-L path] search for libraries in directory `path'
[-m] print memory map
[-M mapfile] use processing directives contained in `mapfile'
[-N string] create a dynamic dependency for `string'
[-o outfile] name the output file `outfile'
[-p auditlib] identify audit library to accompany this object
[-P auditlib] identify audit library for processing the dependencies
of this object
[-Q y | n] do|do not place version information in output file
[-r] create a relocatable object
[-R path] specify a library search path to be used at run time
[-s] strip any symbol and debugging information
[-S supportlib]
specify a link-edit support library
[-t] do not warn of multiply-defined symbols that have
different sizes or alignments
[-u symname] create an undefined symbol `symname'
[-V] print version information
[-Y P,dirlist] use `dirlist' as a default path when searching for
libraries
[-z absexec] when building an executable absolute symbols
referenced in dynamic objects are promoted to
the executable
[-z allextract | defaultextract | weakextract]
extract all member files, only members that resolve
undefined tor tentative symbols, or allow extraction of
archive members to resolvetweak references from
archive files
[-z altexec64] execute the 64-bit link-editor
[-z combreloc] combine multiple relocation sections
[-z defs] disallow undefined symbol references
[-z direct | nodirect]
enable|disable direct binding to shared object
dependencies
[-z endfiltee] marks a filtee such that it will terminate a filters
search
[-z finiarray=function]
name of function to be appended to the .finiarray
[-z groupperm | nogroupperm]
enable|disable setting of group permissions
on dynamic dependencies
[-z help ] print this usage message
[-z ignore | record]
ignore|record unused dynamic dependencies
[-z initarray=function]
name of function to be appended to the .initarray
[-z initfirst] mark object to indicate that its .init section should
be executed before the .init section of any other
objects
[-z interpose] dynamic object is to be an `interposer' on direct
bindings
[-z lazyload | nolazyload]
enable|disable delayed loading of shared object
dependencies
[-z ld32=arg1,arg2,...]
define arguments applicable to the 32-bit class of ld(1)
[-z ld64=arg1,arg2,...]
define arguments applicable to the 64-bit class of ld(1)
[-z loadfltr] mark filter as requiring immediate loading of its
filtees at runtime
[-z muldefs] allow multiply-defined symbols
[-z nocompstrtab]
disable compression of string tables
[-z nodefs] allow undefined symbol references
[-z nodefaultlib]
mark object to ignore any default library search path
[-z nodelete] mark object as non-deletable
[-z nodlopen] mark object as non-dlopen()'able
[-z nodump] mark object as non-dldump()'able
[-z now] mark object as requiring non-lazy binding
[-z nopartial] expand any partially initialized symbols
[-z noversion] don't record any version sections
[-z origin] mark object as requiring $ORIGIN processing
[-z preinitarray=function]
name of function to be appended to the .preinitarray
[-z redlocsym] reduce local syms in .symtab to a minimum
[-z rescan] rescan archive list until no further member
extraction occurs
[-z text] disallow output relocations against text
[-z textoff] allow output relocations against text
[-z textwarn] warn if there are relocations against text
[-z verbose] generate warnings for suspicious processings
collect2: ld returned 1 exit status
configure:11534: $? = 1
configure:11544: gcc -g -O2 -fPIC -DPIC -shared
-o conftest.so conftest.c
-Wl,-M,conftest.map
1>&5
Undefined first referenced
symbol in file
cl_* conftest.map
cli_* conftest.map
ld: warning: Symbol referencing errors
configure:11547: $? = 0
configure:11558: result: yes
configure:11598: checking for stdint.h
configure:11604: result: yes
configure:11598: checking for unistd.h
configure:11604: result: yes
configure:11608: checking sys/int_types.h usability
configure:11625: gcc -c -g -O2 conftest.c >&5
configure:11631: $? = 0
configure:11645: result: yes
configure:11649: checking sys/int_types.h presence
configure:11664: gcc -E conftest.c
configure:11670: $? = 0
configure:11684: result: yes
configure:11717: checking for sys/int_types.h
configure:11725: result: yes
configure:11598: checking for dlfcn.h
configure:11604: result: yes
configure:11598: checking for inttypes.h
configure:11604: result: yes
configure:11608: checking sys/inttypes.h usability
configure:11625: gcc -c -g -O2 conftest.c >&5
configure:11631: $? = 0
configure:11645: result: yes
configure:11649: checking sys/inttypes.h presence
configure:11664: gcc -E conftest.c
configure:11670: $? = 0
configure:11684: result: yes
configure:11717: checking for sys/inttypes.h
configure:11725: result: yes
configure:11598: checking for memory.h
configure:11604: result: yes
configure:11608: checking ndir.h usability
configure:11625: gcc -c -g -O2 conftest.c >&5
conftest.c:68:18: ndir.h: No such file or directory
configure:11631: $? = 1
configure: failed program was:
| /* confdefs.h. */
| #define PACKAGE_NAME "clamav"
| #define PACKAGE_TARNAME "clamav"
| #define PACKAGE_VERSION "devel"
| #define PACKAGE_STRING "clamav devel"
| #define PACKAGE_BUGREPORT "http://bugs.clamav.net/"
| #define PACKAGE PACKAGE_NAME
| #define VERSION "0.93"
| #define STDC_HEADERS 1
| #define HAVE_SYS_TYPES_H 1
| #define HAVE_SYS_STAT_H 1
| #define HAVE_STDLIB_H 1
| #define HAVE_STRING_H 1
| #define HAVE_MEMORY_H 1
| #define HAVE_STRINGS_H 1
| #define HAVE_INTTYPES_H 1
| #define HAVE_STDINT_H 1
| #define HAVE_UNISTD_H 1
| #define HAVE_DLFCN_H 1
| #define SCANBUFF 131072
| #define FILEBUFF 8192
| #define STDC_HEADERS 1
| #define restrict __restrict
| #define FPU_WORDS_BIGENDIAN 1
| #define WORDS_BIGENDIAN 1
| #define WORDS_BIGENDIAN 1
| #define HAVE_STDINT_H 1
| #define HAVE_UNISTD_H 1
| #define HAVE_SYS_INT_TYPES_H 1
| #define HAVE_DLFCN_H 1
| #define HAVE_INTTYPES_H 1
| #define HAVE_SYS_INTTYPES_H 1
| #define HAVE_MEMORY_H 1
| /* end confdefs.h. */
| #include <stdio.h>
| #ifdef HAVE_SYS_TYPES_H
| # include <sys/types.h>
| #endif
| #ifdef HAVE_SYS_STAT_H
| # include <sys/stat.h>
| #endif
| #ifdef STDC_HEADERS
| # include <stdlib.h>
| # include <stddef.h>
| #else
| # ifdef HAVE_STDLIB_H
| # include <stdlib.h>
| # endif
| #endif
| #ifdef HAVE_STRING_H
| # if !defined STDC_HEADERS && defined HAVE_MEMORY_H
| # include <memory.h>
| # endif
| # include <string.h>
| #endif
| #ifdef HAVE_STRINGS_H
| # include <strings.h>
| #endif
| #ifdef HAVE_INTTYPES_H
| # include <inttypes.h>
| #endif
| #ifdef HAVE_STDINT_H
| # include <stdint.h>
| #endif
| #ifdef HAVE_UNISTD_H
| # include <unistd.h>
| #endif
| #include <ndir.h>
configure:11645: result: no
configure:11649: checking ndir.h presence
configure:11664: gcc -E conftest.c
conftest.c:35:18: ndir.h: No such file or directory
configure:11670: $? = 1
configure: failed program was:
| /* confdefs.h. */
| #define PACKAGE_NAME "clamav"
| #define PACKAGE_TARNAME "clamav"
| #define PACKAGE_VERSION "devel"
| #define PACKAGE_STRING "clamav devel"
| #define PACKAGE_BUGREPORT "http://bugs.clamav.net/"
| #define PACKAGE PACKAGE_NAME
| #define VERSION "0.93"
| #define STDC_HEADERS 1
| #define HAVE_SYS_TYPES_H 1
| #define HAVE_SYS_STAT_H 1
| #define HAVE_STDLIB_H 1
| #define HAVE_STRING_H 1
| #define HAVE_MEMORY_H 1
| #define HAVE_STRINGS_H 1
| #define HAVE_INTTYPES_H 1
| #define HAVE_STDINT_H 1
| #define HAVE_UNISTD_H 1
| #define HAVE_DLFCN_H 1
| #define SCANBUFF 131072
| #define FILEBUFF 8192
| #define STDC_HEADERS 1
| #define restrict __restrict
| #define FPU_WORDS_BIGENDIAN 1
| #define WORDS_BIGENDIAN 1
| #define WORDS_BIGENDIAN 1
| #define HAVE_STDINT_H 1
| #define HAVE_UNISTD_H 1
| #define HAVE_SYS_INT_TYPES_H 1
| #define HAVE_DLFCN_H 1
| #define HAVE_INTTYPES_H 1
| #define HAVE_SYS_INTTYPES_H 1
| #define HAVE_MEMORY_H 1
| /* end confdefs.h. */
| #include <ndir.h>
configure:11684: result: no
configure:11717: checking for ndir.h
configure:11725: result: no
configure:11598: checking for stdlib.h
configure:11604: result: yes
configure:11598: checking for strings.h
configure:11604: result: yes
configure:11598: checking for string.h
configure:11604: result: yes
configure:11608: checking sys/mman.h usability
configure:11625: gcc -c -g -O2 conftest.c >&5
configure:11631: $? = 0
configure:11645: result: yes
configure:11649: checking sys/mman.h presence
configure:11664: gcc -E conftest.c
configure:11670: $? = 0
configure:11684: result: yes
configure:11717: checking for sys/mman.h
configure:11725: result: yes
configure:11608: checking sys/param.h usability
configure:11625: gcc -c -g -O2 conftest.c >&5
configure:11631: $? = 0
configure:11645: result: yes
configure:11649: checking sys/param.h presence
configure:11664: gcc -E conftest.c
configure:11670: $? = 0
configure:11684: result: yes
configure:11717: checking for sys/param.h
configure:11725: result: yes
configure:11598: checking for sys/stat.h
configure:11604: result: yes
configure:11598: checking for sys/types.h
configure:11604: result: yes
configure:11608: checking malloc.h usability
configure:11625: gcc -c -g -O2 conftest.c >&5
configure:11631: $? = 0
configure:11645: result: yes
configure:11649: checking malloc.h presence
configure:11664: gcc -E conftest.c
configure:11670: $? = 0
configure:11684: result: yes
configure:11717: checking for malloc.h
configure:11725: result: yes
configure:11608: checking poll.h usability
configure:11625: gcc -c -g -O2 conftest.c >&5
configure:11631: $? = 0
configure:11645: result: yes
configure:11649: checking poll.h presence
configure:11664: gcc -E conftest.c
configure:11670: $? = 0
configure:11684: result: yes
configure:11717: checking for poll.h
configure:11725: result: yes
configure:11608: checking limits.h usability
configure:11625: gcc -c -g -O2 conftest.c >&5
configure:11631: $? = 0
configure:11645: result: yes
configure:11649: checking limits.h presence
configure:11664: gcc -E conftest.c
configure:11670: $? = 0
configure:11684: result: yes
configure:11717: checking for limits.h
configure:11725: result: yes
configure:11608: checking sys/filio.h usability
configure:11625: gcc -c -g -O2 conftest.c >&5
configure:11631: $? = 0
configure:11645: result: yes
configure:11649: checking sys/filio.h presence
configure:11664: gcc -E conftest.c
configure:11670: $? = 0
configure:11684: result: yes
configure:11717: checking for sys/filio.h
configure:11725: result: yes
configure:11608: checking sys/uio.h usability
configure:11625: gcc -c -g -O2 conftest.c >&5
configure:11631: $? = 0
configure:11645: result: yes
configure:11649: checking sys/uio.h presence
configure:11664: gcc -E conftest.c
configure:11670: $? = 0
configure:11684: result: yes
configure:11717: checking for sys/uio.h
configure:11725: result: yes
configure:11608: checking termios.h usability
configure:11625: gcc -c -g -O2 conftest.c >&5
configure:11631: $? = 0
configure:11645: result: yes
configure:11649: checking termios.h presence
configure:11664: gcc -E conftest.c
configure:11670: $? = 0
configure:11684: result: yes
configure:11717: checking for termios.h
configure:11725: result: yes
configure:11608: checking stdbool.h usability
configure:11625: gcc -c -g -O2 conftest.c >&5
configure:11631: $? = 0
configure:11645: result: yes
configure:11649: checking stdbool.h presence
configure:11664: gcc -E conftest.c
configure:11670: $? = 0
configure:11684: result: yes
configure:11717: checking for stdbool.h
configure:11725: result: yes
configure:11608: checking pwd.h usability
configure:11625: gcc -c -g -O2 conftest.c >&5
configure:11631: $? = 0
configure:11645: result: yes
configure:11649: checking pwd.h presence
configure:11664: gcc -E conftest.c
configure:11670: $? = 0
configure:11684: result: yes
configure:11717: checking for pwd.h
configure:11725: result: yes
configure:11608: checking grp.h usability
configure:11625: gcc -c -g -O2 conftest.c >&5
configure:11631: $? = 0
configure:11645: result: yes
configure:11649: checking grp.h presence
configure:11664: gcc -E conftest.c
configure:11670: $? = 0
configure:11684: result: yes
configure:11717: checking for grp.h
configure:11725: result: yes
configure:11748: checking syslog.h usability
configure:11765: gcc -c -g -O2 conftest.c >&5
configure:11771: $? = 0
configure:11785: result: yes
configure:11789: checking syslog.h presence
configure:11804: gcc -E conftest.c
configure:11810: $? = 0
configure:11824: result: yes
configure:11857: checking for syslog.h
configure:11864: result: yes
configure:11878: checking for off_t
configure:11908: gcc -c -g -O2 conftest.c >&5
configure:11914: $? = 0
configure:11929: result: yes
configure:11941: checking size of short
configure:11971: gcc -c -g -O2 conftest.c >&5
conftest.c: In function `main':
conftest.c:59: error: duplicate case value
conftest.c:59: error: previously used here
configure:11977: $? = 1
configure: failed program was:
| /* confdefs.h. */
| #define PACKAGE_NAME "clamav"
| #define PACKAGE_TARNAME "clamav"
| #define PACKAGE_VERSION "devel"
| #define PACKAGE_STRING "clamav devel"
| #define PACKAGE_BUGREPORT "http://bugs.clamav.net/"
| #define PACKAGE PACKAGE_NAME
| #define VERSION "0.93"
| #define STDC_HEADERS 1
| #define HAVE_SYS_TYPES_H 1
| #define HAVE_SYS_STAT_H 1
| #define HAVE_STDLIB_H 1
| #define HAVE_STRING_H 1
| #define HAVE_MEMORY_H 1
| #define HAVE_STRINGS_H 1
| #define HAVE_INTTYPES_H 1
| #define HAVE_STDINT_H 1
| #define HAVE_UNISTD_H 1
| #define HAVE_DLFCN_H 1
| #define SCANBUFF 131072
| #define FILEBUFF 8192
| #define STDC_HEADERS 1
| #define restrict __restrict
| #define FPU_WORDS_BIGENDIAN 1
| #define WORDS_BIGENDIAN 1
| #define WORDS_BIGENDIAN 1
| #define HAVE_STDINT_H 1
| #define HAVE_UNISTD_H 1
| #define HAVE_SYS_INT_TYPES_H 1
| #define HAVE_DLFCN_H 1
| #define HAVE_INTTYPES_H 1
| #define HAVE_SYS_INTTYPES_H 1
| #define HAVE_MEMORY_H 1
| #define HAVE_STDLIB_H 1
| #define HAVE_STRINGS_H 1
| #define HAVE_STRING_H 1
| #define HAVE_SYS_MMAN_H 1
| #define HAVE_SYS_PARAM_H 1
| #define HAVE_SYS_STAT_H 1
| #define HAVE_SYS_TYPES_H 1
| #define HAVE_MALLOC_H 1
| #define HAVE_POLL_H 1
| #define HAVE_LIMITS_H 1
| #define HAVE_SYS_FILIO_H 1
| #define HAVE_SYS_UIO_H 1
| #define HAVE_TERMIOS_H 1
| #define HAVE_STDBOOL_H 1
| #define HAVE_PWD_H 1
| #define HAVE_GRP_H 1
| #define USE_SYSLOG 1
| /* end confdefs.h. */
| #include "confdefs.h"
| #include <sys/types.h>
|
|
| int
| main ()
| {
| switch (0) case 0: case (sizeof (short) == 4):;
| ;
| return 0;
| }
configure:11971: gcc -c -g -O2 conftest.c >&5
conftest.c: In function `main':
conftest.c:59: error: duplicate case value
conftest.c:59: error: previously used here
configure:11977: $? = 1
configure: failed program was:
| /* confdefs.h. */
| #define PACKAGE_NAME "clamav"
| #define PACKAGE_TARNAME "clamav"
| #define PACKAGE_VERSION "devel"
| #define PACKAGE_STRING "clamav devel"
| #define PACKAGE_BUGREPORT "http://bugs.clamav.net/"
| #define PACKAGE PACKAGE_NAME
| #define VERSION "0.93"
| #define STDC_HEADERS 1
| #define HAVE_SYS_TYPES_H 1
| #define HAVE_SYS_STAT_H 1
| #define HAVE_STDLIB_H 1
| #define HAVE_STRING_H 1
| #define HAVE_MEMORY_H 1
| #define HAVE_STRINGS_H 1
| #define HAVE_INTTYPES_H 1
| #define HAVE_STDINT_H 1
| #define HAVE_UNISTD_H 1
| #define HAVE_DLFCN_H 1
| #define SCANBUFF 131072
| #define FILEBUFF 8192
| #define STDC_HEADERS 1
| #define restrict __restrict
| #define FPU_WORDS_BIGENDIAN 1
| #define WORDS_BIGENDIAN 1
| #define WORDS_BIGENDIAN 1
| #define HAVE_STDINT_H 1
| #define HAVE_UNISTD_H 1
| #define HAVE_SYS_INT_TYPES_H 1
| #define HAVE_DLFCN_H 1
| #define HAVE_INTTYPES_H 1
| #define HAVE_SYS_INTTYPES_H 1
| #define HAVE_MEMORY_H 1
| #define HAVE_STDLIB_H 1
| #define HAVE_STRINGS_H 1
| #define HAVE_STRING_H 1
| #define HAVE_SYS_MMAN_H 1
| #define HAVE_SYS_PARAM_H 1
| #define HAVE_SYS_STAT_H 1
| #define HAVE_SYS_TYPES_H 1
| #define HAVE_MALLOC_H 1
| #define HAVE_POLL_H 1
| #define HAVE_LIMITS_H 1
| #define HAVE_SYS_FILIO_H 1
| #define HAVE_SYS_UIO_H 1
| #define HAVE_TERMIOS_H 1
| #define HAVE_STDBOOL_H 1
| #define HAVE_PWD_H 1
| #define HAVE_GRP_H 1
| #define USE_SYSLOG 1
| /* end confdefs.h. */
| #include "confdefs.h"
| #include <sys/types.h>
|
|
| int
| main ()
| {
| switch (0) case 0: case (sizeof (short) == 8):;
| ;
| return 0;
| }
configure:11971: gcc -c -g -O2 conftest.c >&5
conftest.c: In function `main':
conftest.c:59: error: duplicate case value
conftest.c:59: error: previously used here
configure:11977: $? = 1
configure: failed program was:
| /* confdefs.h. */
| #define PACKAGE_NAME "clamav"
| #define PACKAGE_TARNAME "clamav"
| #define PACKAGE_VERSION "devel"
| #define PACKAGE_STRING "clamav devel"
| #define PACKAGE_BUGREPORT "http://bugs.clamav.net/"
| #define PACKAGE PACKAGE_NAME
| #define VERSION "0.93"
| #define STDC_HEADERS 1
| #define HAVE_SYS_TYPES_H 1
| #define HAVE_SYS_STAT_H 1
| #define HAVE_STDLIB_H 1
| #define HAVE_STRING_H 1
| #define HAVE_MEMORY_H 1
| #define HAVE_STRINGS_H 1
| #define HAVE_INTTYPES_H 1
| #define HAVE_STDINT_H 1
| #define HAVE_UNISTD_H 1
| #define HAVE_DLFCN_H 1
| #define SCANBUFF 131072
| #define FILEBUFF 8192
| #define STDC_HEADERS 1
| #define restrict __restrict
| #define FPU_WORDS_BIGENDIAN 1
| #define WORDS_BIGENDIAN 1
| #define WORDS_BIGENDIAN 1
| #define HAVE_STDINT_H 1
| #define HAVE_UNISTD_H 1
| #define HAVE_SYS_INT_TYPES_H 1
| #define HAVE_DLFCN_H 1
| #define HAVE_INTTYPES_H 1
| #define HAVE_SYS_INTTYPES_H 1
| #define HAVE_MEMORY_H 1
| #define HAVE_STDLIB_H 1
| #define HAVE_STRINGS_H 1
| #define HAVE_STRING_H 1
| #define HAVE_SYS_MMAN_H 1
| #define HAVE_SYS_PARAM_H 1
| #define HAVE_SYS_STAT_H 1
| #define HAVE_SYS_TYPES_H 1
| #define HAVE_MALLOC_H 1
| #define HAVE_POLL_H 1
| #define HAVE_LIMITS_H 1
| #define HAVE_SYS_FILIO_H 1
| #define HAVE_SYS_UIO_H 1
| #define HAVE_TERMIOS_H 1
| #define HAVE_STDBOOL_H 1
| #define HAVE_PWD_H 1
| #define HAVE_GRP_H 1
| #define USE_SYSLOG 1
| /* end confdefs.h. */
| #include "confdefs.h"
| #include <sys/types.h>
|
|
| int
| main ()
| {
| switch (0) case 0: case (sizeof (short) == 1):;
| ;
| return 0;
| }
configure:11971: gcc -c -g -O2 conftest.c >&5
configure:11977: $? = 0
configure:12001: result: 2
configure:12009: checking size of int
configure:12039: gcc -c -g -O2 conftest.c >&5
configure:12045: $? = 0
configure:12069: result: 4
configure:12077: checking size of long
configure:12107: gcc -c -g -O2 conftest.c >&5
configure:12113: $? = 0
configure:12137: result: 4
configure:12145: checking size of long long
configure:12175: gcc -c -g -O2 conftest.c >&5
conftest.c: In function `main':
conftest.c:62: error: duplicate case value
conftest.c:62: error: previously used here
configure:12181: $? = 1
configure: failed program was:
| /* confdefs.h. */
| #define PACKAGE_NAME "clamav"
| #define PACKAGE_TARNAME "clamav"
| #define PACKAGE_VERSION "devel"
| #define PACKAGE_STRING "clamav devel"
| #define PACKAGE_BUGREPORT "http://bugs.clamav.net/"
| #define PACKAGE PACKAGE_NAME
| #define VERSION "0.93"
| #define STDC_HEADERS 1
| #define HAVE_SYS_TYPES_H 1
| #define HAVE_SYS_STAT_H 1
| #define HAVE_STDLIB_H 1
| #define HAVE_STRING_H 1
| #define HAVE_MEMORY_H 1
| #define HAVE_STRINGS_H 1
| #define HAVE_INTTYPES_H 1
| #define HAVE_STDINT_H 1
| #define HAVE_UNISTD_H 1
| #define HAVE_DLFCN_H 1
| #define SCANBUFF 131072
| #define FILEBUFF 8192
| #define STDC_HEADERS 1
| #define restrict __restrict
| #define FPU_WORDS_BIGENDIAN 1
| #define WORDS_BIGENDIAN 1
| #define WORDS_BIGENDIAN 1
| #define HAVE_STDINT_H 1
| #define HAVE_UNISTD_H 1
| #define HAVE_SYS_INT_TYPES_H 1
| #define HAVE_DLFCN_H 1
| #define HAVE_INTTYPES_H 1
| #define HAVE_SYS_INTTYPES_H 1
| #define HAVE_MEMORY_H 1
| #define HAVE_STDLIB_H 1
| #define HAVE_STRINGS_H 1
| #define HAVE_STRING_H 1
| #define HAVE_SYS_MMAN_H 1
| #define HAVE_SYS_PARAM_H 1
| #define HAVE_SYS_STAT_H 1
| #define HAVE_SYS_TYPES_H 1
| #define HAVE_MALLOC_H 1
| #define HAVE_POLL_H 1
| #define HAVE_LIMITS_H 1
| #define HAVE_SYS_FILIO_H 1
| #define HAVE_SYS_UIO_H 1
| #define HAVE_TERMIOS_H 1
| #define HAVE_STDBOOL_H 1
| #define HAVE_PWD_H 1
| #define HAVE_GRP_H 1
| #define USE_SYSLOG 1
| #define SIZEOF_SHORT 2
| #define SIZEOF_INT 4
| #define SIZEOF_LONG 4
| /* end confdefs.h. */
| #include "confdefs.h"
| #include <sys/types.h>
|
|
| int
| main ()
| {
| switch (0) case 0: case (sizeof (long long) == 4):;
| ;
| return 0;
| }
configure:12175: gcc -c -g -O2 conftest.c >&5
configure:12181: $? = 0
configure:12205: result: 8
configure:12230: checking for bind in -lsocket
configure:12265: gcc -o conftest -g -O2 conftest.c -lsocket >&5
configure:12271: $? = 0
configure:12289: result: yes
configure:12295: checking for library containing gethostent
configure:12336: gcc -o conftest -g -O2 conftest.c -lsocket >&5
Undefined first referenced
symbol in file
gethostent /var/tmp//ccgcJBB8.o (symbol belongs to implicit dependency /usr/lib/libnsl.so.1)
ld: fatal: Symbol referencing errors. No output written to conftest
collect2: ld returned 1 exit status
configure:12342: $? = 1
configure: failed program was:
| /* confdefs.h. */
| #define PACKAGE_NAME "clamav"
| #define PACKAGE_TARNAME "clamav"
| #define PACKAGE_VERSION "devel"
| #define PACKAGE_STRING "clamav devel"
| #define PACKAGE_BUGREPORT "http://bugs.clamav.net/"
| #define PACKAGE PACKAGE_NAME
| #define VERSION "0.93"
| #define STDC_HEADERS 1
| #define HAVE_SYS_TYPES_H 1
| #define HAVE_SYS_STAT_H 1
| #define HAVE_STDLIB_H 1
| #define HAVE_STRING_H 1
| #define HAVE_MEMORY_H 1
| #define HAVE_STRINGS_H 1
| #define HAVE_INTTYPES_H 1
| #define HAVE_STDINT_H 1
| #define HAVE_UNISTD_H 1
| #define HAVE_DLFCN_H 1
| #define SCANBUFF 131072
| #define FILEBUFF 8192
| #define STDC_HEADERS 1
| #define restrict __restrict
| #define FPU_WORDS_BIGENDIAN 1
| #define WORDS_BIGENDIAN 1
| #define WORDS_BIGENDIAN 1
| #define HAVE_STDINT_H 1
| #define HAVE_UNISTD_H 1
| #define HAVE_SYS_INT_TYPES_H 1
| #define HAVE_DLFCN_H 1
| #define HAVE_INTTYPES_H 1
| #define HAVE_SYS_INTTYPES_H 1
| #define HAVE_MEMORY_H 1
| #define HAVE_STDLIB_H 1
| #define HAVE_STRINGS_H 1
| #define HAVE_STRING_H 1
| #define HAVE_SYS_MMAN_H 1
| #define HAVE_SYS_PARAM_H 1
| #define HAVE_SYS_STAT_H 1
| #define HAVE_SYS_TYPES_H 1
| #define HAVE_MALLOC_H 1
| #define HAVE_POLL_H 1
| #define HAVE_LIMITS_H 1
| #define HAVE_SYS_FILIO_H 1
| #define HAVE_SYS_UIO_H 1
| #define HAVE_TERMIOS_H 1
| #define HAVE_STDBOOL_H 1
| #define HAVE_PWD_H 1
| #define HAVE_GRP_H 1
| #define USE_SYSLOG 1
| #define SIZEOF_SHORT 2
| #define SIZEOF_INT 4
| #define SIZEOF_LONG 4
| #define SIZEOF_LONG_LONG 8
| /* end confdefs.h. */
|
| /* Override any GCC internal prototype to avoid an error.
| Use char because int might match the return type of a GCC
| builtin and then its argument prototype would still apply. */
| #ifdef __cplusplus
| extern "C"
| #endif
| char gethostent ();
| int
| main ()
| {
| return gethostent ();
| ;
| return 0;
| }
configure:12336: gcc -o conftest -g -O2 conftest.c -lnsl -lsocket >&5
configure:12342: $? = 0
configure:12370: result: -lnsl
configure:12396: checking for poll
configure:12452: gcc -o conftest -g -O2 conftest.c -lnsl -lsocket >&5
configure:12458: $? = 0
configure:12476: result: yes
configure:12396: checking for setsid
configure:12452: gcc -o conftest -g -O2 conftest.c -lnsl -lsocket >&5
configure:12458: $? = 0
configure:12476: result: yes
configure:12396: checking for memcpy
configure:12452: gcc -o conftest -g -O2 conftest.c -lnsl -lsocket >&5
conftest.c:81: warning: conflicting types for built-in function 'memcpy'
configure:12458: $? = 0
configure:12476: result: yes
configure:12396: checking for snprintf
configure:12452: gcc -o conftest -g -O2 conftest.c -lnsl -lsocket >&5
conftest.c:82: warning: conflicting types for built-in function 'snprintf'
configure:12458: $? = 0
configure:12476: result: yes
configure:12396: checking for vsnprintf
configure:12452: gcc -o conftest -g -O2 conftest.c -lnsl -lsocket >&5
conftest.c:83: warning: conflicting types for built-in function 'vsnprintf'
configure:12458: $? = 0
configure:12476: result: yes
configure:12396: checking for strerror_r
configure:12452: gcc -o conftest -g -O2 conftest.c -lnsl -lsocket >&5
configure:12458: $? = 0
configure:12476: result: yes
configure:12396: checking for strlcpy
configure:12452: gcc -o conftest -g -O2 conftest.c -lnsl -lsocket >&5
configure:12458: $? = 0
configure:12476: result: yes
configure:12396: checking for strlcat
configure:12452: gcc -o conftest -g -O2 conftest.c -lnsl -lsocket >&5
configure:12458: $? = 0
configure:12476: result: yes
configure:12396: checking for strcasestr
configure:12452: gcc -o conftest -g -O2 conftest.c -lnsl -lsocket >&5
Undefined first referenced
symbol in file
strcasestr /var/tmp//cc6dOaMS.o
ld: fatal: Symbol referencing errors. No output written to conftest
collect2: ld returned 1 exit status
configure:12458: $? = 1
configure: failed program was:
| /* confdefs.h. */
| #define PACKAGE_NAME "clamav"
| #define PACKAGE_TARNAME "clamav"
| #define PACKAGE_VERSION "devel"
| #define PACKAGE_STRING "clamav devel"
| #define PACKAGE_BUGREPORT "http://bugs.clamav.net/"
| #define PACKAGE PACKAGE_NAME
| #define VERSION "0.93"
| #define STDC_HEADERS 1
| #define HAVE_SYS_TYPES_H 1
| #define HAVE_SYS_STAT_H 1
| #define HAVE_STDLIB_H 1
| #define HAVE_STRING_H 1
| #define HAVE_MEMORY_H 1
| #define HAVE_STRINGS_H 1
| #define HAVE_INTTYPES_H 1
| #define HAVE_STDINT_H 1
| #define HAVE_UNISTD_H 1
| #define HAVE_DLFCN_H 1
| #define SCANBUFF 131072
| #define FILEBUFF 8192
| #define STDC_HEADERS 1
| #define restrict __restrict
| #define FPU_WORDS_BIGENDIAN 1
| #define WORDS_BIGENDIAN 1
| #define WORDS_BIGENDIAN 1
| #define HAVE_STDINT_H 1
| #define HAVE_UNISTD_H 1
| #define HAVE_SYS_INT_TYPES_H 1
| #define HAVE_DLFCN_H 1
| #define HAVE_INTTYPES_H 1
| #define HAVE_SYS_INTTYPES_H 1
| #define HAVE_MEMORY_H 1
| #define HAVE_STDLIB_H 1
| #define HAVE_STRINGS_H 1
| #define HAVE_STRING_H 1
| #define HAVE_SYS_MMAN_H 1
| #define HAVE_SYS_PARAM_H 1
| #define HAVE_SYS_STAT_H 1
| #define HAVE_SYS_TYPES_H 1
| #define HAVE_MALLOC_H 1
| #define HAVE_POLL_H 1
| #define HAVE_LIMITS_H 1
| #define HAVE_SYS_FILIO_H 1
| #define HAVE_SYS_UIO_H 1
| #define HAVE_TERMIOS_H 1
| #define HAVE_STDBOOL_H 1
| #define HAVE_PWD_H 1
| #define HAVE_GRP_H 1
| #define USE_SYSLOG 1
| #define SIZEOF_SHORT 2
| #define SIZEOF_INT 4
| #define SIZEOF_LONG 4
| #define SIZEOF_LONG_LONG 8
| #define HAVE_POLL 1
| #define HAVE_SETSID 1
| #define HAVE_MEMCPY 1
| #define HAVE_SNPRINTF 1
| #define HAVE_VSNPRINTF 1
| #define HAVE_STRERROR_R 1
| #define HAVE_STRLCPY 1
| #define HAVE_STRLCAT 1
| /* end confdefs.h. */
| /* Define strcasestr to an innocuous variant, in case <limits.h> declares strcasestr.
| For example, HP-UX 11i <limits.h> declares gettimeofday. */
| #define strcasestr innocuous_strcasestr
|
| /* System header to define __stub macros and hopefully few prototypes,
| which can conflict with char strcasestr (); below.
| Prefer <limits.h> to <assert.h> if __STDC__ is defined, since
| <limits.h> exists even on freestanding compilers. */
|
| #ifdef __STDC__
| # include <limits.h>
| #else
| # include <assert.h>
| #endif
|
| #undef strcasestr
|
| /* Override any GCC internal prototype to avoid an error.
| Use char because int might match the return type of a GCC
| builtin and then its argument prototype would still apply. */
| #ifdef __cplusplus
| extern "C"
| #endif
| char strcasestr ();
| /* The GNU C library defines this for functions which it implements
| to always fail with ENOSYS. Some functions are actually named
| something starting with __ and the normal name is an alias. */
| #if defined __stub_strcasestr || defined __stub___strcasestr
| choke me
| #endif
|
| int
| main ()
| {
| return strcasestr ();
| ;
| return 0;
| }
configure:12476: result: no
configure:12396: checking for inet_ntop
configure:12452: gcc -o conftest -g -O2 conftest.c -lnsl -lsocket >&5
configure:12458: $? = 0
configure:12476: result: yes
configure:12396: checking for setgroups
configure:12452: gcc -o conftest -g -O2 conftest.c -lnsl -lsocket >&5
configure:12458: $? = 0
configure:12476: result: yes
configure:12396: checking for initgroups
configure:12452: gcc -o conftest -g -O2 conftest.c -lnsl -lsocket >&5
configure:12458: $? = 0
configure:12476: result: yes
configure:12396: checking for ctime_r
configure:12452: gcc -o conftest -g -O2 conftest.c -lnsl -lsocket >&5
configure:12458: $? = 0
configure:12476: result: yes
configure:12396: checking for mkstemp
configure:12452: gcc -o conftest -g -O2 conftest.c -lnsl -lsocket >&5
configure:12458: $? = 0
configure:12476: result: yes
configure:12492: checking for stdlib.h
configure:12498: result: yes
configure:12492: checking for unistd.h
configure:12498: result: yes
configure:12636: checking for getpagesize
configure:12692: gcc -o conftest -g -O2 conftest.c -lnsl -lsocket >&5
configure:12698: $? = 0
configure:12716: result: yes
configure:12726: checking for working mmap
configure:12873: gcc -o conftest -g -O2 conftest.c -lnsl -lsocket >&5
configure:12876: $? = 0
configure:12882: ./conftest
configure:12885: $? = 0
configure:12901: result: yes
configure:12912: checking for _LARGEFILE_SOURCE value needed for large files
configure:12941: gcc -o conftest -g -O2 conftest.c -lnsl -lsocket >&5
configure:12947: $? = 0
configure:13013: result: no
configure:13048: checking pthread.h usability
configure:13065: gcc -c -g -O2 conftest.c >&5
configure:13071: $? = 0
configure:13085: result: yes
configure:13089: checking pthread.h presence
configure:13104: gcc -E conftest.c
configure:13110: $? = 0
configure:13124: result: yes
configure:13157: checking for pthread.h
configure:13164: result: yes
configure:13174: checking whether to enable maintainer-specific portions of Makefiles
configure:13183: result: no
configure:13196: checking for zlib installation
configure:13215: result: /usr/local
configure:13260: checking for inflateEnd in -lz
configure:13295: gcc -o conftest -g -O2 -I/usr/local/include -lnsl -lsocket -L/usr/local/lib conftest.c -lz -lnsl -lsocket >&5
configure:13301: $? = 0
configure:13319: result: yes
configure:13461: checking for ld used by GCC
configure:13525: result: /usr/ccs/bin/ld
configure:13534: checking if the linker (/usr/ccs/bin/ld) is GNU ld
configure:13547: result: no
configure:13554: checking for shared library run path origin
configure:13567: result: done
configure:13610: checking how to link with libbz2
configure:14057: result: /usr/local/lib/libbz2.a
configure:14095: checking for bzReadOpen in -lbz2
configure:14130: gcc -o conftest -g -O2 -I/usr/local/include -lnsl -lsocket -L/usr/local/lib conftest.c -lbz2 -lnsl -lsocket >&5
Undefined first referenced
symbol in file
bzReadOpen /var/tmp//ccYe0qHb.o
ld: fatal: Symbol referencing errors. No output written to conftest
collect2: ld returned 1 exit status
configure:14136: $? = 1
configure: failed program was:
| /* confdefs.h. */
| #define PACKAGE_NAME "clamav"
| #define PACKAGE_TARNAME "clamav"
| #define PACKAGE_VERSION "devel"
| #define PACKAGE_STRING "clamav devel"
| #define PACKAGE_BUGREPORT "http://bugs.clamav.net/"
| #define PACKAGE PACKAGE_NAME
| #define VERSION "0.93"
| #define STDC_HEADERS 1
| #define HAVE_SYS_TYPES_H 1
| #define HAVE_SYS_STAT_H 1
| #define HAVE_STDLIB_H 1
| #define HAVE_STRING_H 1
| #define HAVE_MEMORY_H 1
| #define HAVE_STRINGS_H 1
| #define HAVE_INTTYPES_H 1
| #define HAVE_STDINT_H 1
| #define HAVE_UNISTD_H 1
| #define HAVE_DLFCN_H 1
| #define SCANBUFF 131072
| #define FILEBUFF 8192
| #define STDC_HEADERS 1
| #define restrict __restrict
| #define FPU_WORDS_BIGENDIAN 1
| #define WORDS_BIGENDIAN 1
| #define WORDS_BIGENDIAN 1
| #define HAVE_STDINT_H 1
| #define HAVE_UNISTD_H 1
| #define HAVE_SYS_INT_TYPES_H 1
| #define HAVE_DLFCN_H 1
| #define HAVE_INTTYPES_H 1
| #define HAVE_SYS_INTTYPES_H 1
| #define HAVE_MEMORY_H 1
| #define HAVE_STDLIB_H 1
| #define HAVE_STRINGS_H 1
| #define HAVE_STRING_H 1
| #define HAVE_SYS_MMAN_H 1
| #define HAVE_SYS_PARAM_H 1
| #define HAVE_SYS_STAT_H 1
| #define HAVE_SYS_TYPES_H 1
| #define HAVE_MALLOC_H 1
| #define HAVE_POLL_H 1
| #define HAVE_LIMITS_H 1
| #define HAVE_SYS_FILIO_H 1
| #define HAVE_SYS_UIO_H 1
| #define HAVE_TERMIOS_H 1
| #define HAVE_STDBOOL_H 1
| #define HAVE_PWD_H 1
| #define HAVE_GRP_H 1
| #define USE_SYSLOG 1
| #define SIZEOF_SHORT 2
| #define SIZEOF_INT 4
| #define SIZEOF_LONG 4
| #define SIZEOF_LONG_LONG 8
| #define HAVE_POLL 1
| #define HAVE_SETSID 1
| #define HAVE_MEMCPY 1
| #define HAVE_SNPRINTF 1
| #define HAVE_VSNPRINTF 1
| #define HAVE_STRERROR_R 1
| #define HAVE_STRLCPY 1
| #define HAVE_STRLCAT 1
| #define HAVE_INET_NTOP 1
| #define HAVE_SETGROUPS 1
| #define HAVE_INITGROUPS 1
| #define HAVE_CTIME_R 1
| #define HAVE_MKSTEMP 1
| #define HAVE_STDLIB_H 1
| #define HAVE_UNISTD_H 1
| #define HAVE_GETPAGESIZE 1
| #define HAVE_MMAP 1
| #define HAVE_FSEEKO 1
| #define HAVE_ZLIB_H 1
| /* end confdefs.h. */
|
| /* Override any GCC internal prototype to avoid an error.
| Use char because int might match the return type of a GCC
| builtin and then its argument prototype would still apply. */
| #ifdef __cplusplus
| extern "C"
| #endif
| char bzReadOpen ();
| int
| main ()
| {
| return bzReadOpen ();
| ;
| return 0;
| }
configure:14154: result: no
configure:14177: checking bzlib.h usability
configure:14194: gcc -c -g -O2 -I/usr/local/include conftest.c >&5
configure:14200: $? = 0
configure:14214: result: yes
configure:14218: checking bzlib.h presence
configure:14233: gcc -E -I/usr/local/include conftest.c
configure:14239: $? = 0
configure:14253: result: yes
configure:14286: checking for bzlib.h
configure:14293: result: yes
configure:14333: checking for __dn_expand in -lresolv
configure:14368: gcc -o conftest -g -O2 -I/usr/local/include conftest.c -lresolv -lnsl -lsocket >&5
Undefined first referenced
symbol in file
__dn_expand /var/tmp//ccon5Thr.o
ld: fatal: Symbol referencing errors. No output written to conftest
collect2: ld returned 1 exit status
configure:14374: $? = 1
configure: failed program was:
| /* confdefs.h. */
| #define PACKAGE_NAME "clamav"
| #define PACKAGE_TARNAME "clamav"
| #define PACKAGE_VERSION "devel"
| #define PACKAGE_STRING "clamav devel"
| #define PACKAGE_BUGREPORT "http://bugs.clamav.net/"
| #define PACKAGE PACKAGE_NAME
| #define VERSION "0.93"
| #define STDC_HEADERS 1
| #define HAVE_SYS_TYPES_H 1
| #define HAVE_SYS_STAT_H 1
| #define HAVE_STDLIB_H 1
| #define HAVE_STRING_H 1
| #define HAVE_MEMORY_H 1
| #define HAVE_STRINGS_H 1
| #define HAVE_INTTYPES_H 1
| #define HAVE_STDINT_H 1
| #define HAVE_UNISTD_H 1
| #define HAVE_DLFCN_H 1
| #define SCANBUFF 131072
| #define FILEBUFF 8192
| #define STDC_HEADERS 1
| #define restrict __restrict
| #define FPU_WORDS_BIGENDIAN 1
| #define WORDS_BIGENDIAN 1
| #define WORDS_BIGENDIAN 1
| #define HAVE_STDINT_H 1
| #define HAVE_UNISTD_H 1
| #define HAVE_SYS_INT_TYPES_H 1
| #define HAVE_DLFCN_H 1
| #define HAVE_INTTYPES_H 1
| #define HAVE_SYS_INTTYPES_H 1
| #define HAVE_MEMORY_H 1
| #define HAVE_STDLIB_H 1
| #define HAVE_STRINGS_H 1
| #define HAVE_STRING_H 1
| #define HAVE_SYS_MMAN_H 1
| #define HAVE_SYS_PARAM_H 1
| #define HAVE_SYS_STAT_H 1
| #define HAVE_SYS_TYPES_H 1
| #define HAVE_MALLOC_H 1
| #define HAVE_POLL_H 1
| #define HAVE_LIMITS_H 1
| #define HAVE_SYS_FILIO_H 1
| #define HAVE_SYS_UIO_H 1
| #define HAVE_TERMIOS_H 1
| #define HAVE_STDBOOL_H 1
| #define HAVE_PWD_H 1
| #define HAVE_GRP_H 1
| #define USE_SYSLOG 1
| #define SIZEOF_SHORT 2
| #define SIZEOF_INT 4
| #define SIZEOF_LONG 4
| #define SIZEOF_LONG_LONG 8
| #define HAVE_POLL 1
| #define HAVE_SETSID 1
| #define HAVE_MEMCPY 1
| #define HAVE_SNPRINTF 1
| #define HAVE_VSNPRINTF 1
| #define HAVE_STRERROR_R 1
| #define HAVE_STRLCPY 1
| #define HAVE_STRLCAT 1
| #define HAVE_INET_NTOP 1
| #define HAVE_SETGROUPS 1
| #define HAVE_INITGROUPS 1
| #define HAVE_CTIME_R 1
| #define HAVE_MKSTEMP 1
| #define HAVE_STDLIB_H 1
| #define HAVE_UNISTD_H 1
| #define HAVE_GETPAGESIZE 1
| #define HAVE_MMAP 1
| #define HAVE_FSEEKO 1
| #define HAVE_ZLIB_H 1
| #define HAVE_BZLIB_H 1
| /* end confdefs.h. */
|
| /* Override any GCC internal prototype to avoid an error.
| Use char because int might match the return type of a GCC
| builtin and then its argument prototype would still apply. */
| #ifdef __cplusplus
| extern "C"
| #endif
| char __dn_expand ();
| int
| main ()
| {
| return __dn_expand ();
| ;
| return 0;
| }
configure:14392: result: no
configure:14399: checking for dn_expand in -lresolv
configure:14434: gcc -o conftest -g -O2 -I/usr/local/include conftest.c -lresolv -lnsl -lsocket >&5
configure:14440: $? = 0
configure:14458: result: yes
configure:14465: checking for resolv.h
configure:14490: gcc -c -g -O2 -I/usr/local/include conftest.c >&5
configure:14496: $? = 0
configure:14511: result: yes
configure:14536: checking whether setpgrp takes no argument
configure:14570: gcc -o conftest -g -O2 -I/usr/local/include conftest.c -lnsl -lsocket >&5
conftest.c: In function `main':
conftest.c:116: error: too many arguments to function `setpgrp'
configure:14573: $? = 1
configure: program exited with status 1
configure: failed program was:
| /* confdefs.h. */
| #define PACKAGE_NAME "clamav"
| #define PACKAGE_TARNAME "clamav"
| #define PACKAGE_VERSION "devel"
| #define PACKAGE_STRING "clamav devel"
| #define PACKAGE_BUGREPORT "http://bugs.clamav.net/"
| #define PACKAGE PACKAGE_NAME
| #define VERSION "0.93"
| #define STDC_HEADERS 1
| #define HAVE_SYS_TYPES_H 1
| #define HAVE_SYS_STAT_H 1
| #define HAVE_STDLIB_H 1
| #define HAVE_STRING_H 1
| #define HAVE_MEMORY_H 1
| #define HAVE_STRINGS_H 1
| #define HAVE_INTTYPES_H 1
| #define HAVE_STDINT_H 1
| #define HAVE_UNISTD_H 1
| #define HAVE_DLFCN_H 1
| #define SCANBUFF 131072
| #define FILEBUFF 8192
| #define STDC_HEADERS 1
| #define restrict __restrict
| #define FPU_WORDS_BIGENDIAN 1
| #define WORDS_BIGENDIAN 1
| #define WORDS_BIGENDIAN 1
| #define HAVE_STDINT_H 1
| #define HAVE_UNISTD_H 1
| #define HAVE_SYS_INT_TYPES_H 1
| #define HAVE_DLFCN_H 1
| #define HAVE_INTTYPES_H 1
| #define HAVE_SYS_INTTYPES_H 1
| #define HAVE_MEMORY_H 1
| #define HAVE_STDLIB_H 1
| #define HAVE_STRINGS_H 1
| #define HAVE_STRING_H 1
| #define HAVE_SYS_MMAN_H 1
| #define HAVE_SYS_PARAM_H 1
| #define HAVE_SYS_STAT_H 1
| #define HAVE_SYS_TYPES_H 1
| #define HAVE_MALLOC_H 1
| #define HAVE_POLL_H 1
| #define HAVE_LIMITS_H 1
| #define HAVE_SYS_FILIO_H 1
| #define HAVE_SYS_UIO_H 1
| #define HAVE_TERMIOS_H 1
| #define HAVE_STDBOOL_H 1
| #define HAVE_PWD_H 1
| #define HAVE_GRP_H 1
| #define USE_SYSLOG 1
| #define SIZEOF_SHORT 2
| #define SIZEOF_INT 4
| #define SIZEOF_LONG 4
| #define SIZEOF_LONG_LONG 8
| #define HAVE_POLL 1
| #define HAVE_SETSID 1
| #define HAVE_MEMCPY 1
| #define HAVE_SNPRINTF 1
| #define HAVE_VSNPRINTF 1
| #define HAVE_STRERROR_R 1
| #define HAVE_STRLCPY 1
| #define HAVE_STRLCAT 1
| #define HAVE_INET_NTOP 1
| #define HAVE_SETGROUPS 1
| #define HAVE_INITGROUPS 1
| #define HAVE_CTIME_R 1
| #define HAVE_MKSTEMP 1
| #define HAVE_STDLIB_H 1
| #define HAVE_UNISTD_H 1
| #define HAVE_GETPAGESIZE 1
| #define HAVE_MMAP 1
| #define HAVE_FSEEKO 1
| #define HAVE_ZLIB_H 1
| #define HAVE_BZLIB_H 1
| #define HAVE_RESOLV_H 1
| /* end confdefs.h. */
| #include <stdio.h>
| #ifdef HAVE_SYS_TYPES_H
| # include <sys/types.h>
| #endif
| #ifdef HAVE_SYS_STAT_H
| # include <sys/stat.h>
| #endif
| #ifdef STDC_HEADERS
| # include <stdlib.h>
| # include <stddef.h>
| #else
| # ifdef HAVE_STDLIB_H
| # include <stdlib.h>
| # endif
| #endif
| #ifdef HAVE_STRING_H
| # if !defined STDC_HEADERS && defined HAVE_MEMORY_H
| # include <memory.h>
| # endif
| # include <string.h>
| #endif
| #ifdef HAVE_STRINGS_H
| # include <strings.h>
| #endif
| #ifdef HAVE_INTTYPES_H
| # include <inttypes.h>
| #endif
| #ifdef HAVE_STDINT_H
| # include <stdint.h>
| #endif
| #ifdef HAVE_UNISTD_H
| # include <unistd.h>
| #endif
| int
| main ()
| {
| /* If this system has a BSD-style setpgrp which takes arguments,
| setpgrp(1, 1) will fail with ESRCH and return -1, in that case
| exit successfully. */
| return setpgrp (1,1) != -1;
| ;
| return 0;
| }
configure:14598: result: yes
configure:15256: checking for libgmp
configure:15286: gcc -o conftest -g -O2 -I/usr/local/include conftest.c -lnsl -lsocket /usr/local/lib/libgmp.so -L/usr/local/lib -L/usr/local/ssl/lib -L/usr/openwin/lib -R/usr/local/lib -R/usr/local/BerkeleyDB.4.2/lib -R/usr/local/ssl/lib -R/usr/openwin/lib -R/usr/lib -R/usr/local/mysql/lib/mysql >&5
configure:15292: $? = 0
configure:15311: result: yes
configure:15320: checking how to link with libgmp
configure:15322: result: /usr/local/lib/libgmp.so -L/usr/local/lib -L/usr/local/ssl/lib -L/usr/openwin/lib -R/usr/local/lib -R/usr/local/BerkeleyDB.4.2/lib -R/usr/local/ssl/lib -R/usr/openwin/lib -R/usr/lib -R/usr/local/mysql/lib/mysql
configure:15362: checking for libiconv_open in -liconv
configure:15397: gcc -o conftest -g -O2 -I/usr/local/include conftest.c -liconv -lnsl -lsocket >&5
configure:15403: $? = 0
configure:15421: result: yes
configure:15427: checking for iconv
configure:15461: gcc -o conftest -g -O2 -I/usr/local/include conftest.c -L/usr/local/lib -lz -L/usr/local/lib -lbz2 -L/usr/local/lib -lgmp -L/usr/local/ssl/lib -L/usr/openwin/lib -R/usr/local/lib -R/usr/local/BerkeleyDB.4.2/lib -R/usr/local/ssl/lib -R/usr/openwin/lib -R/usr/lib -R/usr/local/mysql/lib/mysql -liconv >&5
conftest.c: In function `main':
conftest.c:90: warning: passing arg 2 of `libiconv' from incompatible pointer type
configure:15467: $? = 0
configure:15474: result: yes
configure:15674: checking whether in_port_t is defined
configure:15700: gcc -c -g -O2 -I/usr/local/include conftest.c >&5
configure:15706: $? = 0
configure:15712: result: yes
configure:15730: checking for in_addr_t definition
configure:15756: gcc -c -g -O2 -I/usr/local/include conftest.c >&5
configure:15762: $? = 0
configure:15768: result: yes
configure:16726: checking for recvmsg
configure:16782: gcc -o conftest -g -O2 -I/usr/local/include conftest.c -lnsl -lsocket >&5
configure:16788: $? = 0
configure:16806: result: yes
configure:16726: checking for sendmsg
configure:16782: gcc -o conftest -g -O2 -I/usr/local/include conftest.c -lnsl -lsocket >&5
configure:16788: $? = 0
configure:16806: result: yes
configure:16816: checking for msg_accrights field in struct msghdr
configure:16855: gcc -c -g -O2 -I/usr/local/include conftest.c >&5
configure:16861: $? = 0
configure:16877: result: yes
configure:16887: checking for msg_control field in struct msghdr
configure:16925: gcc -c -g -O2 -I/usr/local/include conftest.c >&5
conftest.c: In function `main':
conftest.c:107: error: structure has no member named `msg_control'
configure:16931: $? = 1
configure: failed program was:
| /* confdefs.h. */
| #define PACKAGE_NAME "clamav"
| #define PACKAGE_TARNAME "clamav"
| #define PACKAGE_VERSION "devel"
| #define PACKAGE_STRING "clamav devel"
| #define PACKAGE_BUGREPORT "http://bugs.clamav.net/"
| #define PACKAGE PACKAGE_NAME
| #define VERSION "0.93"
| #define STDC_HEADERS 1
| #define HAVE_SYS_TYPES_H 1
| #define HAVE_SYS_STAT_H 1
| #define HAVE_STDLIB_H 1
| #define HAVE_STRING_H 1
| #define HAVE_MEMORY_H 1
| #define HAVE_STRINGS_H 1
| #define HAVE_INTTYPES_H 1
| #define HAVE_STDINT_H 1
| #define HAVE_UNISTD_H 1
| #define HAVE_DLFCN_H 1
| #define SCANBUFF 131072
| #define FILEBUFF 8192
| #define STDC_HEADERS 1
| #define restrict __restrict
| #define FPU_WORDS_BIGENDIAN 1
| #define WORDS_BIGENDIAN 1
| #define WORDS_BIGENDIAN 1
| #define HAVE_STDINT_H 1
| #define HAVE_UNISTD_H 1
| #define HAVE_SYS_INT_TYPES_H 1
| #define HAVE_DLFCN_H 1
| #define HAVE_INTTYPES_H 1
| #define HAVE_SYS_INTTYPES_H 1
| #define HAVE_MEMORY_H 1
| #define HAVE_STDLIB_H 1
| #define HAVE_STRINGS_H 1
| #define HAVE_STRING_H 1
| #define HAVE_SYS_MMAN_H 1
| #define HAVE_SYS_PARAM_H 1
| #define HAVE_SYS_STAT_H 1
| #define HAVE_SYS_TYPES_H 1
| #define HAVE_MALLOC_H 1
| #define HAVE_POLL_H 1
| #define HAVE_LIMITS_H 1
| #define HAVE_SYS_FILIO_H 1
| #define HAVE_SYS_UIO_H 1
| #define HAVE_TERMIOS_H 1
| #define HAVE_STDBOOL_H 1
| #define HAVE_PWD_H 1
| #define HAVE_GRP_H 1
| #define USE_SYSLOG 1
| #define SIZEOF_SHORT 2
| #define SIZEOF_INT 4
| #define SIZEOF_LONG 4
| #define SIZEOF_LONG_LONG 8
| #define HAVE_POLL 1
| #define HAVE_SETSID 1
| #define HAVE_MEMCPY 1
| #define HAVE_SNPRINTF 1
| #define HAVE_VSNPRINTF 1
| #define HAVE_STRERROR_R 1
| #define HAVE_STRLCPY 1
| #define HAVE_STRLCAT 1
| #define HAVE_INET_NTOP 1
| #define HAVE_SETGROUPS 1
| #define HAVE_INITGROUPS 1
| #define HAVE_CTIME_R 1
| #define HAVE_MKSTEMP 1
| #define HAVE_STDLIB_H 1
| #define HAVE_UNISTD_H 1
| #define HAVE_GETPAGESIZE 1
| #define HAVE_MMAP 1
| #define HAVE_FSEEKO 1
| #define HAVE_ZLIB_H 1
| #define HAVE_BZLIB_H 1
| #define HAVE_RESOLV_H 1
| #define SETPGRP_VOID 1
| #define HAVE_LIBGMP 1
| #define HAVE_ICONV 1
| #define CLAMAVUSER "clamav"
| #define CLAMAVGROUP "clamav"
| #define DATADIR "/usr/local/share/clamav"
| #define CONFDIR "/usr/local/etc"
| #define HAVE_IN_PORT_T 1
| #define HAVE_IN_ADDR_T 1
| #define CL_THREAD_SAFE 1
| #define _REENTRANT 1
| #define C_SOLARIS 1
| #define BUILD_CLAMD 1
| #define ENABLE_UNRAR 1
| #define HAVE_RECVMSG 1
| #define HAVE_SENDMSG 1
| #define HAVE_ACCRIGHTS_IN_MSGHDR 1
| /* end confdefs.h. */
|
| #include <sys/types.h>
| #include <sys/socket.h>
| #include <sys/uio.h>
|
| int
| main ()
| {
|
| #ifdef msg_control
| #error msg_control defined
| #endif
| struct msghdr m;
| m.msg_control = 0;
| return 0;
|
| ;
| return 0;
| }
configure:16947: result: no
configure:17254: checking for gethostbyname_r
configure:17288: gcc -c -g -O2 -I/usr/local/include conftest.c >&5
configure:17294: $? = 0
configure:17449: result: yes, and it takes 5 arguments
configure:17454: checking for readdir_r
configure:17485: gcc -c -g -O2 -I/usr/local/include conftest.c >&5
configure:17491: $? = 0
configure:17567: result: support disabled
configure:17590: checking for ctime_r
configure:17620: gcc -c -g -O2 -I/usr/local/include conftest.c >&5
configure:17626: $? = 0
configure:17655: result: yes, and it takes 3 arguments
configure:17659: checking for socklen_t
configure:17693: gcc -c -g -O2 -I/usr/local/include conftest.c >&5
configure:17699: $? = 0
configure:17718: result: yes
configure:17796: checking for clamav in /etc/passwd
configure:17887: result: yes, user clamav and group clamav
configure:17896: checking for structure packing via __attribute__((packed))
configure:17927: gcc -c -g -O2 -I/usr/local/include conftest.c >&5
configure:17933: $? = 0
configure:17950: result: yes
configure:18095: checking for type aligning via __attribute__((aligned))
configure:18122: gcc -c -g -O2 -I/usr/local/include conftest.c >&5
configure:18128: $? = 0
configure:18145: result: yes
configure:18170: checking for fd_set
configure:18193: gcc -c -g -O2 -I/usr/local/include conftest.c >&5
configure:18199: $? = 0
configure:18214: result: yes, found in sys/types.h
configure:18251: checking default FD_SETSIZE value
configure:18294: gcc -o conftest -g -O2 -I/usr/local/include conftest.c -lnsl -lsocket >&5
configure:18297: $? = 0
configure:18303: ./conftest
configure:18306: $? = 0
configure:18321: result: 1024
configure:18329: checking whether signed right shift is sign extended
configure:18348: gcc -o conftest -g -O2 -I/usr/local/include conftest.c -lnsl -lsocket >&5
configure:18351: $? = 0
configure:18357: ./conftest
configure:18360: $? = 0
configure:18382: result: yes
configure:18536: creating ./config.status
## ---------------------- ##
## Running config.status. ##
## ---------------------- ##
This file was extended by clamav config.status devel, which was
generated by GNU Autoconf 2.61. Invocation command line was
CONFIG_FILES =
CONFIG_HEADERS =
CONFIG_LINKS =
CONFIG_COMMANDS =
$ ./config.status
on proxy1
config.status:716: creating libclamunrar/Makefile
config.status:716: creating libclamunrar_iface/Makefile
config.status:716: creating libclamav/Makefile
config.status:716: creating libclamav/lzma/Makefile
config.status:716: creating clamscan/Makefile
config.status:716: creating database/Makefile
config.status:716: creating docs/Makefile
config.status:716: creating clamd/Makefile
config.status:716: creating clamdscan/Makefile
config.status:716: creating clamav-milter/Makefile
config.status:716: creating freshclam/Makefile
config.status:716: creating sigtool/Makefile
config.status:716: creating clamconf/Makefile
config.status:716: creating etc/Makefile
config.status:716: creating test/Makefile
config.status:716: creating Makefile
config.status:716: creating clamav-config
config.status:716: creating libclamav.pc
config.status:716: creating docs/man/clamav-milter.8
config.status:716: creating docs/man/clamconf.1
config.status:716: creating docs/man/clamd.8
config.status:716: creating docs/man/clamd.conf.5
config.status:716: creating docs/man/clamdscan.1
config.status:716: creating docs/man/clamscan.1
config.status:716: creating docs/man/freshclam.1
config.status:716: creating docs/man/freshclam.conf.5
config.status:716: creating docs/man/sigtool.1
config.status:716: creating clamav-config.h
config.status:1029: clamav-config.h is unchanged
config.status:1076: executing depfiles commands
## ---------------- ##
## Cache variables. ##
## ---------------- ##
ac_cv_build=sparc-sun-solaris2.10
ac_cv_c_bigendian=yes
ac_cv_c_compiler_gnu=yes
ac_cv_c_const=yes
ac_cv_c_fpu_bigendian=yes
ac_cv_c_inline=inline
ac_cv_c_restrict=__restrict
ac_cv_ctime_args=3
ac_cv_env_CC_set=
ac_cv_env_CC_value=
ac_cv_env_CFLAGS_set=
ac_cv_env_CFLAGS_value=
ac_cv_env_CPPFLAGS_set=
ac_cv_env_CPPFLAGS_value=
ac_cv_env_CPP_set=
ac_cv_env_CPP_value=
ac_cv_env_LDFLAGS_set=
ac_cv_env_LDFLAGS_value=
ac_cv_env_LIBS_set=
ac_cv_env_LIBS_value=
ac_cv_env_build_alias_set=
ac_cv_env_build_alias_value=
ac_cv_env_host_alias_set=
ac_cv_env_host_alias_value=
ac_cv_env_target_alias_set=
ac_cv_env_target_alias_value=
ac_cv_func_ctime_r=yes
ac_cv_func_getpagesize=yes
ac_cv_func_inet_ntop=yes
ac_cv_func_initgroups=yes
ac_cv_func_memcpy=yes
ac_cv_func_mkstemp=yes
ac_cv_func_mmap_fixed_mapped=yes
ac_cv_func_poll=yes
ac_cv_func_recvmsg=yes
ac_cv_func_sendmsg=yes
ac_cv_func_setgroups=yes
ac_cv_func_setpgrp_void=yes
ac_cv_func_setsid=yes
ac_cv_func_snprintf=yes
ac_cv_func_strcasestr=no
ac_cv_func_strerror_r=yes
ac_cv_func_strlcat=yes
ac_cv_func_strlcpy=yes
ac_cv_func_vsnprintf=yes
ac_cv_gethostbyname_args=5
ac_cv_have_accrights_in_msghdr=yes
ac_cv_have_control_in_msghdr=no
ac_cv_header_bzlib_h=yes
ac_cv_header_dlfcn_h=yes
ac_cv_header_grp_h=yes
ac_cv_header_inttypes_h=yes
ac_cv_header_limits_h=yes
ac_cv_header_malloc_h=yes
ac_cv_header_memory_h=yes
ac_cv_header_ndir_h=no
ac_cv_header_poll_h=yes
ac_cv_header_pthread_h=yes
ac_cv_header_pwd_h=yes
ac_cv_header_resolv_h=yes
ac_cv_header_stdbool_h=yes
ac_cv_header_stdc=yes
ac_cv_header_stdint_h=yes
ac_cv_header_stdlib_h=yes
ac_cv_header_string_h=yes
ac_cv_header_strings_h=yes
ac_cv_header_sys_filio_h=yes
ac_cv_header_sys_int_types_h=yes
ac_cv_header_sys_inttypes_h=yes
ac_cv_header_sys_mman_h=yes
ac_cv_header_sys_param_h=yes
ac_cv_header_sys_stat_h=yes
ac_cv_header_sys_types_h=yes
ac_cv_header_sys_uio_h=yes
ac_cv_header_syslog_h=yes
ac_cv_header_termios_h=yes
ac_cv_header_unistd_h=yes
ac_cv_host=sparc-sun-solaris2.10
ac_cv_ld_version_script=yes
ac_cv_lib_bz2_bzReadOpen=no
ac_cv_lib_iconv_libiconv_open=yes
ac_cv_lib_resolv___dn_expand=no
ac_cv_lib_resolv_dn_expand=yes
ac_cv_lib_socket_bind=yes
ac_cv_lib_z_inflateEnd=yes
ac_cv_libbz2_cppflags=
ac_cv_libbz2_libs=/usr/local/lib/libbz2.a
ac_cv_libbz2_ltlibs='-L/usr/local/lib -lbz2'
ac_cv_libbz2_prefix=/usr/local
ac_cv_libgmp=yes
ac_cv_objext=o
ac_cv_path_EGREP='/usr/sfw/bin/ggrep -E'
ac_cv_path_GREP=/usr/sfw/bin/ggrep
ac_cv_prog_AWK=nawk
ac_cv_prog_CPP='gcc -E'
ac_cv_prog_ac_ct_CC=gcc
ac_cv_prog_cc_c89=
ac_cv_prog_cc_g=yes
ac_cv_prog_make_make_set=yes
ac_cv_readdir_args=2
ac_cv_search_gethostent=-lnsl
ac_cv_sizeof_int=4
ac_cv_sizeof_long=4
ac_cv_sizeof_long_long=8
ac_cv_sizeof_short=2
ac_cv_socklen_t=yes
ac_cv_sys_largefile_source=no
ac_cv_target=sparc-sun-solaris2.10
ac_cv_type_off_t=yes
acl_cv_hardcode_direct=no
acl_cv_hardcode_libdir_flag_spec='-R$libdir'
acl_cv_hardcode_libdir_separator=
acl_cv_hardcode_minus_L=no
acl_cv_libext=a
acl_cv_libname_spec='lib$name'
acl_cv_library_names_spec='$libname$shrext'
acl_cv_path_LD=/usr/ccs/bin/ld
acl_cv_prog_gnu_ld=no
acl_cv_rpath=done
acl_cv_shlibext=so
acl_cv_wl=-Wl,
am_cv_CC_dependencies_compiler_type=gcc3
lt_cv_deplibs_check_method=pass_all
lt_cv_file_magic_cmd='$MAGIC_CMD'
lt_cv_file_magic_test_file=
lt_cv_ld_reload_flag=-r
lt_cv_objdir=.libs
lt_cv_path_LD=/usr/ccs/bin/ld
lt_cv_path_NM='/usr/ccs/bin/nm -p'
lt_cv_path_SED=/bin/sed
lt_cv_prog_compiler_c_o=yes
lt_cv_prog_compiler_pic_works=yes
lt_cv_prog_compiler_rtti_exceptions=no
lt_cv_prog_compiler_static_works=no
lt_cv_prog_gnu_ld=no
lt_cv_sys_global_symbol_pipe='sed -n -e '\''s/^.*[ ]\([BDRT][BDRT]*\)[ ][ ]*\([_A-Za-z][_A-Za-z0-9]*\)$/\1 \2 \2/p'\'''
lt_cv_sys_global_symbol_to_c_name_address='sed -n -e '\''s/^: \([^ ]*\) $/ {\"\1\", (lt_ptr) 0},/p'\'' -e '\''s/^[BCDEGRST] \([^ ]*\) \([^ ]*\)$/ {"\2", (lt_ptr) \&\2},/p'\'''
lt_cv_sys_global_symbol_to_cdecl='sed -n -e '\''s/^. .* \(.*\)$/extern int \1;/p'\'''
lt_cv_sys_lib_dlsearch_path_spec='/lib /usr/lib'
lt_cv_sys_lib_search_path_spec='/usr/local/lib/gcc/sparc-sun-solaris2.10/3.4.6 /usr/ccs/bin /usr/ccs/lib /usr/local/lib /lib /usr/lib'
lt_cv_sys_max_cmd_len=786240
lt_lt_cv_prog_compiler_c_o='"yes"'
lt_lt_cv_sys_global_symbol_pipe='"sed -n -e '\''s/^.*[ ]\\([BDRT][BDRT]*\\)[ ][ ]*\\([_A-Za-z][_A-Za-z0-9]*\\)\$/\\1 \\2 \\2/p'\''"'
lt_lt_cv_sys_global_symbol_to_c_name_address='"sed -n -e '\''s/^: \\([^ ]*\\) \$/ {\\\"\\1\\\", (lt_ptr) 0},/p'\'' -e '\''s/^[BCDEGRST] \\([^ ]*\\) \\([^ ]*\\)\$/ {\"\\2\", (lt_ptr) \\&\\2},/p'\''"'
lt_lt_cv_sys_global_symbol_to_cdecl='"sed -n -e '\''s/^. .* \\(.*\\)\$/extern int \\1;/p'\''"'
## ----------------- ##
## Output variables. ##
## ----------------- ##
ACLOCAL='${SHELL} /usr/local/packages/clamav-0.93/config/missing --run aclocal-1.10'
AMDEPBACKSLASH='\'
AMDEP_FALSE='#'
AMDEP_TRUE=''
AMTAR='${SHELL} /usr/local/packages/clamav-0.93/config/missing --run tar'
AR='false'
AUTOCONF='${SHELL} /usr/local/packages/clamav-0.93/config/missing --run autoconf'
AUTOHEADER='${SHELL} /usr/local/packages/clamav-0.93/config/missing --run autoheader'
AUTOMAKE='${SHELL} /usr/local/packages/clamav-0.93/config/missing --run automake-1.10'
AWK='nawk'
BUILD_CLAMD_FALSE='#'
BUILD_CLAMD_TRUE=''
CC='gcc'
CCDEPMODE='depmode=gcc3'
CFGDIR='/usr/local/etc'
CFLAGS='-g -O2'
CLAMAVGROUP='clamav'
CLAMAVUSER='clamav'
CLAMAV_MILTER_LIBS=' -lsocket -lresolv -lresolv'
CLAMD_LIBS=' -lsocket -lresolv'
CPP='gcc -E'
CPPFLAGS=' -I/usr/local/include'
CYGPATH_W='echo'
DBDIR='/usr/local/share/clamav'
DEFS='-DHAVE_CONFIG_H'
DEPDIR='.deps'
DSYMUTIL=''
ECHO='echo'
ECHO_C=''
ECHO_N='-n'
ECHO_T=''
EGREP='/usr/sfw/bin/ggrep -E'
ENABLE_UNRAR_FALSE='#'
ENABLE_UNRAR_TRUE=''
EXEEXT=''
FRESHCLAM_LIBS=' -lsocket -lresolv -lresolv'
GETENT=''
GREP='/usr/sfw/bin/ggrep'
HAVE_LIBGMP='yes'
HAVE_MILTER_FALSE=''
HAVE_MILTER_TRUE='#'
INSTALL_DATA='${INSTALL} -m 644'
INSTALL_PROGRAM='${INSTALL}'
INSTALL_SCRIPT='${INSTALL}'
INSTALL_STRIP_PROGRAM='$(install_sh) -c -s'
LDFLAGS=''
LIBBZ2='/usr/local/lib/libbz2.a'
LIBBZ2_PREFIX='/usr/local'
LIBCLAMAV_LIBS=' -L/usr/local/lib -lz -L/usr/local/lib -lbz2 -L/usr/local/lib -lgmp -L/usr/local/ssl/lib -L/usr/openwin/lib -R/usr/local/lib -R/usr/local/BerkeleyDB.4.2/lib -R/usr/local/ssl/lib -R/usr/openwin/lib -R/usr/lib -R/usr/local/mysql/lib/mysql -liconv'
LIBCLAMAV_VERSION='4:1:0'
LIBGMP='/usr/local/lib/libgmp.so -L/usr/local/lib -L/usr/local/ssl/lib -L/usr/openwin/lib -R/usr/local/lib -R/usr/local/BerkeleyDB.4.2/lib -R/usr/local/ssl/lib -R/usr/openwin/lib -R/usr/lib -R/usr/local/mysql/lib/mysql'
LIBGMP_PREFIX='/usr/local'
LIBOBJS=''
LIBS='-lnsl -lsocket'
LIBTOOL='$(SHELL) $(top_builddir)/libtool'
LN_S='ln -s'
LTLIBBZ2='-L/usr/local/lib -lbz2'
LTLIBGMP='-L/usr/local/lib -lgmp -L/usr/local/ssl/lib -L/usr/openwin/lib -R/usr/local/lib -R/usr/local/BerkeleyDB.4.2/lib -R/usr/local/ssl/lib -R/usr/openwin/lib -R/usr/lib -R/usr/local/mysql/lib/mysql'
LTLIBOBJS=''
MAINT='#'
MAINTAINER_MODE_FALSE=''
MAINTAINER_MODE_TRUE='#'
MAKEINFO='${SHELL} /usr/local/packages/clamav-0.93/config/missing --run makeinfo'
NMEDIT=''
OBJEXT='o'
PACKAGE='clamav'
PACKAGE_BUGREPORT='http://bugs.clamav.net/'
PACKAGE_NAME='clamav'
PACKAGE_STRING='clamav devel'
PACKAGE_TARNAME='clamav'
PACKAGE_VERSION='devel'
PATH_SEPARATOR=':'
RANLIB=':'
SED='/bin/sed'
SET_MAKE=''
SHELL='/bin/bash'
STRIP=':'
THREAD_LIBS='-lpthread'
TH_SAFE='-thread-safe'
VERSION='0.93'
VERSIONSCRIPTFLAG='-M'
VERSIONSCRIPT_FALSE='#'
VERSIONSCRIPT_TRUE=''
ac_ct_CC='gcc'
am__fastdepCC_FALSE='#'
am__fastdepCC_TRUE=''
am__include='include'
am__isrc=''
am__leading_dot='.'
am__quote=''
am__tar='${AMTAR} chof - "$$tardir"'
am__untar='${AMTAR} xf -'
bindir='${exec_prefix}/bin'
build='sparc-sun-solaris2.10'
build_alias=''
build_cpu='sparc'
build_os='solaris2.10'
build_vendor='sun'
datadir='${datarootdir}'
datarootdir='${prefix}/share'
docdir='${datarootdir}/doc/${PACKAGE_TARNAME}'
dvidir='${docdir}'
exec_prefix='${prefix}'
host='sparc-sun-solaris2.10'
host_alias=''
host_cpu='sparc'
host_os='solaris2.10'
host_vendor='sun'
htmldir='${docdir}'
includedir='${prefix}/include'
infodir='${datarootdir}/info'
install_sh='$(SHELL) /usr/local/packages/clamav-0.93/config/install-sh'
libdir='${exec_prefix}/lib'
libexecdir='${exec_prefix}/libexec'
localedir='${datarootdir}/locale'
localstatedir='${prefix}/var'
mandir='${datarootdir}/man'
mkdir_p='$(top_builddir)/config/install-sh -c -d'
oldincludedir='/usr/include'
pdfdir='${docdir}'
prefix='/usr/local'
program_transform_name='s,x,x,'
psdir='${docdir}'
sbindir='${exec_prefix}/sbin'
sendmailprog=''
sharedstatedir='${prefix}/com'
sysconfdir='${prefix}/etc'
target='sparc-sun-solaris2.10'
target_alias=''
target_cpu='sparc'
target_os='solaris2.10'
target_vendor='sun'
## ----------- ##
## confdefs.h. ##
## ----------- ##
#define PACKAGE_NAME "clamav"
#define PACKAGE_TARNAME "clamav"
#define PACKAGE_VERSION "devel"
#define PACKAGE_STRING "clamav devel"
#define PACKAGE_BUGREPORT "http://bugs.clamav.net/"
#define PACKAGE PACKAGE_NAME
#define VERSION "0.93"
#define STDC_HEADERS 1
#define HAVE_SYS_TYPES_H 1
#define HAVE_SYS_STAT_H 1
#define HAVE_STDLIB_H 1
#define HAVE_STRING_H 1
#define HAVE_MEMORY_H 1
#define HAVE_STRINGS_H 1
#define HAVE_INTTYPES_H 1
#define HAVE_STDINT_H 1
#define HAVE_UNISTD_H 1
#define HAVE_DLFCN_H 1
#define SCANBUFF 131072
#define FILEBUFF 8192
#define STDC_HEADERS 1
#define restrict __restrict
#define FPU_WORDS_BIGENDIAN 1
#define WORDS_BIGENDIAN 1
#define WORDS_BIGENDIAN 1
#define HAVE_STDINT_H 1
#define HAVE_UNISTD_H 1
#define HAVE_SYS_INT_TYPES_H 1
#define HAVE_DLFCN_H 1
#define HAVE_INTTYPES_H 1
#define HAVE_SYS_INTTYPES_H 1
#define HAVE_MEMORY_H 1
#define HAVE_STDLIB_H 1
#define HAVE_STRINGS_H 1
#define HAVE_STRING_H 1
#define HAVE_SYS_MMAN_H 1
#define HAVE_SYS_PARAM_H 1
#define HAVE_SYS_STAT_H 1
#define HAVE_SYS_TYPES_H 1
#define HAVE_MALLOC_H 1
#define HAVE_POLL_H 1
#define HAVE_LIMITS_H 1
#define HAVE_SYS_FILIO_H 1
#define HAVE_SYS_UIO_H 1
#define HAVE_TERMIOS_H 1
#define HAVE_STDBOOL_H 1
#define HAVE_PWD_H 1
#define HAVE_GRP_H 1
#define USE_SYSLOG 1
#define SIZEOF_SHORT 2
#define SIZEOF_INT 4
#define SIZEOF_LONG 4
#define SIZEOF_LONG_LONG 8
#define HAVE_POLL 1
#define HAVE_SETSID 1
#define HAVE_MEMCPY 1
#define HAVE_SNPRINTF 1
#define HAVE_VSNPRINTF 1
#define HAVE_STRERROR_R 1
#define HAVE_STRLCPY 1
#define HAVE_STRLCAT 1
#define HAVE_INET_NTOP 1
#define HAVE_SETGROUPS 1
#define HAVE_INITGROUPS 1
#define HAVE_CTIME_R 1
#define HAVE_MKSTEMP 1
#define HAVE_STDLIB_H 1
#define HAVE_UNISTD_H 1
#define HAVE_GETPAGESIZE 1
#define HAVE_MMAP 1
#define HAVE_FSEEKO 1
#define HAVE_ZLIB_H 1
#define HAVE_BZLIB_H 1
#define HAVE_RESOLV_H 1
#define SETPGRP_VOID 1
#define HAVE_LIBGMP 1
#define HAVE_ICONV 1
#define CLAMAVUSER "clamav"
#define CLAMAVGROUP "clamav"
#define DATADIR "/usr/local/share/clamav"
#define CONFDIR "/usr/local/etc"
#define HAVE_IN_PORT_T 1
#define HAVE_IN_ADDR_T 1
#define CL_THREAD_SAFE 1
#define _REENTRANT 1
#define C_SOLARIS 1
#define BUILD_CLAMD 1
#define ENABLE_UNRAR 1
#define HAVE_RECVMSG 1
#define HAVE_SENDMSG 1
#define HAVE_ACCRIGHTS_IN_MSGHDR 1
#define HAVE_GETHOSTBYNAME_R_5 1
#define HAVE_CTIME_R_3 1
#define HAVE_ATTRIB_PACKED 1
#define HAVE_ATTRIB_ALIGNED 1
#define DEFAULT_FD_SETSIZE 1024
#define HAVE_SAR 1
configure: exit 0