rendered paste bodyThis file contains any messages produced by compilers while
running configure, to aid debugging if configure makes a mistake.
It was created by audacious configure 1.9.0, which was
generated by GNU Autoconf 2.61. Invocation command line was
$ ./configure --enable-sse2
## --------- ##
## Platform. ##
## --------- ##
hostname = rocko
uname -m = i686
uname -r = 2.6.22-14-generic
uname -s = Linux
uname -v = #1 SMP Tue Feb 12 07:42:25 UTC 2008
/usr/bin/uname -p = unknown
/bin/uname -X = unknown
/bin/arch = unknown
/usr/bin/arch -k = unknown
/usr/convex/getsysinfo = unknown
/usr/bin/hostinfo = unknown
/bin/machine = unknown
/usr/bin/oslevel = unknown
/bin/universe = unknown
PATH: /usr/local/sbin
PATH: /usr/local/bin
PATH: /usr/sbin
PATH: /usr/bin
PATH: /sbin
PATH: /bin
PATH: /usr/bin/X11
PATH: /usr/games
## ----------- ##
## Core tests. ##
## ----------- ##
configure:1968: checking build system type
configure:1986: result: i686-pc-linux-gnu
configure:2008: checking host system type
configure:2023: result: i686-pc-linux-gnu
configure:2045: checking target system type
configure:2060: result: i686-pc-linux-gnu
configure:2145: checking for pkg-config
configure:2163: found /usr/bin/pkg-config
configure:2175: result: /usr/bin/pkg-config
configure:2204: checking pkg-config is at least version 0.9.0
configure:2207: result: yes
configure:2238: checking whether we need an implib
configure:2248: result: no
configure:2259: checking for shared library system
configure:2327: result: POSIX
configure:2368: checking if you are running Apple-GCC
configure:2377: result: no
configure:2383: checking whether make sets $(MAKE)
configure:2404: result: yes
configure:2426: checking for a BSD-compatible install
configure:2482: result: /usr/bin/install -c
configure:2507: checking whether NLS is requested
configure:2516: result: yes
configure:2554: checking for msgfmt
configure:2585: result: /usr/bin/msgfmt
configure:2594: checking for gmsgfmt
configure:2625: result: /usr/bin/msgfmt
configure:2665: checking for xgettext
configure:2696: result: /usr/bin/xgettext
configure:2736: checking for msgmerge
configure:2766: result: /usr/bin/msgmerge
configure:2849: checking for gcc
configure:2865: found /usr/bin/gcc
configure:2876: result: gcc
configure:3114: checking for C compiler version
configure:3121: gcc --version >&5
gcc (GCC) 4.1.3 20070929 (prerelease) (Ubuntu 4.1.2-16ubuntu2)
Copyright (C) 2006 Free Software Foundation, Inc.
This is free software; see the source for copying conditions. There is NO
warranty; not even for MERCHANTABILITY or FITNESS FOR A PARTICULAR PURPOSE.
configure:3124: $? = 0
configure:3131: gcc -v >&5
Using built-in specs.
Target: i486-linux-gnu
Configured with: ../src/configure -v --enable-languages=c,c++,fortran,objc,obj-c++,treelang --prefix=/usr --enable-shared --with-system-zlib --libexecdir=/usr/lib --without-included-gettext --enable-threads=posix --enable-nls --with-gxx-include-dir=/usr/include/c++/4.1.3 --program-suffix=-4.1 --enable-__cxa_atexit --enable-clocale=gnu --enable-libstdcxx-debug --enable-mpfr --enable-checking=release i486-linux-gnu
Thread model: posix
gcc version 4.1.3 20070929 (prerelease) (Ubuntu 4.1.2-16ubuntu2)
configure:3134: $? = 0
configure:3141: gcc -V >&5
gcc: '-V' option must have argument
configure:3144: $? = 1
configure:3167: checking for C compiler default output file name
configure:3194: gcc conftest.c >&5
configure:3197: $? = 0
configure:3235: result: a.out
configure:3252: checking whether the C compiler works
configure:3262: ./a.out
configure:3265: $? = 0
configure:3282: result: yes
configure:3289: checking whether we are cross compiling
configure:3291: result: no
configure:3294: checking for suffix of executables
configure:3301: gcc -o conftest conftest.c >&5
configure:3304: $? = 0
configure:3328: result:
configure:3334: checking for suffix of object files
configure:3360: gcc -c conftest.c >&5
configure:3363: $? = 0
configure:3386: result: o
configure:3390: checking whether we are using the GNU C compiler
configure:3419: gcc -c conftest.c >&5
configure:3425: $? = 0
configure:3442: result: yes
configure:3447: checking whether gcc accepts -g
configure:3477: gcc -c -g conftest.c >&5
configure:3483: $? = 0
configure:3582: result: yes
configure:3599: checking for gcc option to accept ISO C89
configure:3673: gcc -c -g -O2 conftest.c >&5
configure:3679: $? = 0
configure:3702: result: none needed
configure:3763: checking for ranlib
configure:3779: found /usr/bin/ranlib
configure:3790: result: ranlib
configure:3818: checking for strerror in -lcposix
configure:3853: gcc -o conftest -g -O2 conftest.c -lcposix >&5
/usr/bin/ld: cannot find -lcposix
collect2: ld returned 1 exit status
configure:3859: $? = 1
configure: failed program was:
| /* confdefs.h. */
| #define PACKAGE_NAME "audacious"
| #define PACKAGE_TARNAME "audacious"
| #define PACKAGE_VERSION "1.9.0"
| #define PACKAGE_STRING "audacious 1.9.0"
| #define PACKAGE_BUGREPORT "bugs+audacious@atheme.org"
| #define _GNU_SOURCE 1
| #define PACKAGE "audacious"
| #define VERSION "1.9.0"
| #define SHARED_SUFFIX ".so"
| /* end confdefs.h. */
|
| /* Override any GCC internal prototype to avoid an error.
| Use char because int might match the return type of a GCC
| builtin and then its argument prototype would still apply. */
| #ifdef __cplusplus
| extern "C"
| #endif
| char strerror ();
| int
| main ()
| {
| return strerror ();
| ;
| return 0;
| }
configure:3877: result: no
configure:3890: checking how to run the C preprocessor
configure:3930: gcc -E conftest.c
configure:3936: $? = 0
configure:3967: gcc -E conftest.c
conftest.c:12:28: error: ac_nonexistent.h: No such file or directory
configure:3973: $? = 1
configure: failed program was:
| /* confdefs.h. */
| #define PACKAGE_NAME "audacious"
| #define PACKAGE_TARNAME "audacious"
| #define PACKAGE_VERSION "1.9.0"
| #define PACKAGE_STRING "audacious 1.9.0"
| #define PACKAGE_BUGREPORT "bugs+audacious@atheme.org"
| #define _GNU_SOURCE 1
| #define PACKAGE "audacious"
| #define VERSION "1.9.0"
| #define SHARED_SUFFIX ".so"
| /* end confdefs.h. */
| #include <ac_nonexistent.h>
configure:4006: result: gcc -E
configure:4035: gcc -E conftest.c
configure:4041: $? = 0
configure:4072: gcc -E conftest.c
conftest.c:12:28: error: ac_nonexistent.h: No such file or directory
configure:4078: $? = 1
configure: failed program was:
| /* confdefs.h. */
| #define PACKAGE_NAME "audacious"
| #define PACKAGE_TARNAME "audacious"
| #define PACKAGE_VERSION "1.9.0"
| #define PACKAGE_STRING "audacious 1.9.0"
| #define PACKAGE_BUGREPORT "bugs+audacious@atheme.org"
| #define _GNU_SOURCE 1
| #define PACKAGE "audacious"
| #define VERSION "1.9.0"
| #define SHARED_SUFFIX ".so"
| /* end confdefs.h. */
| #include <ac_nonexistent.h>
configure:4116: checking for grep that handles long lines and -e
configure:4190: result: /bin/grep
configure:4195: checking for egrep
configure:4273: result: /bin/grep -E
configure:4278: checking for ANSI C header files
configure:4308: gcc -c -g -O2 conftest.c >&5
configure:4314: $? = 0
configure:4413: gcc -o conftest -g -O2 conftest.c >&5
configure:4416: $? = 0
configure:4422: ./conftest
configure:4425: $? = 0
configure:4442: result: yes
configure:4452: checking for an ANSI C-conforming const
configure:4527: gcc -c -g -O2 conftest.c >&5
configure:4533: $? = 0
configure:4548: result: yes
configure:4558: checking for inline
configure:4584: gcc -c -g -O2 conftest.c >&5
configure:4590: $? = 0
configure:4608: result: inline
configure:4641: checking for sys/types.h
configure:4662: gcc -c -g -O2 conftest.c >&5
configure:4668: $? = 0
configure:4684: result: yes
configure:4641: checking for sys/stat.h
configure:4662: gcc -c -g -O2 conftest.c >&5
configure:4668: $? = 0
configure:4684: result: yes
configure:4641: checking for stdlib.h
configure:4662: gcc -c -g -O2 conftest.c >&5
configure:4668: $? = 0
configure:4684: result: yes
configure:4641: checking for string.h
configure:4662: gcc -c -g -O2 conftest.c >&5
configure:4668: $? = 0
configure:4684: result: yes
configure:4641: checking for memory.h
configure:4662: gcc -c -g -O2 conftest.c >&5
configure:4668: $? = 0
configure:4684: result: yes
configure:4641: checking for strings.h
configure:4662: gcc -c -g -O2 conftest.c >&5
configure:4668: $? = 0
configure:4684: result: yes
configure:4641: checking for inttypes.h
configure:4662: gcc -c -g -O2 conftest.c >&5
configure:4668: $? = 0
configure:4684: result: yes
configure:4641: checking for stdint.h
configure:4662: gcc -c -g -O2 conftest.c >&5
configure:4668: $? = 0
configure:4684: result: yes
configure:4641: checking for unistd.h
configure:4662: gcc -c -g -O2 conftest.c >&5
configure:4668: $? = 0
configure:4684: result: yes
configure:4696: checking for off_t
configure:4726: gcc -c -g -O2 conftest.c >&5
configure:4732: $? = 0
configure:4747: result: yes
configure:4759: checking for size_t
configure:4789: gcc -c -g -O2 conftest.c >&5
configure:4795: $? = 0
configure:4810: result: yes
configure:4824: checking for working alloca.h
configure:4851: gcc -o conftest -g -O2 conftest.c >&5
configure:4857: $? = 0
configure:4874: result: yes
configure:4884: checking for alloca
configure:4931: gcc -o conftest -g -O2 conftest.c >&5
configure:4937: $? = 0
configure:4954: result: yes
configure:5187: checking for stdlib.h
configure:5193: result: yes
configure:5187: checking for unistd.h
configure:5193: result: yes
configure:5331: checking for getpagesize
configure:5387: gcc -o conftest -g -O2 conftest.c >&5
configure:5393: $? = 0
configure:5411: result: yes
configure:5421: checking for working mmap
configure:5568: gcc -o conftest -g -O2 conftest.c >&5
configure:5571: $? = 0
configure:5577: ./conftest
configure:5580: $? = 0
configure:5596: result: yes
configure:5608: checking whether we are using the GNU C Library 2.1 or newer
configure:5639: result: yes
configure:5647: checking whether integer division by zero raises SIGFPE
configure:5714: gcc -o conftest -g -O2 conftest.c >&5
configure:5717: $? = 0
configure:5723: ./conftest
configure:5726: $? = 0
configure:5743: result: yes
configure:5756: checking for inttypes.h
configure:5783: gcc -c -g -O2 conftest.c >&5
configure:5789: $? = 0
configure:5804: result: yes
configure:5815: checking for stdint.h
configure:5842: gcc -c -g -O2 conftest.c >&5
configure:5848: $? = 0
configure:5863: result: yes
configure:5874: checking for unsigned long long
configure:5901: gcc -o conftest -g -O2 conftest.c >&5
configure:5907: $? = 0
configure:5924: result: yes
configure:5956: checking for inttypes.h
configure:5984: gcc -c -g -O2 conftest.c >&5
configure:5990: $? = 0
configure:6006: result: yes
configure:6019: checking whether the inttypes.h PRIxNN macros are broken
configure:6050: gcc -c -g -O2 conftest.c >&5
configure:6056: $? = 0
configure:6072: result: no
configure:6123: checking for ld used by GCC
configure:6186: result: /usr/bin/ld
configure:6195: checking if the linker (/usr/bin/ld) is GNU ld
GNU ld (GNU Binutils for Ubuntu) 2.18
configure:6207: result: yes
configure:6213: checking for shared library run path origin
configure:6226: result: done
configure:6646: checking argz.h usability
configure:6663: gcc -c -g -O2 conftest.c >&5
configure:6669: $? = 0
configure:6683: result: yes
configure:6687: checking argz.h presence
configure:6702: gcc -E conftest.c
configure:6708: $? = 0
configure:6722: result: yes
configure:6755: checking for argz.h
configure:6763: result: yes
configure:6646: checking limits.h usability
configure:6663: gcc -c -g -O2 conftest.c >&5
configure:6669: $? = 0
configure:6683: result: yes
configure:6687: checking limits.h presence
configure:6702: gcc -E conftest.c
configure:6708: $? = 0
configure:6722: result: yes
configure:6755: checking for limits.h
configure:6763: result: yes
configure:6646: checking locale.h usability
configure:6663: gcc -c -g -O2 conftest.c >&5
configure:6669: $? = 0
configure:6683: result: yes
configure:6687: checking locale.h presence
configure:6702: gcc -E conftest.c
configure:6708: $? = 0
configure:6722: result: yes
configure:6755: checking for locale.h
configure:6763: result: yes
configure:6646: checking nl_types.h usability
configure:6663: gcc -c -g -O2 conftest.c >&5
configure:6669: $? = 0
configure:6683: result: yes
configure:6687: checking nl_types.h presence
configure:6702: gcc -E conftest.c
configure:6708: $? = 0
configure:6722: result: yes
configure:6755: checking for nl_types.h
configure:6763: result: yes
configure:6646: checking malloc.h usability
configure:6663: gcc -c -g -O2 conftest.c >&5
configure:6669: $? = 0
configure:6683: result: yes
configure:6687: checking malloc.h presence
configure:6702: gcc -E conftest.c
configure:6708: $? = 0
configure:6722: result: yes
configure:6755: checking for malloc.h
configure:6763: result: yes
configure:6646: checking stddef.h usability
configure:6663: gcc -c -g -O2 conftest.c >&5
configure:6669: $? = 0
configure:6683: result: yes
configure:6687: checking stddef.h presence
configure:6702: gcc -E conftest.c
configure:6708: $? = 0
configure:6722: result: yes
configure:6755: checking for stddef.h
configure:6763: result: yes
configure:6636: checking for stdlib.h
configure:6642: result: yes
configure:6636: checking for string.h
configure:6642: result: yes
configure:6636: checking for unistd.h
configure:6642: result: yes
configure:6646: checking sys/param.h usability
configure:6663: gcc -c -g -O2 conftest.c >&5
configure:6669: $? = 0
configure:6683: result: yes
configure:6687: checking sys/param.h presence
configure:6702: gcc -E conftest.c
configure:6708: $? = 0
configure:6722: result: yes
configure:6755: checking for sys/param.h
configure:6763: result: yes
configure:6804: checking for feof_unlocked
configure:6860: gcc -o conftest -g -O2 conftest.c >&5
configure:6866: $? = 0
configure:6884: result: yes
configure:6804: checking for fgets_unlocked
configure:6860: gcc -o conftest -g -O2 conftest.c >&5
configure:6866: $? = 0
configure:6884: result: yes
configure:6804: checking for getc_unlocked
configure:6860: gcc -o conftest -g -O2 conftest.c >&5
configure:6866: $? = 0
configure:6884: result: yes
configure:6804: checking for getcwd
configure:6860: gcc -o conftest -g -O2 conftest.c >&5
configure:6866: $? = 0
configure:6884: result: yes
configure:6804: checking for getegid
configure:6860: gcc -o conftest -g -O2 conftest.c >&5
configure:6866: $? = 0
configure:6884: result: yes
configure:6804: checking for geteuid
configure:6860: gcc -o conftest -g -O2 conftest.c >&5
configure:6866: $? = 0
configure:6884: result: yes
configure:6804: checking for getgid
configure:6860: gcc -o conftest -g -O2 conftest.c >&5
configure:6866: $? = 0
configure:6884: result: yes
configure:6804: checking for getuid
configure:6860: gcc -o conftest -g -O2 conftest.c >&5
configure:6866: $? = 0
configure:6884: result: yes
configure:6804: checking for mempcpy
configure:6860: gcc -o conftest -g -O2 conftest.c >&5
conftest.c:75: warning: conflicting types for built-in function 'mempcpy'
configure:6866: $? = 0
configure:6884: result: yes
configure:6804: checking for munmap
configure:6860: gcc -o conftest -g -O2 conftest.c >&5
configure:6866: $? = 0
configure:6884: result: yes
configure:6804: checking for putenv
configure:6860: gcc -o conftest -g -O2 conftest.c >&5
configure:6866: $? = 0
configure:6884: result: yes
configure:6804: checking for setenv
configure:6860: gcc -o conftest -g -O2 conftest.c >&5
configure:6866: $? = 0
configure:6884: result: yes
configure:6804: checking for setlocale
configure:6860: gcc -o conftest -g -O2 conftest.c >&5
configure:6866: $? = 0
configure:6884: result: yes
configure:6804: checking for stpcpy
configure:6860: gcc -o conftest -g -O2 conftest.c >&5
conftest.c:80: warning: conflicting types for built-in function 'stpcpy'
configure:6866: $? = 0
configure:6884: result: yes
configure:6804: checking for strcasecmp
configure:6860: gcc -o conftest -g -O2 conftest.c >&5
conftest.c:81: warning: conflicting types for built-in function 'strcasecmp'
configure:6866: $? = 0
configure:6884: result: yes
configure:6804: checking for strdup
configure:6860: gcc -o conftest -g -O2 conftest.c >&5
conftest.c:82: warning: conflicting types for built-in function 'strdup'
configure:6866: $? = 0
configure:6884: result: yes
configure:6804: checking for strtoul
configure:6860: gcc -o conftest -g -O2 conftest.c >&5
configure:6866: $? = 0
configure:6884: result: yes
configure:6804: checking for tsearch
configure:6860: gcc -o conftest -g -O2 conftest.c >&5
configure:6866: $? = 0
configure:6884: result: yes
configure:6804: checking for __argz_count
configure:6860: gcc -o conftest -g -O2 conftest.c >&5
configure:6866: $? = 0
configure:6884: result: yes
configure:6804: checking for __argz_stringify
configure:6860: gcc -o conftest -g -O2 conftest.c >&5
configure:6866: $? = 0
configure:6884: result: yes
configure:6804: checking for __argz_next
configure:6860: gcc -o conftest -g -O2 conftest.c >&5
configure:6866: $? = 0
configure:6884: result: yes
configure:6804: checking for __fsetlocking
configure:6860: gcc -o conftest -g -O2 conftest.c >&5
configure:6866: $? = 0
configure:6884: result: yes
configure:6925: checking for iconv
configure:6957: gcc -o conftest -g -O2 conftest.c >&5
configure:6963: $? = 0
configure:7033: result: yes
configure:7056: checking for iconv declaration
configure:7095: gcc -c -g -O2 conftest.c >&5
configure:7101: $? = 0
configure:7120: result:
extern size_t iconv (iconv_t cd, char * *inbuf, size_t *inbytesleft, char * *outbuf, size_t *outbytesleft);
configure:7131: checking for nl_langinfo and CODESET
configure:7157: gcc -o conftest -g -O2 conftest.c >&5
configure:7163: $? = 0
configure:7181: result: yes
configure:7193: checking for LC_MESSAGES
configure:7219: gcc -o conftest -g -O2 conftest.c >&5
configure:7225: $? = 0
configure:7242: result: yes
configure:7258: checking for bison
configure:7274: found /usr/bin/bison
configure:7285: result: bison
configure:7299: checking version of bison
configure:7308: result: 2.3, ok
configure:7330: checking whether NLS is requested
configure:7339: result: yes
configure:7356: checking whether included gettext is requested
configure:7366: result: no
configure:7377: checking for GNU gettext in libc
configure:7406: gcc -o conftest -g -O2 conftest.c >&5
configure:7412: $? = 0
configure:7429: result: yes
configure:7978: checking whether to use NLS
configure:7980: result: yes
configure:7983: checking where the gettext function comes from
configure:7994: result: libc
configure:8088: checking for GNU make
configure:8104: result: make
configure:8163: checking for gcc
configure:8190: result: gcc
configure:8428: checking for C compiler version
configure:8435: gcc --version >&5
gcc (GCC) 4.1.3 20070929 (prerelease) (Ubuntu 4.1.2-16ubuntu2)
Copyright (C) 2006 Free Software Foundation, Inc.
This is free software; see the source for copying conditions. There is NO
warranty; not even for MERCHANTABILITY or FITNESS FOR A PARTICULAR PURPOSE.
configure:8438: $? = 0
configure:8445: gcc -v >&5
Using built-in specs.
Target: i486-linux-gnu
Configured with: ../src/configure -v --enable-languages=c,c++,fortran,objc,obj-c++,treelang --prefix=/usr --enable-shared --with-system-zlib --libexecdir=/usr/lib --without-included-gettext --enable-threads=posix --enable-nls --with-gxx-include-dir=/usr/include/c++/4.1.3 --program-suffix=-4.1 --enable-__cxa_atexit --enable-clocale=gnu --enable-libstdcxx-debug --enable-mpfr --enable-checking=release i486-linux-gnu
Thread model: posix
gcc version 4.1.3 20070929 (prerelease) (Ubuntu 4.1.2-16ubuntu2)
configure:8448: $? = 0
configure:8455: gcc -V >&5
gcc: '-V' option must have argument
configure:8458: $? = 1
configure:8461: checking whether we are using the GNU C compiler
configure:8513: result: yes
configure:8518: checking whether gcc accepts -g
configure:8653: result: yes
configure:8670: checking for gcc option to accept ISO C89
configure:8773: result: none needed
configure:8849: checking for g++
configure:8865: found /usr/bin/g++
configure:8876: result: g++
configure:8907: checking for C++ compiler version
configure:8914: g++ --version >&5
g++ (GCC) 4.1.3 20070929 (prerelease) (Ubuntu 4.1.2-16ubuntu2)
Copyright (C) 2006 Free Software Foundation, Inc.
This is free software; see the source for copying conditions. There is NO
warranty; not even for MERCHANTABILITY or FITNESS FOR A PARTICULAR PURPOSE.
configure:8917: $? = 0
configure:8924: g++ -v >&5
Using built-in specs.
Target: i486-linux-gnu
Configured with: ../src/configure -v --enable-languages=c,c++,fortran,objc,obj-c++,treelang --prefix=/usr --enable-shared --with-system-zlib --libexecdir=/usr/lib --without-included-gettext --enable-threads=posix --enable-nls --with-gxx-include-dir=/usr/include/c++/4.1.3 --program-suffix=-4.1 --enable-__cxa_atexit --enable-clocale=gnu --enable-libstdcxx-debug --enable-mpfr --enable-checking=release i486-linux-gnu
Thread model: posix
gcc version 4.1.3 20070929 (prerelease) (Ubuntu 4.1.2-16ubuntu2)
configure:8927: $? = 0
configure:8934: g++ -V >&5
g++: '-V' option must have argument
configure:8937: $? = 1
configure:8940: checking whether we are using the GNU C++ compiler
configure:8969: g++ -c conftest.cpp >&5
configure:8975: $? = 0
configure:8992: result: yes
configure:8997: checking whether g++ accepts -g
configure:9027: g++ -c -g conftest.cpp >&5
configure:9033: $? = 0
configure:9132: result: yes
configure:9176: checking for style of include used by make
configure:9204: result: GNU
configure:9235: checking dependency style of gcc
configure:9326: result: none
configure:9342: checking for strerror in -lcposix
configure:9401: result: no
configure:9409: checking whether byte ordering is bigendian
configure:9442: gcc -c -g -O2 conftest.c >&5
configure:9448: $? = 0
configure:9480: gcc -c -g -O2 conftest.c >&5
conftest.c: In function 'main':
conftest.c:80: error: 'not' undeclared (first use in this function)
conftest.c:80: error: (Each undeclared identifier is reported only once
conftest.c:80: error: for each function it appears in.)
conftest.c:80: error: expected ';' before 'big'
configure:9486: $? = 1
configure: failed program was:
| /* confdefs.h. */
| #define PACKAGE_NAME "audacious"
| #define PACKAGE_TARNAME "audacious"
| #define PACKAGE_VERSION "1.9.0"
| #define PACKAGE_STRING "audacious 1.9.0"
| #define PACKAGE_BUGREPORT "bugs+audacious@atheme.org"
| #define _GNU_SOURCE 1
| #define PACKAGE "audacious"
| #define VERSION "1.9.0"
| #define SHARED_SUFFIX ".so"
| #define STDC_HEADERS 1
| #define HAVE_SYS_TYPES_H 1
| #define HAVE_SYS_STAT_H 1
| #define HAVE_STDLIB_H 1
| #define HAVE_STRING_H 1
| #define HAVE_MEMORY_H 1
| #define HAVE_STRINGS_H 1
| #define HAVE_INTTYPES_H 1
| #define HAVE_STDINT_H 1
| #define HAVE_UNISTD_H 1
| #define HAVE_ALLOCA_H 1
| #define HAVE_ALLOCA 1
| #define HAVE_STDLIB_H 1
| #define HAVE_UNISTD_H 1
| #define HAVE_GETPAGESIZE 1
| #define HAVE_MMAP 1
| #define INTDIV0_RAISES_SIGFPE 1
| #define HAVE_INTTYPES_H_WITH_UINTMAX 1
| #define HAVE_STDINT_H_WITH_UINTMAX 1
| #define HAVE_UNSIGNED_LONG_LONG 1
| #define HAVE_UINTMAX_T 1
| #define HAVE_INTTYPES_H 1
| #define HAVE_ARGZ_H 1
| #define HAVE_LIMITS_H 1
| #define HAVE_LOCALE_H 1
| #define HAVE_NL_TYPES_H 1
| #define HAVE_MALLOC_H 1
| #define HAVE_STDDEF_H 1
| #define HAVE_STDLIB_H 1
| #define HAVE_STRING_H 1
| #define HAVE_UNISTD_H 1
| #define HAVE_SYS_PARAM_H 1
| #define HAVE_FEOF_UNLOCKED 1
| #define HAVE_FGETS_UNLOCKED 1
| #define HAVE_GETC_UNLOCKED 1
| #define HAVE_GETCWD 1
| #define HAVE_GETEGID 1
| #define HAVE_GETEUID 1
| #define HAVE_GETGID 1
| #define HAVE_GETUID 1
| #define HAVE_MEMPCPY 1
| #define HAVE_MUNMAP 1
| #define HAVE_PUTENV 1
| #define HAVE_SETENV 1
| #define HAVE_SETLOCALE 1
| #define HAVE_STPCPY 1
| #define HAVE_STRCASECMP 1
| #define HAVE_STRDUP 1
| #define HAVE_STRTOUL 1
| #define HAVE_TSEARCH 1
| #define HAVE___ARGZ_COUNT 1
| #define HAVE___ARGZ_STRINGIFY 1
| #define HAVE___ARGZ_NEXT 1
| #define HAVE___FSETLOCKING 1
| #define HAVE_ICONV 1
| #define ICONV_CONST
| #define HAVE_LANGINFO_CODESET 1
| #define HAVE_LC_MESSAGES 1
| #define ENABLE_NLS 1
| #define HAVE_GETTEXT 1
| #define HAVE_DCGETTEXT 1
| /* end confdefs.h. */
| #include <sys/types.h>
| #include <sys/param.h>
|
| int
| main ()
| {
| #if BYTE_ORDER != BIG_ENDIAN
| not big endian
| #endif
|
| ;
| return 0;
| }
configure:9626: result: no
configure:9651: checking whether ln -s works
configure:9655: result: yes
configure:9662: checking whether make sets $(MAKE)
configure:9683: result: yes
configure:9694: checking for rm
configure:9712: found /bin/rm
configure:9724: result: /bin/rm
configure:9734: checking for mv
configure:9752: found /bin/mv
configure:9764: result: /bin/mv
configure:9774: checking for cp
configure:9792: found /bin/cp
configure:9804: result: /bin/cp
configure:9814: checking for ar
configure:9832: found /usr/bin/ar
configure:9844: result: /usr/bin/ar
configure:9854: checking for ranlib
configure:9872: found /usr/bin/ranlib
configure:9884: result: /usr/bin/ranlib
configure:9906: checking for unistd.h
configure:9912: result: yes
configure:9916: checking fcntl.h usability
configure:9933: gcc -c -g -O2 -Wall -pipe conftest.c >&5
configure:9939: $? = 0
configure:9953: result: yes
configure:9957: checking fcntl.h presence
configure:9972: gcc -E conftest.c
configure:9978: $? = 0
configure:9992: result: yes
configure:10025: checking for fcntl.h
configure:10033: result: yes
configure:9916: checking sys/ioctl.h usability
configure:9933: gcc -c -g -O2 -Wall -pipe conftest.c >&5
configure:9939: $? = 0
configure:9953: result: yes
configure:9957: checking sys/ioctl.h presence
configure:9972: gcc -E conftest.c
configure:9978: $? = 0
configure:9992: result: yes
configure:10025: checking for sys/ioctl.h
configure:10033: result: yes
configure:9916: checking fnmatch.h usability
configure:9933: gcc -c -g -O2 -Wall -pipe conftest.c >&5
configure:9939: $? = 0
configure:9953: result: yes
configure:9957: checking fnmatch.h presence
configure:9972: gcc -E conftest.c
configure:9978: $? = 0
configure:9992: result: yes
configure:10025: checking for fnmatch.h
configure:10033: result: yes
configure:9906: checking for limits.h
configure:9912: result: yes
configure:9916: checking wchar.h usability
configure:9933: gcc -c -g -O2 -Wall -pipe conftest.c >&5
configure:9939: $? = 0
configure:9953: result: yes
configure:9957: checking wchar.h presence
configure:9972: gcc -E conftest.c
configure:9978: $? = 0
configure:9992: result: yes
configure:10025: checking for wchar.h
configure:10033: result: yes
configure:9916: checking fts.h usability
configure:9933: gcc -c -g -O2 -Wall -pipe conftest.c >&5
configure:9939: $? = 0
configure:9953: result: yes
configure:9957: checking fts.h presence
configure:9972: gcc -E conftest.c
configure:9978: $? = 0
configure:9992: result: yes
configure:10025: checking for fts.h
configure:10033: result: yes
configure:9916: checking execinfo.h usability
configure:9933: gcc -c -g -O2 -Wall -pipe conftest.c >&5
configure:9939: $? = 0
configure:9953: result: yes
configure:9957: checking execinfo.h presence
configure:9972: gcc -E conftest.c
configure:9978: $? = 0
configure:9992: result: yes
configure:10025: checking for execinfo.h
configure:10033: result: yes
configure:10054: checking for mkdtemp
configure:10110: gcc -o conftest -g -O2 -Wall -pipe conftest.c >&5
configure:10116: $? = 0
configure:10134: result: yes
configure:10054: checking for getmntinfo
configure:10110: gcc -o conftest -g -O2 -Wall -pipe conftest.c >&5
/tmp/ccvDbPRK.o: In function `main':
/home/jd/compileapps/audacious/hg/audacious-devel/conftest.c:116: undefined reference to `getmntinfo'
collect2: ld returned 1 exit status
configure:10116: $? = 1
configure: failed program was:
| /* confdefs.h. */
| #define PACKAGE_NAME "audacious"
| #define PACKAGE_TARNAME "audacious"
| #define PACKAGE_VERSION "1.9.0"
| #define PACKAGE_STRING "audacious 1.9.0"
| #define PACKAGE_BUGREPORT "bugs+audacious@atheme.org"
| #define _GNU_SOURCE 1
| #define PACKAGE "audacious"
| #define VERSION "1.9.0"
| #define SHARED_SUFFIX ".so"
| #define STDC_HEADERS 1
| #define HAVE_SYS_TYPES_H 1
| #define HAVE_SYS_STAT_H 1
| #define HAVE_STDLIB_H 1
| #define HAVE_STRING_H 1
| #define HAVE_MEMORY_H 1
| #define HAVE_STRINGS_H 1
| #define HAVE_INTTYPES_H 1
| #define HAVE_STDINT_H 1
| #define HAVE_UNISTD_H 1
| #define HAVE_ALLOCA_H 1
| #define HAVE_ALLOCA 1
| #define HAVE_STDLIB_H 1
| #define HAVE_UNISTD_H 1
| #define HAVE_GETPAGESIZE 1
| #define HAVE_MMAP 1
| #define INTDIV0_RAISES_SIGFPE 1
| #define HAVE_INTTYPES_H_WITH_UINTMAX 1
| #define HAVE_STDINT_H_WITH_UINTMAX 1
| #define HAVE_UNSIGNED_LONG_LONG 1
| #define HAVE_UINTMAX_T 1
| #define HAVE_INTTYPES_H 1
| #define HAVE_ARGZ_H 1
| #define HAVE_LIMITS_H 1
| #define HAVE_LOCALE_H 1
| #define HAVE_NL_TYPES_H 1
| #define HAVE_MALLOC_H 1
| #define HAVE_STDDEF_H 1
| #define HAVE_STDLIB_H 1
| #define HAVE_STRING_H 1
| #define HAVE_UNISTD_H 1
| #define HAVE_SYS_PARAM_H 1
| #define HAVE_FEOF_UNLOCKED 1
| #define HAVE_FGETS_UNLOCKED 1
| #define HAVE_GETC_UNLOCKED 1
| #define HAVE_GETCWD 1
| #define HAVE_GETEGID 1
| #define HAVE_GETEUID 1
| #define HAVE_GETGID 1
| #define HAVE_GETUID 1
| #define HAVE_MEMPCPY 1
| #define HAVE_MUNMAP 1
| #define HAVE_PUTENV 1
| #define HAVE_SETENV 1
| #define HAVE_SETLOCALE 1
| #define HAVE_STPCPY 1
| #define HAVE_STRCASECMP 1
| #define HAVE_STRDUP 1
| #define HAVE_STRTOUL 1
| #define HAVE_TSEARCH 1
| #define HAVE___ARGZ_COUNT 1
| #define HAVE___ARGZ_STRINGIFY 1
| #define HAVE___ARGZ_NEXT 1
| #define HAVE___FSETLOCKING 1
| #define HAVE_ICONV 1
| #define ICONV_CONST
| #define HAVE_LANGINFO_CODESET 1
| #define HAVE_LC_MESSAGES 1
| #define ENABLE_NLS 1
| #define HAVE_GETTEXT 1
| #define HAVE_DCGETTEXT 1
| #define HAVE_UNISTD_H 1
| #define HAVE_FCNTL_H 1
| #define HAVE_SYS_IOCTL_H 1
| #define HAVE_FNMATCH_H 1
| #define HAVE_LIMITS_H 1
| #define HAVE_WCHAR_H 1
| #define HAVE_FTS_H 1
| #define HAVE_EXECINFO_H 1
| #define HAVE_MKDTEMP 1
| /* end confdefs.h. */
| /* Define getmntinfo to an innocuous variant, in case <limits.h> declares getmntinfo.
| For example, HP-UX 11i <limits.h> declares gettimeofday. */
| #define getmntinfo innocuous_getmntinfo
|
| /* System header to define __stub macros and hopefully few prototypes,
| which can conflict with char getmntinfo (); below.
| Prefer <limits.h> to <assert.h> if __STDC__ is defined, since
| <limits.h> exists even on freestanding compilers. */
|
| #ifdef __STDC__
| # include <limits.h>
| #else
| # include <assert.h>
| #endif
|
| #undef getmntinfo
|
| /* Override any GCC internal prototype to avoid an error.
| Use char because int might match the return type of a GCC
| builtin and then its argument prototype would still apply. */
| #ifdef __cplusplus
| extern "C"
| #endif
| char getmntinfo ();
| /* The GNU C library defines this for functions which it implements
| to always fail with ENOSYS. Some functions are actually named
| something starting with __ and the normal name is an alias. */
| #if defined __stub_getmntinfo || defined __stub___getmntinfo
| choke me
| #endif
|
| int
| main ()
| {
| return getmntinfo ();
| ;
| return 0;
| }
configure:10134: result: no
configure:10054: checking for statvfs
configure:10110: gcc -o conftest -g -O2 -Wall -pipe conftest.c >&5
configure:10116: $? = 0
configure:10134: result: yes
configure:10054: checking for strtoul
configure:10134: result: yes
configure:10054: checking for lrintf
configure:10110: gcc -o conftest -g -O2 -Wall -pipe conftest.c >&5
conftest.c:107: warning: conflicting types for built-in function 'lrintf'
/tmp/ccmJfbPZ.o: In function `main':
/home/jd/compileapps/audacious/hg/audacious-devel/conftest.c:118: undefined reference to `lrintf'
collect2: ld returned 1 exit status
configure:10116: $? = 1
configure: failed program was:
| /* confdefs.h. */
| #define PACKAGE_NAME "audacious"
| #define PACKAGE_TARNAME "audacious"
| #define PACKAGE_VERSION "1.9.0"
| #define PACKAGE_STRING "audacious 1.9.0"
| #define PACKAGE_BUGREPORT "bugs+audacious@atheme.org"
| #define _GNU_SOURCE 1
| #define PACKAGE "audacious"
| #define VERSION "1.9.0"
| #define SHARED_SUFFIX ".so"
| #define STDC_HEADERS 1
| #define HAVE_SYS_TYPES_H 1
| #define HAVE_SYS_STAT_H 1
| #define HAVE_STDLIB_H 1
| #define HAVE_STRING_H 1
| #define HAVE_MEMORY_H 1
| #define HAVE_STRINGS_H 1
| #define HAVE_INTTYPES_H 1
| #define HAVE_STDINT_H 1
| #define HAVE_UNISTD_H 1
| #define HAVE_ALLOCA_H 1
| #define HAVE_ALLOCA 1
| #define HAVE_STDLIB_H 1
| #define HAVE_UNISTD_H 1
| #define HAVE_GETPAGESIZE 1
| #define HAVE_MMAP 1
| #define INTDIV0_RAISES_SIGFPE 1
| #define HAVE_INTTYPES_H_WITH_UINTMAX 1
| #define HAVE_STDINT_H_WITH_UINTMAX 1
| #define HAVE_UNSIGNED_LONG_LONG 1
| #define HAVE_UINTMAX_T 1
| #define HAVE_INTTYPES_H 1
| #define HAVE_ARGZ_H 1
| #define HAVE_LIMITS_H 1
| #define HAVE_LOCALE_H 1
| #define HAVE_NL_TYPES_H 1
| #define HAVE_MALLOC_H 1
| #define HAVE_STDDEF_H 1
| #define HAVE_STDLIB_H 1
| #define HAVE_STRING_H 1
| #define HAVE_UNISTD_H 1
| #define HAVE_SYS_PARAM_H 1
| #define HAVE_FEOF_UNLOCKED 1
| #define HAVE_FGETS_UNLOCKED 1
| #define HAVE_GETC_UNLOCKED 1
| #define HAVE_GETCWD 1
| #define HAVE_GETEGID 1
| #define HAVE_GETEUID 1
| #define HAVE_GETGID 1
| #define HAVE_GETUID 1
| #define HAVE_MEMPCPY 1
| #define HAVE_MUNMAP 1
| #define HAVE_PUTENV 1
| #define HAVE_SETENV 1
| #define HAVE_SETLOCALE 1
| #define HAVE_STPCPY 1
| #define HAVE_STRCASECMP 1
| #define HAVE_STRDUP 1
| #define HAVE_STRTOUL 1
| #define HAVE_TSEARCH 1
| #define HAVE___ARGZ_COUNT 1
| #define HAVE___ARGZ_STRINGIFY 1
| #define HAVE___ARGZ_NEXT 1
| #define HAVE___FSETLOCKING 1
| #define HAVE_ICONV 1
| #define ICONV_CONST
| #define HAVE_LANGINFO_CODESET 1
| #define HAVE_LC_MESSAGES 1
| #define ENABLE_NLS 1
| #define HAVE_GETTEXT 1
| #define HAVE_DCGETTEXT 1
| #define HAVE_UNISTD_H 1
| #define HAVE_FCNTL_H 1
| #define HAVE_SYS_IOCTL_H 1
| #define HAVE_FNMATCH_H 1
| #define HAVE_LIMITS_H 1
| #define HAVE_WCHAR_H 1
| #define HAVE_FTS_H 1
| #define HAVE_EXECINFO_H 1
| #define HAVE_MKDTEMP 1
| #define HAVE_STATVFS 1
| #define HAVE_STRTOUL 1
| /* end confdefs.h. */
| /* Define lrintf to an innocuous variant, in case <limits.h> declares lrintf.
| For example, HP-UX 11i <limits.h> declares gettimeofday. */
| #define lrintf innocuous_lrintf
|
| /* System header to define __stub macros and hopefully few prototypes,
| which can conflict with char lrintf (); below.
| Prefer <limits.h> to <assert.h> if __STDC__ is defined, since
| <limits.h> exists even on freestanding compilers. */
|
| #ifdef __STDC__
| # include <limits.h>
| #else
| # include <assert.h>
| #endif
|
| #undef lrintf
|
| /* Override any GCC internal prototype to avoid an error.
| Use char because int might match the return type of a GCC
| builtin and then its argument prototype would still apply. */
| #ifdef __cplusplus
| extern "C"
| #endif
| char lrintf ();
| /* The GNU C library defines this for functions which it implements
| to always fail with ENOSYS. Some functions are actually named
| something starting with __ and the normal name is an alias. */
| #if defined __stub_lrintf || defined __stub___lrintf
| choke me
| #endif
|
| int
| main ()
| {
| return lrintf ();
| ;
| return 0;
| }
configure:10134: result: no
configure:10149: checking for audacious
configure:10167: found /usr/local/bin/audacious
configure:10180: result: /usr/local/bin/audacious
configure:10251: checking for GLIB
configure:10259: $PKG_CONFIG --exists --print-errors "glib-2.0 >= 2.14.0"
configure:10262: $? = 0
configure:10277: $PKG_CONFIG --exists --print-errors "glib-2.0 >= 2.14.0"
configure:10280: $? = 0
configure:10376: result: yes
configure:10393: checking for GTHREAD
configure:10401: $PKG_CONFIG --exists --print-errors "gthread-2.0 >= 2.14.0"
configure:10404: $? = 0
configure:10419: $PKG_CONFIG --exists --print-errors "gthread-2.0 >= 2.14.0"
configure:10422: $? = 0
configure:10518: result: yes
configure:10535: checking for GTK
configure:10543: $PKG_CONFIG --exists --print-errors "gtk+-2.0 >= 2.10.0"
configure:10546: $? = 0
configure:10561: $PKG_CONFIG --exists --print-errors "gtk+-2.0 >= 2.10.0"
configure:10564: $? = 0
configure:10660: result: yes
configure:10677: checking for PANGO
configure:10685: $PKG_CONFIG --exists --print-errors "pango >= 1.8.0"
configure:10688: $? = 0
configure:10703: $PKG_CONFIG --exists --print-errors "pango >= 1.8.0"
configure:10706: $? = 0
configure:10802: result: yes
configure:10819: checking for CAIRO
configure:10827: $PKG_CONFIG --exists --print-errors "cairo >= 1.2.4"
configure:10830: $? = 0
configure:10845: $PKG_CONFIG --exists --print-errors "cairo >= 1.2.4"
configure:10848: $? = 0
configure:10944: result: yes
configure:10963: checking for MOWGLI
configure:10971: $PKG_CONFIG --exists --print-errors "libmowgli >= 0.4.0"
configure:10974: $? = 0
configure:10989: $PKG_CONFIG --exists --print-errors "libmowgli >= 0.4.0"
configure:10992: $? = 0
configure:11088: result: yes
configure:11107: checking for LIBMCS
configure:11115: $PKG_CONFIG --exists --print-errors "libmcs >= 0.7 libmcs"
configure:11118: $? = 0
configure:11133: $PKG_CONFIG --exists --print-errors "libmcs >= 0.7 libmcs"
configure:11136: $? = 0
configure:11232: result: yes
configure:11249: checking for socklen_t
configure:11278: gcc -c -g -O2 -Wall -pipe conftest.c >&5
conftest.c: In function 'main':
conftest.c:93: warning: unused variable 's'
configure:11284: $? = 0
configure:11299: result: yes
configure:11353: checking if you are running Apple-GCC
configure:11362: result: no
configure:11385: checking for detectCharset in -ludet_c
configure:11420: gcc -o conftest -g -O2 -Wall -pipe conftest.c -ludet_c >&5
/usr/bin/ld: cannot find -ludet_c
collect2: ld returned 1 exit status
configure:11426: $? = 1
configure: failed program was:
| /* confdefs.h. */
| #define PACKAGE_NAME "audacious"
| #define PACKAGE_TARNAME "audacious"
| #define PACKAGE_VERSION "1.9.0"
| #define PACKAGE_STRING "audacious 1.9.0"
| #define PACKAGE_BUGREPORT "bugs+audacious@atheme.org"
| #define _GNU_SOURCE 1
| #define PACKAGE "audacious"
| #define VERSION "1.9.0"
| #define SHARED_SUFFIX ".so"
| #define STDC_HEADERS 1
| #define HAVE_SYS_TYPES_H 1
| #define HAVE_SYS_STAT_H 1
| #define HAVE_STDLIB_H 1
| #define HAVE_STRING_H 1
| #define HAVE_MEMORY_H 1
| #define HAVE_STRINGS_H 1
| #define HAVE_INTTYPES_H 1
| #define HAVE_STDINT_H 1
| #define HAVE_UNISTD_H 1
| #define HAVE_ALLOCA_H 1
| #define HAVE_ALLOCA 1
| #define HAVE_STDLIB_H 1
| #define HAVE_UNISTD_H 1
| #define HAVE_GETPAGESIZE 1
| #define HAVE_MMAP 1
| #define INTDIV0_RAISES_SIGFPE 1
| #define HAVE_INTTYPES_H_WITH_UINTMAX 1
| #define HAVE_STDINT_H_WITH_UINTMAX 1
| #define HAVE_UNSIGNED_LONG_LONG 1
| #define HAVE_UINTMAX_T 1
| #define HAVE_INTTYPES_H 1
| #define HAVE_ARGZ_H 1
| #define HAVE_LIMITS_H 1
| #define HAVE_LOCALE_H 1
| #define HAVE_NL_TYPES_H 1
| #define HAVE_MALLOC_H 1
| #define HAVE_STDDEF_H 1
| #define HAVE_STDLIB_H 1
| #define HAVE_STRING_H 1
| #define HAVE_UNISTD_H 1
| #define HAVE_SYS_PARAM_H 1
| #define HAVE_FEOF_UNLOCKED 1
| #define HAVE_FGETS_UNLOCKED 1
| #define HAVE_GETC_UNLOCKED 1
| #define HAVE_GETCWD 1
| #define HAVE_GETEGID 1
| #define HAVE_GETEUID 1
| #define HAVE_GETGID 1
| #define HAVE_GETUID 1
| #define HAVE_MEMPCPY 1
| #define HAVE_MUNMAP 1
| #define HAVE_PUTENV 1
| #define HAVE_SETENV 1
| #define HAVE_SETLOCALE 1
| #define HAVE_STPCPY 1
| #define HAVE_STRCASECMP 1
| #define HAVE_STRDUP 1
| #define HAVE_STRTOUL 1
| #define HAVE_TSEARCH 1
| #define HAVE___ARGZ_COUNT 1
| #define HAVE___ARGZ_STRINGIFY 1
| #define HAVE___ARGZ_NEXT 1
| #define HAVE___FSETLOCKING 1
| #define HAVE_ICONV 1
| #define ICONV_CONST
| #define HAVE_LANGINFO_CODESET 1
| #define HAVE_LC_MESSAGES 1
| #define ENABLE_NLS 1
| #define HAVE_GETTEXT 1
| #define HAVE_DCGETTEXT 1
| #define HAVE_UNISTD_H 1
| #define HAVE_FCNTL_H 1
| #define HAVE_SYS_IOCTL_H 1
| #define HAVE_FNMATCH_H 1
| #define HAVE_LIMITS_H 1
| #define HAVE_WCHAR_H 1
| #define HAVE_FTS_H 1
| #define HAVE_EXECINFO_H 1
| #define HAVE_MKDTEMP 1
| #define HAVE_STATVFS 1
| #define HAVE_STRTOUL 1
| #define AUD_RCPATH ".audacious"
| #define DOTAUDACIOUS_COMPAT 1
| #define SHARED_SUFFIX ".so"
| #define USE_CHARDET 1
| /* end confdefs.h. */
|
| /* Override any GCC internal prototype to avoid an error.
| Use char because int might match the return type of a GCC
| builtin and then its argument prototype would still apply. */
| #ifdef __cplusplus
| extern "C"
| #endif
| char detectCharset ();
| int
| main ()
| {
| return detectCharset ();
| ;
| return 0;
| }
configure:11444: result: no
configure:11482: checking for DBUS
configure:11490: $PKG_CONFIG --exists --print-errors "dbus-1 >= 0.60 dbus-glib-1 >= 0.60 gthread-2.0"
configure:11493: $? = 0
configure:11508: $PKG_CONFIG --exists --print-errors "dbus-1 >= 0.60 dbus-glib-1 >= 0.60 gthread-2.0"
configure:11511: $? = 0
configure:11547: result: yes
configure:11554: checking for dbus-binding-tool
configure:11572: found /usr/bin/dbus-binding-tool
configure:11585: result: /usr/bin/dbus-binding-tool
configure:11595: checking for glib-genmarshal
configure:11613: found /usr/bin/glib-genmarshal
configure:11626: result: /usr/bin/glib-genmarshal
configure:11957: checking for xml2-config
configure:11975: found /usr/bin/xml2-config
configure:11988: result: /usr/bin/xml2-config
configure:11997: checking for libxml - version >= 2.0.0
configure:12109: gcc -o conftest -g -O2 -Wall -pipe -I/usr/include/libxml2 conftest.c -L/usr/lib -lxml2 >&5
configure:12112: $? = 0
configure:12118: ./conftest
configure:12121: $? = 0
configure:12142: result: yes (version 2.6.30)
configure:12519: checking SSE2 support
configure:12551: gcc -o conftest -msse2 conftest.c >&5
conftest.c:92: error: expected identifier or '(' before '[' token
In file included from /usr/lib/gcc/i486-linux-gnu/4.1.3/include/xmmintrin.h:38,
from /usr/lib/gcc/i486-linux-gnu/4.1.3/include/emmintrin.h:34,
from conftest.c:93:
/usr/lib/gcc/i486-linux-gnu/4.1.3/include/mmintrin.h:60: error: expected ',' or ';' before '_mm_cvtsi32_si64'
/usr/lib/gcc/i486-linux-gnu/4.1.3/include/mmintrin.h:66: error: expected ',' or ';' before '_m_from_int'
/usr/lib/gcc/i486-linux-gnu/4.1.3/include/mmintrin.h:89: error: expected ')' before '__i'
/usr/lib/gcc/i486-linux-gnu/4.1.3/include/mmintrin.h:95: error: expected ')' before '__i'
/usr/lib/gcc/i486-linux-gnu/4.1.3/include/mmintrin.h:113: error: expected ',' or ';' before '_mm_packs_pi16'
/usr/lib/gcc/i486-linux-gnu/4.1.3/include/mmintrin.h:119: error: expected ',' or ';' before '_m_packsswb'
/usr/lib/gcc/i486-linux-gnu/4.1.3/include/mmintrin.h:128: error: expected ',' or ';' before '_mm_packs_pi32'
/usr/lib/gcc/i486-linux-gnu/4.1.3/include/mmintrin.h:134: error: expected ',' or ';' before '_m_packssdw'
/usr/lib/gcc/i486-linux-gnu/4.1.3/include/mmintrin.h:143: error: expected ',' or ';' before '_mm_packs_pu16'
/usr/lib/gcc/i486-linux-gnu/4.1.3/include/mmintrin.h:149: error: expected ',' or ';' before '_m_packuswb'
/usr/lib/gcc/i486-linux-gnu/4.1.3/include/mmintrin.h:157: error: expected ',' or ';' before '_mm_unpackhi_pi8'
/usr/lib/gcc/i486-linux-gnu/4.1.3/include/mmintrin.h:163: error: expected ',' or ';' before '_m_punpckhbw'
/usr/lib/gcc/i486-linux-gnu/4.1.3/include/mmintrin.h:171: error: expected ',' or ';' before '_mm_unpackhi_pi16'
/usr/lib/gcc/i486-linux-gnu/4.1.3/include/mmintrin.h:177: error: expected ',' or ';' before '_m_punpckhwd'
/usr/lib/gcc/i486-linux-gnu/4.1.3/include/mmintrin.h:185: error: expected ',' or ';' before '_mm_unpackhi_pi32'
/usr/lib/gcc/i486-linux-gnu/4.1.3/include/mmintrin.h:191: error: expected ',' or ';' before '_m_punpckhdq'
/usr/lib/gcc/i486-linux-gnu/4.1.3/include/mmintrin.h:199: error: expected ',' or ';' before '_mm_unpacklo_pi8'
/usr/lib/gcc/i486-linux-gnu/4.1.3/include/mmintrin.h:205: error: expected ',' or ';' before '_m_punpcklbw'
/usr/lib/gcc/i486-linux-gnu/4.1.3/include/mmintrin.h:213: error: expected ',' or ';' before '_mm_unpacklo_pi16'
/usr/lib/gcc/i486-linux-gnu/4.1.3/include/mmintrin.h:219: error: expected ',' or ';' before '_m_punpcklwd'
/usr/lib/gcc/i486-linux-gnu/4.1.3/include/mmintrin.h:227: error: expected ',' or ';' before '_mm_unpacklo_pi32'
/usr/lib/gcc/i486-linux-gnu/4.1.3/include/mmintrin.h:233: error: expected ',' or ';' before '_m_punpckldq'
/usr/lib/gcc/i486-linux-gnu/4.1.3/include/mmintrin.h:240: error: expected ',' or ';' before '_mm_add_pi8'
/usr/lib/gcc/i486-linux-gnu/4.1.3/include/mmintrin.h:246: error: expected ',' or ';' before '_m_paddb'
/usr/lib/gcc/i486-linux-gnu/4.1.3/include/mmintrin.h:253: error: expected ',' or ';' before '_mm_add_pi16'
/usr/lib/gcc/i486-linux-gnu/4.1.3/include/mmintrin.h:259: error: expected ',' or ';' before '_m_paddw'
/usr/lib/gcc/i486-linux-gnu/4.1.3/include/mmintrin.h:266: error: expected ',' or ';' before '_mm_add_pi32'
/usr/lib/gcc/i486-linux-gnu/4.1.3/include/mmintrin.h:272: error: expected ',' or ';' before '_m_paddd'
/usr/lib/gcc/i486-linux-gnu/4.1.3/include/mmintrin.h:279: error: expected ',' or ';' before '_mm_add_si64'
/usr/lib/gcc/i486-linux-gnu/4.1.3/include/mmintrin.h:287: error: expected ',' or ';' before '_mm_adds_pi8'
/usr/lib/gcc/i486-linux-gnu/4.1.3/include/mmintrin.h:293: error: expected ',' or ';' before '_m_paddsb'
/usr/lib/gcc/i486-linux-gnu/4.1.3/include/mmintrin.h:301: error: expected ',' or ';' before '_mm_adds_pi16'
/usr/lib/gcc/i486-linux-gnu/4.1.3/include/mmintrin.h:307: error: expected ',' or ';' before '_m_paddsw'
/usr/lib/gcc/i486-linux-gnu/4.1.3/include/mmintrin.h:315: error: expected ',' or ';' before '_mm_adds_pu8'
/usr/lib/gcc/i486-linux-gnu/4.1.3/include/mmintrin.h:321: error: expected ',' or ';' before '_m_paddusb'
/usr/lib/gcc/i486-linux-gnu/4.1.3/include/mmintrin.h:329: error: expected ',' or ';' before '_mm_adds_pu16'
/usr/lib/gcc/i486-linux-gnu/4.1.3/include/mmintrin.h:335: error: expected ',' or ';' before '_m_paddusw'
/usr/lib/gcc/i486-linux-gnu/4.1.3/include/mmintrin.h:342: error: expected ',' or ';' before '_mm_sub_pi8'
/usr/lib/gcc/i486-linux-gnu/4.1.3/include/mmintrin.h:348: error: expected ',' or ';' before '_m_psubb'
/usr/lib/gcc/i486-linux-gnu/4.1.3/include/mmintrin.h:355: error: expected ',' or ';' before '_mm_sub_pi16'
/usr/lib/gcc/i486-linux-gnu/4.1.3/include/mmintrin.h:361: error: expected ',' or ';' before '_m_psubw'
/usr/lib/gcc/i486-linux-gnu/4.1.3/include/mmintrin.h:368: error: expected ',' or ';' before '_mm_sub_pi32'
/usr/lib/gcc/i486-linux-gnu/4.1.3/include/mmintrin.h:374: error: expected ',' or ';' before '_m_psubd'
/usr/lib/gcc/i486-linux-gnu/4.1.3/include/mmintrin.h:381: error: expected ',' or ';' before '_mm_sub_si64'
/usr/lib/gcc/i486-linux-gnu/4.1.3/include/mmintrin.h:389: error: expected ',' or ';' before '_mm_subs_pi8'
/usr/lib/gcc/i486-linux-gnu/4.1.3/include/mmintrin.h:395: error: expected ',' or ';' before '_m_psubsb'
/usr/lib/gcc/i486-linux-gnu/4.1.3/include/mmintrin.h:403: error: expected ',' or ';' before '_mm_subs_pi16'
/usr/lib/gcc/i486-linux-gnu/4.1.3/include/mmintrin.h:409: error: expected ',' or ';' before '_m_psubsw'
/usr/lib/gcc/i486-linux-gnu/4.1.3/include/mmintrin.h:417: error: expected ',' or ';' before '_mm_subs_pu8'
/usr/lib/gcc/i486-linux-gnu/4.1.3/include/mmintrin.h:423: error: expected ',' or ';' before '_m_psubusb'
/usr/lib/gcc/i486-linux-gnu/4.1.3/include/mmintrin.h:431: error: expected ',' or ';' before '_mm_subs_pu16'
/usr/lib/gcc/i486-linux-gnu/4.1.3/include/mmintrin.h:437: error: expected ',' or ';' before '_m_psubusw'
/usr/lib/gcc/i486-linux-gnu/4.1.3/include/mmintrin.h:446: error: expected ',' or ';' before '_mm_madd_pi16'
/usr/lib/gcc/i486-linux-gnu/4.1.3/include/mmintrin.h:452: error: expected ',' or ';' before '_m_pmaddwd'
/usr/lib/gcc/i486-linux-gnu/4.1.3/include/mmintrin.h:460: error: expected ',' or ';' before '_mm_mulhi_pi16'
/usr/lib/gcc/i486-linux-gnu/4.1.3/include/mmintrin.h:466: error: expected ',' or ';' before '_m_pmulhw'
/usr/lib/gcc/i486-linux-gnu/4.1.3/include/mmintrin.h:474: error: expected ',' or ';' before '_mm_mullo_pi16'
/usr/lib/gcc/i486-linux-gnu/4.1.3/include/mmintrin.h:480: error: expected ',' or ';' before '_m_pmullw'
/usr/lib/gcc/i486-linux-gnu/4.1.3/include/mmintrin.h:487: error: expected ',' or ';' before '_mm_sll_pi16'
/usr/lib/gcc/i486-linux-gnu/4.1.3/include/mmintrin.h:493: error: expected ',' or ';' before '_m_psllw'
/usr/lib/gcc/i486-linux-gnu/4.1.3/include/mmintrin.h:499: error: expected ',' or ';' before '_mm_slli_pi16'
/usr/lib/gcc/i486-linux-gnu/4.1.3/include/mmintrin.h:505: error: expected ',' or ';' before '_m_psllwi'
/usr/lib/gcc/i486-linux-gnu/4.1.3/include/mmintrin.h:512: error: expected ',' or ';' before '_mm_sll_pi32'
/usr/lib/gcc/i486-linux-gnu/4.1.3/include/mmintrin.h:518: error: expected ',' or ';' before '_m_pslld'
/usr/lib/gcc/i486-linux-gnu/4.1.3/include/mmintrin.h:524: error: expected ',' or ';' before '_mm_slli_pi32'
/usr/lib/gcc/i486-linux-gnu/4.1.3/include/mmintrin.h:530: error: expected ',' or ';' before '_m_pslldi'
/usr/lib/gcc/i486-linux-gnu/4.1.3/include/mmintrin.h:537: error: expected ',' or ';' before '_mm_sll_si64'
/usr/lib/gcc/i486-linux-gnu/4.1.3/include/mmintrin.h:543: error: expected ',' or ';' before '_m_psllq'
/usr/lib/gcc/i486-linux-gnu/4.1.3/include/mmintrin.h:549: error: expected ',' or ';' before '_mm_slli_si64'
/usr/lib/gcc/i486-linux-gnu/4.1.3/include/mmintrin.h:555: error: expected ',' or ';' before '_m_psllqi'
/usr/lib/gcc/i486-linux-gnu/4.1.3/include/mmintrin.h:562: error: expected ',' or ';' before '_mm_sra_pi16'
/usr/lib/gcc/i486-linux-gnu/4.1.3/include/mmintrin.h:568: error: expected ',' or ';' before '_m_psraw'
/usr/lib/gcc/i486-linux-gnu/4.1.3/include/mmintrin.h:574: error: expected ',' or ';' before '_mm_srai_pi16'
/usr/lib/gcc/i486-linux-gnu/4.1.3/include/mmintrin.h:580: error: expected ',' or ';' before '_m_psrawi'
/usr/lib/gcc/i486-linux-gnu/4.1.3/include/mmintrin.h:587: error: expected ',' or ';' before '_mm_sra_pi32'
/usr/lib/gcc/i486-linux-gnu/4.1.3/include/mmintrin.h:593: error: expected ',' or ';' before '_m_psrad'
/usr/lib/gcc/i486-linux-gnu/4.1.3/include/mmintrin.h:599: error: expected ',' or ';' before '_mm_srai_pi32'
/usr/lib/gcc/i486-linux-gnu/4.1.3/include/mmintrin.h:605: error: expected ',' or ';' before '_m_psradi'
/usr/lib/gcc/i486-linux-gnu/4.1.3/include/mmintrin.h:612: error: expected ',' or ';' before '_mm_srl_pi16'
/usr/lib/gcc/i486-linux-gnu/4.1.3/include/mmintrin.h:618: error: expected ',' or ';' before '_m_psrlw'
/usr/lib/gcc/i486-linux-gnu/4.1.3/include/mmintrin.h:624: error: expected ',' or ';' before '_mm_srli_pi16'
/usr/lib/gcc/i486-linux-gnu/4.1.3/include/mmintrin.h:630: error: expected ',' or ';' before '_m_psrlwi'
/usr/lib/gcc/i486-linux-gnu/4.1.3/include/mmintrin.h:637: error: expected ',' or ';' before '_mm_srl_pi32'
/usr/lib/gcc/i486-linux-gnu/4.1.3/include/mmintrin.h:643: error: expected ',' or ';' before '_m_psrld'
/usr/lib/gcc/i486-linux-gnu/4.1.3/include/mmintrin.h:649: error: expected ',' or ';' before '_mm_srli_pi32'
/usr/lib/gcc/i486-linux-gnu/4.1.3/include/mmintrin.h:655: error: expected ',' or ';' before '_m_psrldi'
/usr/lib/gcc/i486-linux-gnu/4.1.3/include/mmintrin.h:662: error: expected ',' or ';' before '_mm_srl_si64'
/usr/lib/gcc/i486-linux-gnu/4.1.3/include/mmintrin.h:668: error: expected ',' or ';' before '_m_psrlq'
/usr/lib/gcc/i486-linux-gnu/4.1.3/include/mmintrin.h:674: error: expected ',' or ';' before '_mm_srli_si64'
/usr/lib/gcc/i486-linux-gnu/4.1.3/include/mmintrin.h:680: error: expected ',' or ';' before '_m_psrlqi'
/usr/lib/gcc/i486-linux-gnu/4.1.3/include/mmintrin.h:687: error: expected ',' or ';' before '_mm_and_si64'
/usr/lib/gcc/i486-linux-gnu/4.1.3/include/mmintrin.h:693: error: expected ',' or ';' before '_m_pand'
/usr/lib/gcc/i486-linux-gnu/4.1.3/include/mmintrin.h:701: error: expected ',' or ';' before '_mm_andnot_si64'
/usr/lib/gcc/i486-linux-gnu/4.1.3/include/mmintrin.h:707: error: expected ',' or ';' before '_m_pandn'
/usr/lib/gcc/i486-linux-gnu/4.1.3/include/mmintrin.h:714: error: expected ',' or ';' before '_mm_or_si64'
/usr/lib/gcc/i486-linux-gnu/4.1.3/include/mmintrin.h:720: error: expected ',' or ';' before '_m_por'
/usr/lib/gcc/i486-linux-gnu/4.1.3/include/mmintrin.h:727: error: expected ',' or ';' before '_mm_xor_si64'
/usr/lib/gcc/i486-linux-gnu/4.1.3/include/mmintrin.h:733: error: expected ',' or ';' before '_m_pxor'
/usr/lib/gcc/i486-linux-gnu/4.1.3/include/mmintrin.h:741: error: expected ',' or ';' before '_mm_cmpeq_pi8'
/usr/lib/gcc/i486-linux-gnu/4.1.3/include/mmintrin.h:747: error: expected ',' or ';' before '_m_pcmpeqb'
/usr/lib/gcc/i486-linux-gnu/4.1.3/include/mmintrin.h:753: error: expected ',' or ';' before '_mm_cmpgt_pi8'
/usr/lib/gcc/i486-linux-gnu/4.1.3/include/mmintrin.h:759: error: expected ',' or ';' before '_m_pcmpgtb'
/usr/lib/gcc/i486-linux-gnu/4.1.3/include/mmintrin.h:767: error: expected ',' or ';' before '_mm_cmpeq_pi16'
/usr/lib/gcc/i486-linux-gnu/4.1.3/include/mmintrin.h:773: error: expected ',' or ';' before '_m_pcmpeqw'
/usr/lib/gcc/i486-linux-gnu/4.1.3/include/mmintrin.h:779: error: expected ',' or ';' before '_mm_cmpgt_pi16'
/usr/lib/gcc/i486-linux-gnu/4.1.3/include/mmintrin.h:785: error: expected ',' or ';' before '_m_pcmpgtw'
/usr/lib/gcc/i486-linux-gnu/4.1.3/include/mmintrin.h:793: error: expected ',' or ';' before '_mm_cmpeq_pi32'
/usr/lib/gcc/i486-linux-gnu/4.1.3/include/mmintrin.h:799: error: expected ',' or ';' before '_m_pcmpeqd'
/usr/lib/gcc/i486-linux-gnu/4.1.3/include/mmintrin.h:805: error: expected ',' or ';' before '_mm_cmpgt_pi32'
/usr/lib/gcc/i486-linux-gnu/4.1.3/include/mmintrin.h:811: error: expected ',' or ';' before '_m_pcmpgtd'
/usr/lib/gcc/i486-linux-gnu/4.1.3/include/mmintrin.h:818: error: expected ',' or ';' before '_mm_setzero_si64'
/usr/lib/gcc/i486-linux-gnu/4.1.3/include/mmintrin.h:825: error: expected ',' or ';' before '_mm_set_pi32'
/usr/lib/gcc/i486-linux-gnu/4.1.3/include/mmintrin.h:832: error: expected ',' or ';' before '_mm_set_pi16'
/usr/lib/gcc/i486-linux-gnu/4.1.3/include/mmintrin.h:839: error: expected ',' or ';' before '_mm_set_pi8'
/usr/lib/gcc/i486-linux-gnu/4.1.3/include/mmintrin.h:848: error: expected ',' or ';' before '_mm_setr_pi32'
/usr/lib/gcc/i486-linux-gnu/4.1.3/include/mmintrin.h:854: error: expected ',' or ';' before '_mm_setr_pi16'
/usr/lib/gcc/i486-linux-gnu/4.1.3/include/mmintrin.h:860: error: expected ',' or ';' before '_mm_setr_pi8'
/usr/lib/gcc/i486-linux-gnu/4.1.3/include/mmintrin.h:868: error: expected ',' or ';' before '_mm_set1_pi32'
/usr/lib/gcc/i486-linux-gnu/4.1.3/include/mmintrin.h:875: error: expected ',' or ';' before '_mm_set1_pi16'
/usr/lib/gcc/i486-linux-gnu/4.1.3/include/mmintrin.h:882: error: expected ',' or ';' before '_mm_set1_pi8'
In file included from /usr/lib/gcc/i486-linux-gnu/4.1.3/include/emmintrin.h:34,
from conftest.c:93:
/usr/lib/gcc/i486-linux-gnu/4.1.3/include/xmmintrin.h:507: error: expected ',' or ';' before '_mm_cvtps_pi32'
/usr/lib/gcc/i486-linux-gnu/4.1.3/include/xmmintrin.h:513: error: expected ',' or ';' before '_mm_cvt_ps2pi'
/usr/lib/gcc/i486-linux-gnu/4.1.3/include/xmmintrin.h:543: error: expected ',' or ';' before '_mm_cvttps_pi32'
/usr/lib/gcc/i486-linux-gnu/4.1.3/include/xmmintrin.h:549: error: expected ',' or ';' before '_mm_cvtt_ps2pi'
/usr/lib/gcc/i486-linux-gnu/4.1.3/include/xmmintrin.h:579: error: expected declaration specifiers or '...' before '__m64'
/usr/lib/gcc/i486-linux-gnu/4.1.3/include/xmmintrin.h: In function '_mm_cvtpi32_ps':
/usr/lib/gcc/i486-linux-gnu/4.1.3/include/xmmintrin.h:581: error: '__B' undeclared (first use in this function)
/usr/lib/gcc/i486-linux-gnu/4.1.3/include/xmmintrin.h:581: error: (Each undeclared identifier is reported only once
/usr/lib/gcc/i486-linux-gnu/4.1.3/include/xmmintrin.h:581: error: for each function it appears in.)
/usr/lib/gcc/i486-linux-gnu/4.1.3/include/xmmintrin.h: At top level:
/usr/lib/gcc/i486-linux-gnu/4.1.3/include/xmmintrin.h:585: error: expected declaration specifiers or '...' before '__m64'
/usr/lib/gcc/i486-linux-gnu/4.1.3/include/xmmintrin.h: In function '_mm_cvt_pi2ps':
/usr/lib/gcc/i486-linux-gnu/4.1.3/include/xmmintrin.h:587: error: '__B' undeclared (first use in this function)
/usr/lib/gcc/i486-linux-gnu/4.1.3/include/xmmintrin.h:587: error: too many arguments to function '_mm_cvtpi32_ps'
/usr/lib/gcc/i486-linux-gnu/4.1.3/include/xmmintrin.h: At top level:
/usr/lib/gcc/i486-linux-gnu/4.1.3/include/xmmintrin.h:592: error: expected ')' before '__A'
/usr/lib/gcc/i486-linux-gnu/4.1.3/include/xmmintrin.h:618: error: expected ')' before '__A'
/usr/lib/gcc/i486-linux-gnu/4.1.3/include/xmmintrin.h:638: error: expected ')' before '__A'
/usr/lib/gcc/i486-linux-gnu/4.1.3/include/xmmintrin.h:655: error: expected ')' before '__A'
/usr/lib/gcc/i486-linux-gnu/4.1.3/include/xmmintrin.h:663: error: expected ')' before '__A'
/usr/lib/gcc/i486-linux-gnu/4.1.3/include/xmmintrin.h:673: error: expected ',' or ';' before '_mm_cvtps_pi16'
/usr/lib/gcc/i486-linux-gnu/4.1.3/include/xmmintrin.h:684: error: expected ',' or ';' before '_mm_cvtps_pi8'
/usr/lib/gcc/i486-linux-gnu/4.1.3/include/xmmintrin.h:720: error: expected declaration specifiers or '...' before '__m64'
/usr/lib/gcc/i486-linux-gnu/4.1.3/include/xmmintrin.h: In function '_mm_loadh_pi':
/usr/lib/gcc/i486-linux-gnu/4.1.3/include/xmmintrin.h:722: error: '__P' undeclared (first use in this function)
/usr/lib/gcc/i486-linux-gnu/4.1.3/include/xmmintrin.h: At top level:
/usr/lib/gcc/i486-linux-gnu/4.1.3/include/xmmintrin.h:727: error: expected ')' before '*' token
/usr/lib/gcc/i486-linux-gnu/4.1.3/include/xmmintrin.h:749: error: expected declaration specifiers or '...' before '__m64'
/usr/lib/gcc/i486-linux-gnu/4.1.3/include/xmmintrin.h: In function '_mm_loadl_pi':
/usr/lib/gcc/i486-linux-gnu/4.1.3/include/xmmintrin.h:751: error: '__P' undeclared (first use in this function)
/usr/lib/gcc/i486-linux-gnu/4.1.3/include/xmmintrin.h: At top level:
/usr/lib/gcc/i486-linux-gnu/4.1.3/include/xmmintrin.h:756: error: expected ')' before '*' token
/usr/lib/gcc/i486-linux-gnu/4.1.3/include/xmmintrin.h:1000: error: expected ',' or ';' before '_mm_max_pi16'
/usr/lib/gcc/i486-linux-gnu/4.1.3/include/xmmintrin.h:1006: error: expected ',' or ';' before '_m_pmaxsw'
/usr/lib/gcc/i486-linux-gnu/4.1.3/include/xmmintrin.h:1013: error: expected ',' or ';' before '_mm_max_pu8'
/usr/lib/gcc/i486-linux-gnu/4.1.3/include/xmmintrin.h:1019: error: expected ',' or ';' before '_m_pmaxub'
/usr/lib/gcc/i486-linux-gnu/4.1.3/include/xmmintrin.h:1026: error: expected ',' or ';' before '_mm_min_pi16'
/usr/lib/gcc/i486-linux-gnu/4.1.3/include/xmmintrin.h:1032: error: expected ',' or ';' before '_m_pminsw'
/usr/lib/gcc/i486-linux-gnu/4.1.3/include/xmmintrin.h:1039: error: expected ',' or ';' before '_mm_min_pu8'
/usr/lib/gcc/i486-linux-gnu/4.1.3/include/xmmintrin.h:1045: error: expected ',' or ';' before '_m_pminub'
/usr/lib/gcc/i486-linux-gnu/4.1.3/include/xmmintrin.h:1052: error: expected ')' before '__A'
/usr/lib/gcc/i486-linux-gnu/4.1.3/include/xmmintrin.h:1058: error: expected ')' before '__A'
/usr/lib/gcc/i486-linux-gnu/4.1.3/include/xmmintrin.h:1066: error: expected ',' or ';' before '_mm_mulhi_pu16'
/usr/lib/gcc/i486-linux-gnu/4.1.3/include/xmmintrin.h:1072: error: expected ',' or ';' before '_m_pmulhuw'
/usr/lib/gcc/i486-linux-gnu/4.1.3/include/xmmintrin.h:1101: error: expected ')' before '__A'
/usr/lib/gcc/i486-linux-gnu/4.1.3/include/xmmintrin.h:1107: error: expected ')' before '__A'
/usr/lib/gcc/i486-linux-gnu/4.1.3/include/xmmintrin.h:1114: error: expected ',' or ';' before '_mm_avg_pu8'
/usr/lib/gcc/i486-linux-gnu/4.1.3/include/xmmintrin.h:1120: error: expected ',' or ';' before '_m_pavgb'
/usr/lib/gcc/i486-linux-gnu/4.1.3/include/xmmintrin.h:1127: error: expected ',' or ';' before '_mm_avg_pu16'
/usr/lib/gcc/i486-linux-gnu/4.1.3/include/xmmintrin.h:1133: error: expected ',' or ';' before '_m_pavgw'
/usr/lib/gcc/i486-linux-gnu/4.1.3/include/xmmintrin.h:1142: error: expected ',' or ';' before '_mm_sad_pu8'
/usr/lib/gcc/i486-linux-gnu/4.1.3/include/xmmintrin.h:1148: error: expected ',' or ';' before '_m_psadbw'
/usr/lib/gcc/i486-linux-gnu/4.1.3/include/xmmintrin.h:1168: error: expected ')' before '*' token
In file included from conftest.c:93:
/usr/lib/gcc/i486-linux-gnu/4.1.3/include/emmintrin.h:562: error: expected ')' before '__q1'
/usr/lib/gcc/i486-linux-gnu/4.1.3/include/emmintrin.h:602: error: expected ')' before '__A'
/usr/lib/gcc/i486-linux-gnu/4.1.3/include/emmintrin.h:630: error: expected ')' before '__q0'
/usr/lib/gcc/i486-linux-gnu/4.1.3/include/emmintrin.h: In function '_mm_loadl_epi64':
/usr/lib/gcc/i486-linux-gnu/4.1.3/include/emmintrin.h:675: error: expected ')' before numeric constant
/usr/lib/gcc/i486-linux-gnu/4.1.3/include/emmintrin.h:675: error: incompatible types in return
/usr/lib/gcc/i486-linux-gnu/4.1.3/include/emmintrin.h: At top level:
/usr/lib/gcc/i486-linux-gnu/4.1.3/include/emmintrin.h:697: error: expected ',' or ';' before '_mm_movepi64_pi64'
/usr/lib/gcc/i486-linux-gnu/4.1.3/include/emmintrin.h:703: error: expected ')' before '__A'
/usr/lib/gcc/i486-linux-gnu/4.1.3/include/emmintrin.h: In function '_mm_move_epi64':
/usr/lib/gcc/i486-linux-gnu/4.1.3/include/emmintrin.h:711: error: expected ')' before numeric constant
/usr/lib/gcc/i486-linux-gnu/4.1.3/include/emmintrin.h:711: error: incompatible types in return
/usr/lib/gcc/i486-linux-gnu/4.1.3/include/emmintrin.h: At top level:
/usr/lib/gcc/i486-linux-gnu/4.1.3/include/emmintrin.h:740: error: expected ',' or ';' before '_mm_cvtpd_pi32'
/usr/lib/gcc/i486-linux-gnu/4.1.3/include/emmintrin.h:758: error: expected ',' or ';' before '_mm_cvttpd_pi32'
/usr/lib/gcc/i486-linux-gnu/4.1.3/include/emmintrin.h:764: error: expected ')' before '__A'
/usr/lib/gcc/i486-linux-gnu/4.1.3/include/emmintrin.h:1054: error: expected ',' or ';' before '_mm_mul_su32'
conftest.c:99: error: expected identifier or '(' before ']' token
configure:12554: $? = 1
configure: program exited with status 1
configure: failed program was:
| /* confdefs.h. */
| #define PACKAGE_NAME "audacious"
| #define PACKAGE_TARNAME "audacious"
| #define PACKAGE_VERSION "1.9.0"
| #define PACKAGE_STRING "audacious 1.9.0"
| #define PACKAGE_BUGREPORT "bugs+audacious@atheme.org"
| #define _GNU_SOURCE 1
| #define PACKAGE "audacious"
| #define VERSION "1.9.0"
| #define SHARED_SUFFIX ".so"
| #define STDC_HEADERS 1
| #define HAVE_SYS_TYPES_H 1
| #define HAVE_SYS_STAT_H 1
| #define HAVE_STDLIB_H 1
| #define HAVE_STRING_H 1
| #define HAVE_MEMORY_H 1
| #define HAVE_STRINGS_H 1
| #define HAVE_INTTYPES_H 1
| #define HAVE_STDINT_H 1
| #define HAVE_UNISTD_H 1
| #define HAVE_ALLOCA_H 1
| #define HAVE_ALLOCA 1
| #define HAVE_STDLIB_H 1
| #define HAVE_UNISTD_H 1
| #define HAVE_GETPAGESIZE 1
| #define HAVE_MMAP 1
| #define INTDIV0_RAISES_SIGFPE 1
| #define HAVE_INTTYPES_H_WITH_UINTMAX 1
| #define HAVE_STDINT_H_WITH_UINTMAX 1
| #define HAVE_UNSIGNED_LONG_LONG 1
| #define HAVE_UINTMAX_T 1
| #define HAVE_INTTYPES_H 1
| #define HAVE_ARGZ_H 1
| #define HAVE_LIMITS_H 1
| #define HAVE_LOCALE_H 1
| #define HAVE_NL_TYPES_H 1
| #define HAVE_MALLOC_H 1
| #define HAVE_STDDEF_H 1
| #define HAVE_STDLIB_H 1
| #define HAVE_STRING_H 1
| #define HAVE_UNISTD_H 1
| #define HAVE_SYS_PARAM_H 1
| #define HAVE_FEOF_UNLOCKED 1
| #define HAVE_FGETS_UNLOCKED 1
| #define HAVE_GETC_UNLOCKED 1
| #define HAVE_GETCWD 1
| #define HAVE_GETEGID 1
| #define HAVE_GETEUID 1
| #define HAVE_GETGID 1
| #define HAVE_GETUID 1
| #define HAVE_MEMPCPY 1
| #define HAVE_MUNMAP 1
| #define HAVE_PUTENV 1
| #define HAVE_SETENV 1
| #define HAVE_SETLOCALE 1
| #define HAVE_STPCPY 1
| #define HAVE_STRCASECMP 1
| #define HAVE_STRDUP 1
| #define HAVE_STRTOUL 1
| #define HAVE_TSEARCH 1
| #define HAVE___ARGZ_COUNT 1
| #define HAVE___ARGZ_STRINGIFY 1
| #define HAVE___ARGZ_NEXT 1
| #define HAVE___FSETLOCKING 1
| #define HAVE_ICONV 1
| #define ICONV_CONST
| #define HAVE_LANGINFO_CODESET 1
| #define HAVE_LC_MESSAGES 1
| #define ENABLE_NLS 1
| #define HAVE_GETTEXT 1
| #define HAVE_DCGETTEXT 1
| #define HAVE_UNISTD_H 1
| #define HAVE_FCNTL_H 1
| #define HAVE_SYS_IOCTL_H 1
| #define HAVE_FNMATCH_H 1
| #define HAVE_LIMITS_H 1
| #define HAVE_WCHAR_H 1
| #define HAVE_FTS_H 1
| #define HAVE_EXECINFO_H 1
| #define HAVE_MKDTEMP 1
| #define HAVE_STATVFS 1
| #define HAVE_STRTOUL 1
| #define AUD_RCPATH ".audacious"
| #define DOTAUDACIOUS_COMPAT 1
| #define SHARED_SUFFIX ".so"
| #define USE_CHARDET 1
| #define USE_DBUS 1
| #define DBUS_SERVICES_DIR "$datadir/dbus-1/services"
| #define HAVE_XSPF_PLAYLIST 1
| #define USE_REGEX_GNU 1
| /* end confdefs.h. */
| [
| #include <emmintrin.h>
| int main()
| {
| _mm_setzero_pd();
| return 0;
| }
| ]
configure:12582: result: no
configure:12624: checking altivec.h usability
configure:12641: gcc -c -g -O2 -Wall -pipe conftest.c >&5
conftest.c:125:21: error: altivec.h: No such file or directory
configure:12647: $? = 1
configure: failed program was:
| /* confdefs.h. */
| #define PACKAGE_NAME "audacious"
| #define PACKAGE_TARNAME "audacious"
| #define PACKAGE_VERSION "1.9.0"
| #define PACKAGE_STRING "audacious 1.9.0"
| #define PACKAGE_BUGREPORT "bugs+audacious@atheme.org"
| #define _GNU_SOURCE 1
| #define PACKAGE "audacious"
| #define VERSION "1.9.0"
| #define SHARED_SUFFIX ".so"
| #define STDC_HEADERS 1
| #define HAVE_SYS_TYPES_H 1
| #define HAVE_SYS_STAT_H 1
| #define HAVE_STDLIB_H 1
| #define HAVE_STRING_H 1
| #define HAVE_MEMORY_H 1
| #define HAVE_STRINGS_H 1
| #define HAVE_INTTYPES_H 1
| #define HAVE_STDINT_H 1
| #define HAVE_UNISTD_H 1
| #define HAVE_ALLOCA_H 1
| #define HAVE_ALLOCA 1
| #define HAVE_STDLIB_H 1
| #define HAVE_UNISTD_H 1
| #define HAVE_GETPAGESIZE 1
| #define HAVE_MMAP 1
| #define INTDIV0_RAISES_SIGFPE 1
| #define HAVE_INTTYPES_H_WITH_UINTMAX 1
| #define HAVE_STDINT_H_WITH_UINTMAX 1
| #define HAVE_UNSIGNED_LONG_LONG 1
| #define HAVE_UINTMAX_T 1
| #define HAVE_INTTYPES_H 1
| #define HAVE_ARGZ_H 1
| #define HAVE_LIMITS_H 1
| #define HAVE_LOCALE_H 1
| #define HAVE_NL_TYPES_H 1
| #define HAVE_MALLOC_H 1
| #define HAVE_STDDEF_H 1
| #define HAVE_STDLIB_H 1
| #define HAVE_STRING_H 1
| #define HAVE_UNISTD_H 1
| #define HAVE_SYS_PARAM_H 1
| #define HAVE_FEOF_UNLOCKED 1
| #define HAVE_FGETS_UNLOCKED 1
| #define HAVE_GETC_UNLOCKED 1
| #define HAVE_GETCWD 1
| #define HAVE_GETEGID 1
| #define HAVE_GETEUID 1
| #define HAVE_GETGID 1
| #define HAVE_GETUID 1
| #define HAVE_MEMPCPY 1
| #define HAVE_MUNMAP 1
| #define HAVE_PUTENV 1
| #define HAVE_SETENV 1
| #define HAVE_SETLOCALE 1
| #define HAVE_STPCPY 1
| #define HAVE_STRCASECMP 1
| #define HAVE_STRDUP 1
| #define HAVE_STRTOUL 1
| #define HAVE_TSEARCH 1
| #define HAVE___ARGZ_COUNT 1
| #define HAVE___ARGZ_STRINGIFY 1
| #define HAVE___ARGZ_NEXT 1
| #define HAVE___FSETLOCKING 1
| #define HAVE_ICONV 1
| #define ICONV_CONST
| #define HAVE_LANGINFO_CODESET 1
| #define HAVE_LC_MESSAGES 1
| #define ENABLE_NLS 1
| #define HAVE_GETTEXT 1
| #define HAVE_DCGETTEXT 1
| #define HAVE_UNISTD_H 1
| #define HAVE_FCNTL_H 1
| #define HAVE_SYS_IOCTL_H 1
| #define HAVE_FNMATCH_H 1
| #define HAVE_LIMITS_H 1
| #define HAVE_WCHAR_H 1
| #define HAVE_FTS_H 1
| #define HAVE_EXECINFO_H 1
| #define HAVE_MKDTEMP 1
| #define HAVE_STATVFS 1
| #define HAVE_STRTOUL 1
| #define AUD_RCPATH ".audacious"
| #define DOTAUDACIOUS_COMPAT 1
| #define SHARED_SUFFIX ".so"
| #define USE_CHARDET 1
| #define USE_DBUS 1
| #define DBUS_SERVICES_DIR "$datadir/dbus-1/services"
| #define HAVE_XSPF_PLAYLIST 1
| #define USE_REGEX_GNU 1
| /* end confdefs.h. */
| #include <stdio.h>
| #ifdef HAVE_SYS_TYPES_H
| # include <sys/types.h>
| #endif
| #ifdef HAVE_SYS_STAT_H
| # include <sys/stat.h>
| #endif
| #ifdef STDC_HEADERS
| # include <stdlib.h>
| # include <stddef.h>
| #else
| # ifdef HAVE_STDLIB_H
| # include <stdlib.h>
| # endif
| #endif
| #ifdef HAVE_STRING_H
| # if !defined STDC_HEADERS && defined HAVE_MEMORY_H
| # include <memory.h>
| # endif
| # include <string.h>
| #endif
| #ifdef HAVE_STRINGS_H
| # include <strings.h>
| #endif
| #ifdef HAVE_INTTYPES_H
| # include <inttypes.h>
| #endif
| #ifdef HAVE_STDINT_H
| # include <stdint.h>
| #endif
| #ifdef HAVE_UNISTD_H
| # include <unistd.h>
| #endif
| #include <altivec.h>
configure:12661: result: no
configure:12665: checking altivec.h presence
configure:12680: gcc -E conftest.c
conftest.c:92:21: error: altivec.h: No such file or directory
configure:12686: $? = 1
configure: failed program was:
| /* confdefs.h. */
| #define PACKAGE_NAME "audacious"
| #define PACKAGE_TARNAME "audacious"
| #define PACKAGE_VERSION "1.9.0"
| #define PACKAGE_STRING "audacious 1.9.0"
| #define PACKAGE_BUGREPORT "bugs+audacious@atheme.org"
| #define _GNU_SOURCE 1
| #define PACKAGE "audacious"
| #define VERSION "1.9.0"
| #define SHARED_SUFFIX ".so"
| #define STDC_HEADERS 1
| #define HAVE_SYS_TYPES_H 1
| #define HAVE_SYS_STAT_H 1
| #define HAVE_STDLIB_H 1
| #define HAVE_STRING_H 1
| #define HAVE_MEMORY_H 1
| #define HAVE_STRINGS_H 1
| #define HAVE_INTTYPES_H 1
| #define HAVE_STDINT_H 1
| #define HAVE_UNISTD_H 1
| #define HAVE_ALLOCA_H 1
| #define HAVE_ALLOCA 1
| #define HAVE_STDLIB_H 1
| #define HAVE_UNISTD_H 1
| #define HAVE_GETPAGESIZE 1
| #define HAVE_MMAP 1
| #define INTDIV0_RAISES_SIGFPE 1
| #define HAVE_INTTYPES_H_WITH_UINTMAX 1
| #define HAVE_STDINT_H_WITH_UINTMAX 1
| #define HAVE_UNSIGNED_LONG_LONG 1
| #define HAVE_UINTMAX_T 1
| #define HAVE_INTTYPES_H 1
| #define HAVE_ARGZ_H 1
| #define HAVE_LIMITS_H 1
| #define HAVE_LOCALE_H 1
| #define HAVE_NL_TYPES_H 1
| #define HAVE_MALLOC_H 1
| #define HAVE_STDDEF_H 1
| #define HAVE_STDLIB_H 1
| #define HAVE_STRING_H 1
| #define HAVE_UNISTD_H 1
| #define HAVE_SYS_PARAM_H 1
| #define HAVE_FEOF_UNLOCKED 1
| #define HAVE_FGETS_UNLOCKED 1
| #define HAVE_GETC_UNLOCKED 1
| #define HAVE_GETCWD 1
| #define HAVE_GETEGID 1
| #define HAVE_GETEUID 1
| #define HAVE_GETGID 1
| #define HAVE_GETUID 1
| #define HAVE_MEMPCPY 1
| #define HAVE_MUNMAP 1
| #define HAVE_PUTENV 1
| #define HAVE_SETENV 1
| #define HAVE_SETLOCALE 1
| #define HAVE_STPCPY 1
| #define HAVE_STRCASECMP 1
| #define HAVE_STRDUP 1
| #define HAVE_STRTOUL 1
| #define HAVE_TSEARCH 1
| #define HAVE___ARGZ_COUNT 1
| #define HAVE___ARGZ_STRINGIFY 1
| #define HAVE___ARGZ_NEXT 1
| #define HAVE___FSETLOCKING 1
| #define HAVE_ICONV 1
| #define ICONV_CONST
| #define HAVE_LANGINFO_CODESET 1
| #define HAVE_LC_MESSAGES 1
| #define ENABLE_NLS 1
| #define HAVE_GETTEXT 1
| #define HAVE_DCGETTEXT 1
| #define HAVE_UNISTD_H 1
| #define HAVE_FCNTL_H 1
| #define HAVE_SYS_IOCTL_H 1
| #define HAVE_FNMATCH_H 1
| #define HAVE_LIMITS_H 1
| #define HAVE_WCHAR_H 1
| #define HAVE_FTS_H 1
| #define HAVE_EXECINFO_H 1
| #define HAVE_MKDTEMP 1
| #define HAVE_STATVFS 1
| #define HAVE_STRTOUL 1
| #define AUD_RCPATH ".audacious"
| #define DOTAUDACIOUS_COMPAT 1
| #define SHARED_SUFFIX ".so"
| #define USE_CHARDET 1
| #define USE_DBUS 1
| #define DBUS_SERVICES_DIR "$datadir/dbus-1/services"
| #define HAVE_XSPF_PLAYLIST 1
| #define USE_REGEX_GNU 1
| /* end confdefs.h. */
| #include <altivec.h>
configure:12700: result: no
configure:12733: checking for altivec.h
configure:12741: result: no
configure:12828: checking for SM
configure:12836: $PKG_CONFIG --exists --print-errors "sm >= 1.0"
configure:12839: $? = 0
configure:12854: $PKG_CONFIG --exists --print-errors "sm >= 1.0"
configure:12857: $? = 0
configure:12897: result: yes
configure:12920: checking if __ELF__ is defined
configure:12942: result: yes
configure:13224: creating ./config.status
## ---------------------- ##
## Running config.status. ##
## ---------------------- ##
This file was extended by audacious config.status 1.9.0, which was
generated by GNU Autoconf 2.61. Invocation command line was
CONFIG_FILES =
CONFIG_HEADERS =
CONFIG_LINKS =
CONFIG_COMMANDS =
$ ./config.status
on rocko
config.status:760: creating audacious.pc
config.status:895: WARNING: audacious.pc.in seems to ignore the --datarootdir setting
config.status:760: creating audclient.pc
config.status:895: WARNING: audclient.pc.in seems to ignore the --datarootdir setting
config.status:760: creating buildsys.mk
config.status:760: creating extra.mk
config.status:760: creating man/audtool.1
config.status:760: creating man/audacious.1
config.status:760: creating applications/audacious.desktop
config.status:760: creating po/Makefile.in
config.status:895: WARNING: po/Makefile.in.in seems to ignore the --datarootdir setting
config.status:760: creating config.h
config.status:1062: config.h is unchanged
config.status:1075: executing default-1 commands
config.status:1075: executing depfiles commands
## ---------------- ##
## Cache variables. ##
## ---------------- ##
ac_cv_build=i686-pc-linux-gnu
ac_cv_c_bigendian=no
ac_cv_c_compiler_gnu=yes
ac_cv_c_const=yes
ac_cv_c_inline=inline
ac_cv_cxx_compiler_gnu=yes
ac_cv_env_CAIRO_CFLAGS_set=
ac_cv_env_CAIRO_CFLAGS_value=
ac_cv_env_CAIRO_LIBS_set=
ac_cv_env_CAIRO_LIBS_value=
ac_cv_env_CCASFLAGS_set=
ac_cv_env_CCASFLAGS_value=
ac_cv_env_CCAS_set=
ac_cv_env_CCAS_value=
ac_cv_env_CCC_set=
ac_cv_env_CCC_value=
ac_cv_env_CC_set=
ac_cv_env_CC_value=
ac_cv_env_CFLAGS_set=
ac_cv_env_CFLAGS_value=
ac_cv_env_CPPFLAGS_set=
ac_cv_env_CPPFLAGS_value=
ac_cv_env_CPP_set=
ac_cv_env_CPP_value=
ac_cv_env_CXXFLAGS_set=
ac_cv_env_CXXFLAGS_value=
ac_cv_env_CXX_set=
ac_cv_env_CXX_value=
ac_cv_env_DBUS_CFLAGS_set=
ac_cv_env_DBUS_CFLAGS_value=
ac_cv_env_DBUS_LIBS_set=
ac_cv_env_DBUS_LIBS_value=
ac_cv_env_GLIB_CFLAGS_set=
ac_cv_env_GLIB_CFLAGS_value=
ac_cv_env_GLIB_LIBS_set=
ac_cv_env_GLIB_LIBS_value=
ac_cv_env_GTHREAD_CFLAGS_set=
ac_cv_env_GTHREAD_CFLAGS_value=
ac_cv_env_GTHREAD_LIBS_set=
ac_cv_env_GTHREAD_LIBS_value=
ac_cv_env_GTK_CFLAGS_set=
ac_cv_env_GTK_CFLAGS_value=
ac_cv_env_GTK_LIBS_set=
ac_cv_env_GTK_LIBS_value=
ac_cv_env_LDFLAGS_set=
ac_cv_env_LDFLAGS_value=
ac_cv_env_LIBMCS_CFLAGS_set=
ac_cv_env_LIBMCS_CFLAGS_value=
ac_cv_env_LIBMCS_LIBS_set=
ac_cv_env_LIBMCS_LIBS_value=
ac_cv_env_LIBPCRE_CFLAGS_set=
ac_cv_env_LIBPCRE_CFLAGS_value=
ac_cv_env_LIBPCRE_LIBS_set=
ac_cv_env_LIBPCRE_LIBS_value=
ac_cv_env_LIBS_set=
ac_cv_env_LIBS_value=
ac_cv_env_MOWGLI_CFLAGS_set=
ac_cv_env_MOWGLI_CFLAGS_value=
ac_cv_env_MOWGLI_LIBS_set=
ac_cv_env_MOWGLI_LIBS_value=
ac_cv_env_PANGO_CFLAGS_set=
ac_cv_env_PANGO_CFLAGS_value=
ac_cv_env_PANGO_LIBS_set=
ac_cv_env_PANGO_LIBS_value=
ac_cv_env_PKG_CONFIG_set=
ac_cv_env_PKG_CONFIG_value=
ac_cv_env_SAMPLERATE_CFLAGS_set=
ac_cv_env_SAMPLERATE_CFLAGS_value=
ac_cv_env_SAMPLERATE_LIBS_set=
ac_cv_env_SAMPLERATE_LIBS_value=
ac_cv_env_SM_CFLAGS_set=
ac_cv_env_SM_CFLAGS_value=
ac_cv_env_SM_LIBS_set=
ac_cv_env_SM_LIBS_value=
ac_cv_env_build_alias_set=
ac_cv_env_build_alias_value=
ac_cv_env_host_alias_set=
ac_cv_env_host_alias_value=
ac_cv_env_target_alias_set=
ac_cv_env_target_alias_value=
ac_cv_func___argz_count=yes
ac_cv_func___argz_next=yes
ac_cv_func___argz_stringify=yes
ac_cv_func___fsetlocking=yes
ac_cv_func_alloca_works=yes
ac_cv_func_feof_unlocked=yes
ac_cv_func_fgets_unlocked=yes
ac_cv_func_getc_unlocked=yes
ac_cv_func_getcwd=yes
ac_cv_func_getegid=yes
ac_cv_func_geteuid=yes
ac_cv_func_getgid=yes
ac_cv_func_getmntinfo=no
ac_cv_func_getpagesize=yes
ac_cv_func_getuid=yes
ac_cv_func_lrintf=no
ac_cv_func_mempcpy=yes
ac_cv_func_mkdtemp=yes
ac_cv_func_mmap_fixed_mapped=yes
ac_cv_func_munmap=yes
ac_cv_func_putenv=yes
ac_cv_func_setenv=yes
ac_cv_func_setlocale=yes
ac_cv_func_statvfs=yes
ac_cv_func_stpcpy=yes
ac_cv_func_strcasecmp=yes
ac_cv_func_strdup=yes
ac_cv_func_strtoul=yes
ac_cv_func_tsearch=yes
ac_cv_gnu_library_2_1=yes
ac_cv_header_altivec_h=no
ac_cv_header_argz_h=yes
ac_cv_header_execinfo_h=yes
ac_cv_header_fcntl_h=yes
ac_cv_header_fnmatch_h=yes
ac_cv_header_fts_h=yes
ac_cv_header_inttypes_h=yes
ac_cv_header_limits_h=yes
ac_cv_header_locale_h=yes
ac_cv_header_malloc_h=yes
ac_cv_header_memory_h=yes
ac_cv_header_nl_types_h=yes
ac_cv_header_stdc=yes
ac_cv_header_stddef_h=yes
ac_cv_header_stdint_h=yes
ac_cv_header_stdlib_h=yes
ac_cv_header_string_h=yes
ac_cv_header_strings_h=yes
ac_cv_header_sys_ioctl_h=yes
ac_cv_header_sys_param_h=yes
ac_cv_header_sys_stat_h=yes
ac_cv_header_sys_types_h=yes
ac_cv_header_unistd_h=yes
ac_cv_header_wchar_h=yes
ac_cv_host=i686-pc-linux-gnu
ac_cv_lib_cposix_strerror=no
ac_cv_lib_udet_c_detectCharset=no
ac_cv_objext=o
ac_cv_path_AR=/usr/bin/ar
ac_cv_path_AUDACIOUS_PATH=/usr/local/bin/audacious
ac_cv_path_CP=/bin/cp
ac_cv_path_DBUS_BINDING_TOOL=/usr/bin/dbus-binding-tool
ac_cv_path_EGREP='/bin/grep -E'
ac_cv_path_GLIB_GENMARSHAL=/usr/bin/glib-genmarshal
ac_cv_path_GMSGFMT=/usr/bin/msgfmt
ac_cv_path_GREP=/bin/grep
ac_cv_path_MSGFMT=/usr/bin/msgfmt
ac_cv_path_MSGMERGE=/usr/bin/msgmerge
ac_cv_path_MV=/bin/mv
ac_cv_path_RANLIB=/usr/bin/ranlib
ac_cv_path_RM=/bin/rm
ac_cv_path_XGETTEXT=/usr/bin/xgettext
ac_cv_path_XML2_CONFIG=/usr/bin/xml2-config
ac_cv_path_ac_pt_PKG_CONFIG=/usr/bin/pkg-config
ac_cv_path_install='/usr/bin/install -c'
ac_cv_prog_CPP='gcc -E'
ac_cv_prog_INTLBISON=bison
ac_cv_prog_ac_ct_CC=gcc
ac_cv_prog_ac_ct_CXX=g++
ac_cv_prog_ac_ct_RANLIB=ranlib
ac_cv_prog_cc_c89=
ac_cv_prog_cc_g=yes
ac_cv_prog_cxx_g=yes
ac_cv_prog_make_make_set=yes
ac_cv_target=i686-pc-linux-gnu
ac_cv_type_off_t=yes
ac_cv_type_size_t=yes
ac_cv_type_unsigned_long_long=yes
ac_cv_working_alloca_h=yes
acl_cv_hardcode_direct=no
acl_cv_hardcode_libdir_flag_spec='${wl}-rpath ${wl}$libdir'
acl_cv_hardcode_libdir_separator=
acl_cv_hardcode_minus_L=no
acl_cv_libext=a
acl_cv_path_LD=/usr/bin/ld
acl_cv_prog_gnu_ld=yes
acl_cv_rpath=done
acl_cv_shlibext=so
acl_cv_wl=-Wl,
am_cv_CCAS_dependencies_compiler_type=none
am_cv_func_iconv=yes
am_cv_langinfo_codeset=yes
am_cv_lib_iconv=no
am_cv_proto_iconv='extern size_t iconv (iconv_t cd, char * *inbuf, size_t *inbytesleft, char * *outbuf, size_t *outbytesleft);'
am_cv_proto_iconv_arg1=
am_cv_val_LC_MESSAGES=yes
gt_cv_func_gnugettext1_libc=yes
gt_cv_header_inttypes_h=yes
gt_cv_int_divbyzero_sigfpe=yes
gt_cv_inttypes_pri_broken=no
jm_ac_cv_header_inttypes_h=yes
jm_ac_cv_header_stdint_h=yes
nls_cv_force_use_gnu_gettext=no
nls_cv_header_intl=
nls_cv_header_libgt=
nls_cv_use_gnu_gettext=no
pkg_cv_CAIRO_CFLAGS='-I/usr/include/cairo -I/usr/include/freetype2 -I/usr/include/libpng12 '
pkg_cv_CAIRO_LIBS='-lcairo '
pkg_cv_DBUS_CFLAGS='-pthread -I/usr/include/dbus-1.0 -I/usr/lib/dbus-1.0/include -I/usr/include/glib-2.0 -I/usr/lib/glib-2.0/include '
pkg_cv_DBUS_LIBS='-pthread -ldbus-glib-1 -ldbus-1 -lgobject-2.0 -lgthread-2.0 -lrt -lglib-2.0 '
pkg_cv_GLIB_CFLAGS='-I/usr/include/glib-2.0 -I/usr/lib/glib-2.0/include '
pkg_cv_GLIB_LIBS='-lglib-2.0 '
pkg_cv_GTHREAD_CFLAGS='-pthread -I/usr/include/glib-2.0 -I/usr/lib/glib-2.0/include '
pkg_cv_GTHREAD_LIBS='-pthread -lgthread-2.0 -lrt -lglib-2.0 '
pkg_cv_GTK_CFLAGS='-I/usr/include/gtk-2.0 -I/usr/lib/gtk-2.0/include -I/usr/include/atk-1.0 -I/usr/include/cairo -I/usr/include/pango-1.0 -I/usr/include/glib-2.0 -I/usr/lib/glib-2.0/include -I/usr/include/freetype2 -I/usr/include/libpng12 '
pkg_cv_GTK_LIBS='-lgtk-x11-2.0 -lgdk-x11-2.0 -latk-1.0 -lgdk_pixbuf-2.0 -lm -lpangocairo-1.0 -lfontconfig -lXext -lXrender -lXinerama -lXi -lXrandr -lXcursor -lXcomposite -lXdamage -lpango-1.0 -lcairo -lX11 -lXfixes -lgobject-2.0 -lgmodule-2.0 -ldl -lglib-2.0 '
pkg_cv_LIBMCS_CFLAGS='-I/usr/local/include -I/usr/local/include/libmowgli '
pkg_cv_LIBMCS_LIBS='-L/usr/local/lib -lmcs -lmowgli '
pkg_cv_MOWGLI_CFLAGS='-I/usr/local/include/libmowgli '
pkg_cv_MOWGLI_LIBS='-L/usr/local/lib -lmowgli '
pkg_cv_PANGO_CFLAGS='-I/usr/include/pango-1.0 -I/usr/include/glib-2.0 -I/usr/lib/glib-2.0/include '
pkg_cv_PANGO_LIBS='-lpango-1.0 -lgobject-2.0 -lgmodule-2.0 -ldl -lglib-2.0 '
pkg_cv_SM_CFLAGS=' '
pkg_cv_SM_LIBS='-lSM -lICE '
## ----------------- ##
## Output variables. ##
## ----------------- ##
ALLOCA=''
AMDEPBACKSLASH='\'
AMDEP_FALSE='#'
AMDEP_TRUE=''
AR='/usr/bin/ar'
ARCH_DEFINES='-DI386_ASSEM'
ARCH_X86='yes'
AUDACIOUS_DEFINES='-g -O2 -Wall -pipe -DDATA_DIR=\"${datarootdir}/audacious\" -DPLUGIN_DIR=\"${exec_prefix}/lib/audacious\" -DPLUGINSUBS=\"Input\",\"Output\",\"Effect\",\"General\",\"Visualization\",\"Container\",\"Transport\",\"Discovery\" -DLOCALEDIR=\"${datarootdir}/locale\"'
AUDACIOUS_PATH='/usr/local/bin/audacious'
AUD_RCPATH=''
BUILD_INCLUDED_LIBINTL='no'
CAIRO_CFLAGS='-I/usr/include/cairo -I/usr/include/freetype2 -I/usr/include/libpng12 '
CAIRO_LIBS='-lcairo '
CATOBJEXT='.gmo'
CC='gcc'
CCAS='gcc'
CCASDEPMODE='depmode=none'
CCASFLAGS='-g -O2'
CFLAGS='-g -O2 -Wall -pipe'
CHARDET_LIBS=''
CLEAN_LIB=''
CONTAINER_PLUGIN_DIR='Container'
CP='/bin/cp'
CPP='gcc -E'
CPPFLAGS=''
CXX='g++'
CXXFLAGS='-g -O2'
DATADIRNAME='share'
DBUS_BINDING_TOOL='/usr/bin/dbus-binding-tool'
DBUS_CFLAGS='-pthread -I/usr/include/dbus-1.0 -I/usr/lib/dbus-1.0/include -I/usr/include/glib-2.0 -I/usr/lib/glib-2.0/include '
DBUS_LIBS='-pthread -ldbus-glib-1 -ldbus-1 -lgobject-2.0 -lgthread-2.0 -lrt -lglib-2.0 '
DBUS_SERVICES_DIR=''
DEFS='-DHAVE_CONFIG_H'
DEPDIR='.deps'
DISCOVERY_PLUGIN_DIR='Discovery'
ECHO_C=''
ECHO_N='-n'
ECHO_T=''
EFFECT_PLUGIN_DIR='Effect'
EGREP='/bin/grep -E'
EXEEXT=''
GENCAT='gencat'
GENERAL_PLUGIN_DIR='General'
GLIBC21='yes'
GLIB_CFLAGS='-I/usr/include/glib-2.0 -I/usr/lib/glib-2.0/include '
GLIB_GENMARSHAL='/usr/bin/glib-genmarshal'
GLIB_LIBS='-lglib-2.0 '
GMSGFMT='/usr/bin/msgfmt'
GREP='/bin/grep'
GTHREAD_CFLAGS='-pthread -I/usr/include/glib-2.0 -I/usr/lib/glib-2.0/include '
GTHREAD_LIBS='-pthread -lgthread-2.0 -lrt -lglib-2.0 '
GTK_CFLAGS='-I/usr/include/gtk-2.0 -I/usr/lib/gtk-2.0/include -I/usr/include/atk-1.0 -I/usr/include/cairo -I/usr/include/pango-1.0 -I/usr/include/glib-2.0 -I/usr/lib/glib-2.0/include -I/usr/include/freetype2 -I/usr/include/libpng12 '
GTK_LIBS='-lgtk-x11-2.0 -lgdk-x11-2.0 -latk-1.0 -lgdk_pixbuf-2.0 -lm -lpangocairo-1.0 -lfontconfig -lXext -lXrender -lXinerama -lXi -lXrandr -lXcursor -lXcomposite -lXdamage -lpango-1.0 -lcairo -lX11 -lXfixes -lgobject-2.0 -lgmodule-2.0 -ldl -lglib-2.0 '
HAVE_SOLARIS='no'
HAVE_SUN='no'
IMPLIB_LIBS=''
INPUT_PLUGIN_DIR='Input'
INSTALL_DATA='${INSTALL} -m 644'
INSTALL_LIB='${INSTALL} -m 755 $$i ${DESTDIR}${libdir}/$$i.${LIB_MAJOR}.${LIB_MINOR}.0 && ${LN_S} -f $$i.${LIB_MAJOR}.${LIB_MINOR}.0 ${DESTDIR}${libdir}/$$i.${LIB_MAJOR} && ${LN_S} -f $$i.${LIB_MAJOR}.${LIB_MINOR}.0 ${DESTDIR}${libdir}/$$i'
INSTALL_PROGRAM='${INSTALL}'
INSTALL_SCRIPT='${INSTALL}'
INSTOBJEXT='.mo'
INTLBISON='bison'
INTLLIBS=''
INTLOBJS=''
INTL_LIBTOOL_SUFFIX_PREFIX=''
INTL_OBJECTIVE=''
LDFLAGS=''
LIBAUDCLIENT_LDFLAGS='-laudclient'
LIBICONV=''
LIBINTL=''
LIBMCS_CFLAGS='-I/usr/local/include -I/usr/local/include/libmowgli '
LIBMCS_LIBS='-L/usr/local/lib -lmcs -lmowgli '
LIBOBJS=''
LIBPCRE_CFLAGS=''
LIBPCRE_LIBS=''
LIBS=''
LIB_CFLAGS='-fPIC'
LIB_CPPFLAGS='-DPIC'
LIB_LDFLAGS='-shared -fPIC -Wl,-soname,${LIB}.${LIB_MAJOR}'
LIB_PREFIX='lib'
LIB_SUFFIX='.so'
LN_S='ln -s'
LTLIBICONV=''
LTLIBINTL=''
LTLIBOBJS=''
MAKE='make'
MKINSTALLDIRS='$(top_builddir)/./mkinstalldirs'
MOWGLI_CFLAGS='-I/usr/local/include/libmowgli '
MOWGLI_LIBS='-L/usr/local/lib -lmowgli '
MSGFMT='/usr/bin/msgfmt'
MSGMERGE='/usr/bin/msgmerge'
MV='/bin/mv'
OBJEXT='o'
OUTPUT_PLUGIN_DIR='Output'
PACKAGE='audacious'
PACKAGE_BUGREPORT='bugs+audacious@atheme.org'
PACKAGE_NAME='audacious'
PACKAGE_STRING='audacious 1.9.0'
PACKAGE_TARNAME='audacious'
PACKAGE_VERSION='1.9.0'
PANGO_CFLAGS='-I/usr/include/pango-1.0 -I/usr/include/glib-2.0 -I/usr/lib/glib-2.0/include '
PANGO_LIBS='-lpango-1.0 -lgobject-2.0 -lgmodule-2.0 -ldl -lglib-2.0 '
PATH_SEPARATOR=':'
PC_REQUIRES='glib-2.0 >= 2.14.0, gthread-2.0 >= 2.14.0, gtk+-2.0 >= 2.10.0, pango >= 1.8.0, cairo >= 1.2.4, libmowgli >= 0.4.0, libmcs >= 0.7 libmcs'
PKG_CONFIG='/usr/bin/pkg-config'
PLUGIN_CFLAGS='-fPIC'
PLUGIN_CPPFLAGS='-DPIC'
PLUGIN_LDFLAGS='-shared -fPIC'
PLUGIN_SUFFIX='.so'
POSUB='po'
PROG_IMPLIB_LDFLAGS=''
PROG_IMPLIB_NEEDED='no'
RANLIB='/usr/bin/ranlib'
REGEX_CFLAGS=''
REGEX_LIBS=''
RM='/bin/rm'
SAMPLERATE_CFLAGS=''
SAMPLERATE_LIBS=''
SET_MAKE=''
SHARED_SUFFIX='.so'
SHELL='/bin/bash'
SIMD_CFLAGS=''
SM_CFLAGS=' '
SM_LIBS='-lSM -lICE '
TRANSPORT_PLUGIN_DIR='Transport'
UNINSTALL_LIB='rm -f ${DESTDIR}${libdir}/$$i ${DESTDIR}${libdir}/$$i.${LIB_MAJOR} ${DESTDIR}${libdir}/$$i.${LIB_MAJOR}.${LIB_MINOR}.0'
USE_CHARDET='yes'
USE_DBUS='yes'
USE_EGGSM='yes'
USE_INCLUDED_LIBINTL='no'
USE_IPV6='no'
USE_NLS='yes'
USE_SAMPLERATE=''
USE_X86ASM='yes'
VERSION='1.9.0'
VISUALIZATION_PLUGIN_DIR='Visualization'
XGETTEXT='/usr/bin/xgettext'
XML2_CONFIG='/usr/bin/xml2-config'
XML_CPPFLAGS='-I/usr/include/libxml2'
XML_LIBS='-L/usr/lib -lxml2'
ac_ct_CC='gcc'
ac_ct_CXX='g++'
am__fastdepCCAS_FALSE=''
am__fastdepCCAS_TRUE='#'
am__include='include'
am__leading_dot='.'
am__quote=''
bindir='${exec_prefix}/bin'
build='i686-pc-linux-gnu'
build_alias=''
build_cpu='i686'
build_os='linux-gnu'
build_vendor='pc'
datadir='${datarootdir}'
datarootdir='${prefix}/share'
desktop_file='/usr/local/share/applications/audacious.desktop'
docdir='${datarootdir}/doc/${PACKAGE_TARNAME}'
dvidir='${docdir}'
exec_prefix='${prefix}'
host='i686-pc-linux-gnu'
host_alias=''
host_cpu='i686'
host_os='linux-gnu'
host_vendor='pc'
htmldir='${docdir}'
includedir='${prefix}/include'
infodir='${datarootdir}/info'
libdir='${exec_prefix}/lib'
libexecdir='${exec_prefix}/libexec'
localedir='${datarootdir}/locale'
localstatedir='${prefix}/var'
mandir='${datarootdir}/man'
oldincludedir='/usr/include'
pdfdir='${docdir}'
plugindir='${exec_prefix}/lib/audacious'
pluginsubs='\"Input\",\"Output\",\"Effect\",\"General\",\"Visualization\",\"Container\",\"Transport\",\"Discovery\"'
prefix='/usr/local'
program_transform_name='s,x,x,'
psdir='${docdir}'
sbindir='${exec_prefix}/sbin'
sharedstatedir='${prefix}/com'
sysconfdir='${prefix}/etc'
target='i686-pc-linux-gnu'
target_alias=''
target_cpu='i686'
target_os='linux-gnu'
target_vendor='pc'
## ----------- ##
## confdefs.h. ##
## ----------- ##
#define PACKAGE_NAME "audacious"
#define PACKAGE_TARNAME "audacious"
#define PACKAGE_VERSION "1.9.0"
#define PACKAGE_STRING "audacious 1.9.0"
#define PACKAGE_BUGREPORT "bugs+audacious@atheme.org"
#define _GNU_SOURCE 1
#define PACKAGE "audacious"
#define VERSION "1.9.0"
#define SHARED_SUFFIX ".so"
#define STDC_HEADERS 1
#define HAVE_SYS_TYPES_H 1
#define HAVE_SYS_STAT_H 1
#define HAVE_STDLIB_H 1
#define HAVE_STRING_H 1
#define HAVE_MEMORY_H 1
#define HAVE_STRINGS_H 1
#define HAVE_INTTYPES_H 1
#define HAVE_STDINT_H 1
#define HAVE_UNISTD_H 1
#define HAVE_ALLOCA_H 1
#define HAVE_ALLOCA 1
#define HAVE_STDLIB_H 1
#define HAVE_UNISTD_H 1
#define HAVE_GETPAGESIZE 1
#define HAVE_MMAP 1
#define INTDIV0_RAISES_SIGFPE 1
#define HAVE_INTTYPES_H_WITH_UINTMAX 1
#define HAVE_STDINT_H_WITH_UINTMAX 1
#define HAVE_UNSIGNED_LONG_LONG 1
#define HAVE_UINTMAX_T 1
#define HAVE_INTTYPES_H 1
#define HAVE_ARGZ_H 1
#define HAVE_LIMITS_H 1
#define HAVE_LOCALE_H 1
#define HAVE_NL_TYPES_H 1
#define HAVE_MALLOC_H 1
#define HAVE_STDDEF_H 1
#define HAVE_STDLIB_H 1
#define HAVE_STRING_H 1
#define HAVE_UNISTD_H 1
#define HAVE_SYS_PARAM_H 1
#define HAVE_FEOF_UNLOCKED 1
#define HAVE_FGETS_UNLOCKED 1
#define HAVE_GETC_UNLOCKED 1
#define HAVE_GETCWD 1
#define HAVE_GETEGID 1
#define HAVE_GETEUID 1
#define HAVE_GETGID 1
#define HAVE_GETUID 1
#define HAVE_MEMPCPY 1
#define HAVE_MUNMAP 1
#define HAVE_PUTENV 1
#define HAVE_SETENV 1
#define HAVE_SETLOCALE 1
#define HAVE_STPCPY 1
#define HAVE_STRCASECMP 1
#define HAVE_STRDUP 1
#define HAVE_STRTOUL 1
#define HAVE_TSEARCH 1
#define HAVE___ARGZ_COUNT 1
#define HAVE___ARGZ_STRINGIFY 1
#define HAVE___ARGZ_NEXT 1
#define HAVE___FSETLOCKING 1
#define HAVE_ICONV 1
#define ICONV_CONST
#define HAVE_LANGINFO_CODESET 1
#define HAVE_LC_MESSAGES 1
#define ENABLE_NLS 1
#define HAVE_GETTEXT 1
#define HAVE_DCGETTEXT 1
#define HAVE_UNISTD_H 1
#define HAVE_FCNTL_H 1
#define HAVE_SYS_IOCTL_H 1
#define HAVE_FNMATCH_H 1
#define HAVE_LIMITS_H 1
#define HAVE_WCHAR_H 1
#define HAVE_FTS_H 1
#define HAVE_EXECINFO_H 1
#define HAVE_MKDTEMP 1
#define HAVE_STATVFS 1
#define HAVE_STRTOUL 1
#define AUD_RCPATH ".audacious"
#define DOTAUDACIOUS_COMPAT 1
#define SHARED_SUFFIX ".so"
#define USE_CHARDET 1
#define USE_DBUS 1
#define DBUS_SERVICES_DIR "$datadir/dbus-1/services"
#define HAVE_XSPF_PLAYLIST 1
#define USE_REGEX_GNU 1
#define AUDACIOUS_DESKTOP_FILE "/usr/local/share/applications/audacious.desktop"
#define USE_EGGSM 1
configure: exit 0