All pastes #990612 Raw Edit

drbombay

public text v1 · immutable
#990612 ·published 2008-04-20 08:19 UTC
rendered paste body
powerpc-unknown-linux-gnu-gcc -DHAVE_CONFIG_H -I. -I. -I.. -I.. -I../utils -O2 -mcpu=7450 -mtune=7450 -maltivec -mabi=altivec -fivopts -fomit-frame-pointer -ftree-vectorize -pipe -frename-registers -fno-strict-aliasing -pthread -Wall -Wunused -MT yuv4mpeg_ratio.lo -MD -MP -MF .deps/yuv4mpeg_ratio.Tpo -c yuv4mpeg_ratio.c -o yuv4mpeg_ratio.o >/dev/null 2>&1
motionsearch.c: In function 'init_motion_search':
motionsearch.c:972: warning: unused variable 'cpucap'
 powerpc-unknown-linux-gnu-gcc -DHAVE_CONFIG_H -I. -I. -I.. -I.. -I../utils -O2 -mcpu=7450 -mtune=7450 -maltivec -mabi=altivec -fivopts -fomit-frame-pointer -ftree-vectorize -pipe -frename-registers -fno-strict-aliasing -pthread -Wall -Wunused -MT motionsearch.lo -MD -MP -MF .deps/motionsearch.Tpo -c motionsearch.c -o motionsearch.o >/dev/null 2>&1
 powerpc-unknown-linux-gnu-gcc -DHAVE_CONFIG_H -I. -I. -I.. -I.. -I../utils -O2 -mcpu=7450 -mtune=7450 -maltivec -mabi=altivec -fivopts -fomit-frame-pointer -ftree-vectorize -pipe -frename-registers -fno-strict-aliasing -pthread -Wall -Wunused -MT cpu_accel.lo -MD -MP -MF .deps/cpu_accel.Tpo -c cpu_accel.c  -fPIC -DPIC -o .libs/cpu_accel.o
cpu_accel.c: In function 'simd_name_ok':
cpu_accel.c:432: warning: unused variable 'foundit'
 powerpc-unknown-linux-gnu-gcc -DHAVE_CONFIG_H -I. -I. -I.. -I.. -I../utils -O2 -mcpu=7450 -mtune=7450 -maltivec -mabi=altivec -fivopts -fomit-frame-pointer -ftree-vectorize -pipe -frename-registers -fno-strict-aliasing -pthread -Wall -Wunused -MT cpu_accel.lo -MD -MP -MF .deps/cpu_accel.Tpo -c cpu_accel.c -o cpu_accel.o >/dev/null 2>&1
powerpc-unknown-linux-gnu-gcc -shared  .libs/mjpeg_logging.o .libs/mpegconsts.o .libs/mpegtimecode.o .libs/yuv4mpeg.o .libs/yuv4mpeg_ratio.o .libs/motionsearch.o .libs/cpu_accel.o  -lm  -mcpu=7450 -mtune=7450 -maltivec -mabi=altivec -pthread -Wl,-O1 -Wl,--as-needed -Wl,--hash-style=gnu -Wl,-znow -Wl,--sort-common -Wl,-soname -Wl,libmjpegutils-1.9.so.0 -o .libs/libmjpegutils-1.9.so.0.1.1
(cd .libs && rm -f libmjpegutils-1.9.so.0 && ln -s libmjpegutils-1.9.so.0.1.1 libmjpegutils-1.9.so.0)
(cd .libs && rm -f libmjpegutils.so && ln -s libmjpegutils-1.9.so.0.1.1 libmjpegutils.so)
powerpc-unknown-linux-gnu-ar cru .libs/libmjpegutils.a  mjpeg_logging.o mpegconsts.o mpegtimecode.o yuv4mpeg.o yuv4mpeg_ratio.o motionsearch.o cpu_accel.o
powerpc-unknown-linux-gnu-ranlib .libs/libmjpegutils.a
creating libmjpegutils.la
(cd .libs && rm -f libmjpegutils.la && ln -s ../libmjpegutils.la libmjpegutils.la)
Making all in mpeg2enc
mkdir .libs
 powerpc-unknown-linux-gnu-g++ -DHAVE_CONFIG_H -I. -I. -I.. -I.. -I../utils -O2 -mcpu=7450 -mtune=7450 -maltivec -mabi=altivec -fivopts -fomit-frame-pointer -ftree-vectorize -pipe -frename-registers -fvisibility-inlines-hidden -fno-strict-aliasing -pthread -MT elemstrmwriter.lo -MD -MP -MF .deps/elemstrmwriter.Tpo -c elemstrmwriter.cc  -fPIC -DPIC -o .libs/elemstrmwriter.o
 powerpc-unknown-linux-gnu-g++ -DHAVE_CONFIG_H -I. -I. -I.. -I.. -I../utils -O2 -mcpu=7450 -mtune=7450 -maltivec -mabi=altivec -fivopts -fomit-frame-pointer -ftree-vectorize -pipe -frename-registers -fvisibility-inlines-hidden -fno-strict-aliasing -pthread -MT conform.lo -MD -MP -MF .deps/conform.Tpo -c conform.cc  -fPIC -DPIC -o .libs/conform.o
 powerpc-unknown-linux-gnu-g++ -DHAVE_CONFIG_H -I. -I. -I.. -I.. -I../utils -O2 -mcpu=7450 -mtune=7450 -maltivec -mabi=altivec -fivopts -fomit-frame-pointer -ftree-vectorize -pipe -frename-registers -fvisibility-inlines-hidden -fno-strict-aliasing -pthread -MT conform.lo -MD -MP -MF .deps/conform.Tpo -c conform.cc -o conform.o >/dev/null 2>&1
 powerpc-unknown-linux-gnu-g++ -DHAVE_CONFIG_H -I. -I. -I.. -I.. -I../utils -O2 -mcpu=7450 -mtune=7450 -maltivec -mabi=altivec -fivopts -fomit-frame-pointer -ftree-vectorize -pipe -frename-registers -fvisibility-inlines-hidden -fno-strict-aliasing -pthread -MT elemstrmwriter.lo -MD -MP -MF .deps/elemstrmwriter.Tpo -c elemstrmwriter.cc -o elemstrmwriter.o >/dev/null 2>&1
 powerpc-unknown-linux-gnu-g++ -DHAVE_CONFIG_H -I. -I. -I.. -I.. -I../utils -O2 -mcpu=7450 -mtune=7450 -maltivec -mabi=altivec -fivopts -fomit-frame-pointer -ftree-vectorize -pipe -frename-registers -fvisibility-inlines-hidden -fno-strict-aliasing -pthread -MT encoderparams.lo -MD -MP -MF .deps/encoderparams.Tpo -c encoderparams.cc  -fPIC -DPIC -o .libs/encoderparams.o
 powerpc-unknown-linux-gnu-g++ -DHAVE_CONFIG_H -I. -I. -I.. -I.. -I../utils -O2 -mcpu=7450 -mtune=7450 -maltivec -mabi=altivec -fivopts -fomit-frame-pointer -ftree-vectorize -pipe -frename-registers -fvisibility-inlines-hidden -fno-strict-aliasing -pthread -MT macroblock.lo -MD -MP -MF .deps/macroblock.Tpo -c macroblock.cc  -fPIC -DPIC -o .libs/macroblock.o
 powerpc-unknown-linux-gnu-g++ -DHAVE_CONFIG_H -I. -I. -I.. -I.. -I../utils -O2 -mcpu=7450 -mtune=7450 -maltivec -mabi=altivec -fivopts -fomit-frame-pointer -ftree-vectorize -pipe -frename-registers -fvisibility-inlines-hidden -fno-strict-aliasing -pthread -MT encoderparams.lo -MD -MP -MF .deps/encoderparams.Tpo -c encoderparams.cc -o encoderparams.o >/dev/null 2>&1
In file included from macroblock.hh:54,
                 from macroblock.cc:26:
encodertypes.h: In member function 'int MotionVector::CodingPenaltyForSAD() const':
encodertypes.h:73: error: 'abs' was not declared in this scope
macroblock.cc: In member function 'void MacroBlock::SelectCodingModeOnVariance()':
macroblock.cc:58: error: 'INT_MAX' was not declared in this scope
make[2]: *** [macroblock.lo] Error 1
make[2]: *** Waiting for unfinished jobs....
 powerpc-unknown-linux-gnu-g++ -DHAVE_CONFIG_H -I. -I. -I.. -I.. -I../utils -O2 -mcpu=7450 -mtune=7450 -maltivec -mabi=altivec -fivopts -fomit-frame-pointer -ftree-vectorize -pipe -frename-registers -fvisibility-inlines-hidden -fno-strict-aliasing -pthread -MT motionest.lo -MD -MP -MF .deps/motionest.Tpo -c motionest.cc  -fPIC -DPIC -o .libs/motionest.o
 powerpc-unknown-linux-gnu-g++ -DHAVE_CONFIG_H -I. -I. -I.. -I.. -I../utils -O2 -mcpu=7450 -mtune=7450 -maltivec -mabi=altivec -fivopts -fomit-frame-pointer -ftree-vectorize -pipe -frename-registers -fvisibility-inlines-hidden -fno-strict-aliasing -pthread -MT motionest.lo -MD -MP -MF .deps/motionest.Tpo -c motionest.cc -o motionest.o >/dev/null 2>&1
make[1]: *** [all-recursive] Error 1
make: *** [all] Error 2

!!! ERROR in media-video/mjpegtools-1.9.0_rc3:
!!! In src_compile at line 4048
!!! emake failed

!!! Call stack:
!!!    * src_compile (/var/tmp/paludis/media-video-mjpegtools-1.9.0_rc3/temp/loadsaveenv:4048)
!!!    * ebuild_f_compile (/usr/libexec/paludis/0/src_compile.bash:49)
!!!    * ebuild_main (/usr/libexec/paludis/ebuild.bash:462)
!!!    * main (/usr/libexec/paludis/ebuild.bash:480)

diefunc: making ebuild PID 3349 exit with error
die trap: exiting with error.

Install error:
  * In program paludis -i mjpegtools:
  * When performing install action from command line:
  * When executing install task:
  * When installing 'media-video/mjpegtools-1.9.0_rc3:1::gentoo':
  * Install error: Install failed for 'media-video/mjpegtools-1.9.0_rc3:1::gentoo'