All pastes #990141 Raw Edit

Mine [Revised]

public text v1 · immutable
#990141 ·published 2008-04-20 00:02 UTC
rendered paste body
security/apparmor/main.c: In Funktion »aa_audit_base«:
security/apparmor/main.c:387: Fehler: »AUDIT_APPARMOR_ALLOWED« nicht deklariert (erste Benutzung in dieser Funktion)
security/apparmor/main.c:387: Fehler: (Jeder nicht deklarierte Bezeichner wird nur einmal aufgeführt
security/apparmor/main.c:387: Fehler: für jede Funktion in der er auftritt.)
security/apparmor/main.c: In Funktion »aa_audit_syscallreject«:
security/apparmor/main.c:488: Fehler: »AUDIT_APPARMOR_DENIED« nicht deklariert (erste Benutzung in dieser Funktion)
security/apparmor/main.c: In Funktion »aa_audit_hint«:
security/apparmor/main.c:502: Fehler: »AUDIT_APPARMOR_HINT« nicht deklariert (erste Benutzung in dieser Funktion)
security/apparmor/main.c: In Funktion »aa_audit_status«:
security/apparmor/main.c:507: Fehler: »AUDIT_APPARMOR_STATUS« nicht deklariert (erste Benutzung in dieser Funktion)
security/apparmor/main.c: In Funktion »aa_audit_reject«:
security/apparmor/main.c:512: Fehler: »AUDIT_APPARMOR_DENIED« nicht deklariert (erste Benutzung in dieser Funktion)
security/apparmor/main.c: In Funktion »aa_audit«:
security/apparmor/main.c:522: Fehler: »AUDIT_APPARMOR_DENIED« nicht deklariert (erste Benutzung in dieser Funktion)
security/apparmor/main.c:530: Fehler: »AUDIT_APPARMOR_AUDIT« nicht deklariert (erste Benutzung in dieser Funktion)
security/apparmor/main.c:532: Fehler: »AUDIT_APPARMOR_ALLOWED« nicht deklariert (erste Benutzung in dieser Funktion)
security/apparmor/main.c: In Funktion »do_change_profile«:
security/apparmor/main.c:1196: Fehler: »AUDIT_APPARMOR_AUDIT« nicht deklariert (erste Benutzung in dieser Funktion)
security/apparmor/main.c: In Funktion »aa_change_task_context«:
security/apparmor/main.x:1460: Fehler: expected expression before »{« token
make[3]: *** [security/apparmor/main.o] Fehler 1
make[2]: *** [security/apparmor] Fehler 2
make[1]: *** [security] Fehler 2