All pastes #989840 Raw Edit

DiViN3

public text v1 · immutable
#989840 ·published 2008-04-19 19:39 UTC
rendered paste body
divine@Divine:~$ cd psybnc
divine@Divine:~/psybnc$ make
Initializing bouncer compilation
[*] Running Conversion Tool for older psyBNC Data.
tools/convconf.c:27:19: error: stdio.h: No such file or directory
tools/convconf.c:28:23: error: sys/types.h: No such file or directory
tools/convconf.c:29:24: error: sys/socket.h: No such file or directory
tools/convconf.c:30:19: error: netdb.h: No such file or directory
tools/convconf.c:31:20: error: stdlib.h: No such file or directory
tools/convconf.c:34:20: error: unistd.h: No such file or directory
tools/convconf.c:35:19: error: fcntl.h: No such file or directory
tools/convconf.c:36:19: error: errno.h: No such file or directory
tools/convconf.c:37:22: error: sys/time.h: No such file or directory
tools/convconf.c:38:24: error: netinet/in.h: No such file or directory
tools/convconf.c:39:20: error: string.h: No such file or directory
tools/convconf.c:41:22: error: sys/stat.h: No such file or directory
tools/convconf.c:42:23: error: arpa/inet.h: No such file or directory
tools/convconf.c:43:19: error: ctype.h: No such file or directory
tools/convconf.c:44:20: error: signal.h: No such file or directory
tools/convconf.c:47: error: expected â)â before â*â token
tools/convconf.c:87: error: expected declaration specifiers or â...â before âFILEâ
tools/convconf.c: In function âconvertlistâ:
tools/convconf.c:94: error: âFILEâ undeclared (first use in this function)
tools/convconf.c:94: error: (Each undeclared identifier is reported only once
tools/convconf.c:94: error: for each function it appears in.)
tools/convconf.c:94: error: âlistfileâ undeclared (first use in this function)
tools/convconf.c:96: error: âNULLâ undeclared (first use in this function)
tools/convconf.c:99: warning: incompatible implicit declaration of built-in function âstrchrâ
tools/convconf.c:105: warning: incompatible implicit declaration of built-in function âsprintfâ
tools/convconf.c:106: warning: incompatible implicit declaration of built-in function âfprintfâ
tools/convconf.c:106: error: âoutfileâ undeclared (first use in this function)
tools/convconf.c: At top level:
tools/convconf.c:115: error: expected declaration specifiers or â...â before âFILEâ
tools/convconf.c: In function âconvertlistsâ:
tools/convconf.c:119: warning: incompatible implicit declaration of built-in function âsprintfâ
tools/convconf.c:121: error: âoutfileâ undeclared (first use in this function)
tools/convconf.c:121: error: too many arguments to function âconvertlistâ
tools/convconf.c:123: error: too many arguments to function âconvertlistâ
tools/convconf.c:125: error: too many arguments to function âconvertlistâ
tools/convconf.c:127: error: too many arguments to function âconvertlistâ
tools/convconf.c:129: error: too many arguments to function âconvertlistâ
tools/convconf.c:131: error: too many arguments to function âconvertlistâ
tools/convconf.c:133: error: too many arguments to function âconvertlistâ
tools/convconf.c:135: error: too many arguments to function âconvertlistâ
tools/convconf.c: In function âmainâ:
tools/convconf.c:142: error: âFILEâ undeclared (first use in this function)
tools/convconf.c:142: error: âhandleâ undeclared (first use in this function)
tools/convconf.c:143: error: âfconfifâ undeclared (first use in this function)
tools/convconf.c:155: error: âNULLâ undeclared (first use in this function)
tools/convconf.c:158: warning: incompatible implicit declaration of built-in function âprintfâ
tools/convconf.c:163: warning: incompatible implicit declaration of built-in function âexitâ
tools/convconf.c:178: warning: incompatible implicit declaration of built-in function âsprintfâ
tools/convconf.c:185: error: too many arguments to function âconvertlistsâ
tools/convconf.c:189: error: too many arguments to function âconvertlistâ
tools/convconf.c:195: warning: incompatible implicit declaration of built-in function âprintfâ
tools/convconf.c:199: warning: incompatible implicit declaration of built-in function âfprintfâ
tools/convconf.c:209: warning: incompatible implicit declaration of built-in function âfprintfâ
tools/convconf.c:214: warning: incompatible implicit declaration of built-in function âexitâ
make: *** [all] Error 1