make[2]: Entering directory `/usr/local/src/temp/classpath_cvs_060724/native/plugin'
if /bin/sh ../../libtool --tag=CXX --mode=compile g++ -DHAVE_CONFIG_H -I. -I. -I../../include -Wall -DAPPLETVIEWER_EXECUTABLE="\"/usr/local/classpath/bin/gappletviewer\"" -I/usr/include/glib-2.0 -I/usr/lib/glib-2.0/include -pthread -I/usr/include/gtk-2.0 -I/usr/lib/gtk-2.0/include -I/usr/include/atk-1.0 -I/usr/include/cairo -I/usr/include/pango-1.0 -I/usr/include/glib-2.0 -I/usr/lib/glib-2.0/include -O2 -march=k8 -mtune=k8 -MT libgcjwebplugin_la-gcjwebplugin.lo -MD -MP -MF ".deps/libgcjwebplugin_la-gcjwebplugin.Tpo" -c -o libgcjwebplugin_la-gcjwebplugin.lo `test -f 'gcjwebplugin.cc' || echo './'`gcjwebplugin.cc; \
then mv -f ".deps/libgcjwebplugin_la-gcjwebplugin.Tpo" ".deps/libgcjwebplugin_la-gcjwebplugin.Plo"; else rm -f ".deps/libgcjwebplugin_la-gcjwebplugin.Tpo"; exit 1; fi
g++ -DHAVE_CONFIG_H -I. -I. -I../../include -Wall -DAPPLETVIEWER_EXECUTABLE=\"/usr/local/classpath/bin/gappletviewer\" -I/usr/include/glib-2.0 -I/usr/lib/glib-2.0/include -pthread -I/usr/include/gtk-2.0 -I/usr/lib/gtk-2.0/include -I/usr/include/atk-1.0 -I/usr/include/cairo -I/usr/include/pango-1.0 -I/usr/include/glib-2.0 -I/usr/lib/glib-2.0/include -O2 -march=k8 -mtune=k8 -MT libgcjwebplugin_la-gcjwebplugin.lo -MD -MP -MF .deps/libgcjwebplugin_la-gcjwebplugin.Tpo -c gcjwebplugin.cc -fPIC -DPIC -o .libs/libgcjwebplugin_la-gcjwebplugin.o
In file included from /usr/include/jri.h:41,
from /usr/include/npapi.h:10,
from gcjwebplugin.cc:47:
/usr/include/jritypes.h:66: error: `jbool' does not name a type
/usr/include/jritypes.h:74: error: `jref' does not name a type
/usr/include/jritypes.h:141: error: expected initializer before "JRI_GetCurrentEnv"
In file included from /usr/include/npapi.h:10,
from gcjwebplugin.cc:47:
/usr/include/jri.h:417: error: expected identifier before '*' token
/usr/include/jri.h:417: error: `jbool' declared as function returning a function
/usr/include/jri.h:422: error: expected identifier before '*' token
/usr/include/jri.h:422: error: `jbool' declared as function returning a function
/usr/include/jri.h:422: error: `int JRIEnvInterface::jbool(int*)' and `int JRIEnvInterface::jbool(int*)' cannot be overloaded
/usr/include/jri.h:427: error: expected identifier before '*' token
/usr/include/jri.h:427: error: `jbool' declared as function returning a function
/usr/include/jri.h:427: error: `int JRIEnvInterface::jbool(int*)' and `int JRIEnvInterface::jbool(int*)' cannot be overloaded
/usr/include/jri.h:428: error: expected identifier before '*' token
/usr/include/jri.h:428: error: `jbool' declared as function returning a function
/usr/include/jri.h:428: error: `int JRIEnvInterface::jbool(int*)' and `int JRIEnvInterface::jbool(int*)' cannot be overloaded
/usr/include/jri.h:429: error: expected identifier before '*' token
/usr/include/jri.h:429: error: `jbool' declared as function returning a function
/usr/include/jri.h:429: error: `int JRIEnvInterface::jbool(int*)' and `int JRIEnvInterface::jbool(int*)' cannot be overloaded
/usr/include/jri.h:453: error: expected identifier before '*' token
/usr/include/jri.h:453: error: `jbool' declared as function returning a function
/usr/include/jri.h:453: error: `int JRIEnvInterface::jbool(int*)' and `int JRIEnvInterface::jbool(int*)' cannot be overloaded
/usr/include/jri.h:462: error: `jbool' is not a type
/usr/include/jri.h:470: error: expected identifier before '*' token
/usr/include/jri.h:470: error: `jbool' declared as function returning a function
/usr/include/jri.h:470: error: `int JRIEnvInterface::jbool(int*)' and `int JRIEnvInterface::jbool(int*)' cannot be overloaded
/usr/include/jri.h:475: error: expected identifier before '*' token
/usr/include/jri.h:475: error: `jbool' declared as function returning a function
/usr/include/jri.h:475: error: `int JRIEnvInterface::jbool(int*)' and `int JRIEnvInterface::jbool(int*)' cannot be overloaded
/usr/include/jri.h:476: error: expected identifier before '*' token
/usr/include/jri.h:476: error: `jbool' declared as function returning a function
/usr/include/jri.h:476: error: `int JRIEnvInterface::jbool(int*)' and `int JRIEnvInterface::jbool(int*)' cannot be overloaded
/usr/include/jri.h:477: error: expected identifier before '*' token
/usr/include/jri.h:477: error: `jbool' declared as function returning a function
/usr/include/jri.h:477: error: `int JRIEnvInterface::jbool(int*)' and `int JRIEnvInterface::jbool(int*)' cannot be overloaded
/usr/include/jri.h:501: error: expected identifier before '*' token
/usr/include/jri.h:501: error: `jbool' declared as function returning a function
/usr/include/jri.h:501: error: `int JRIEnvInterface::jbool(int*)' and `int JRIEnvInterface::jbool(int*)' cannot be overloaded
/usr/include/jri.h:510: error: `jbool' is not a type
In file included from gcjwebplugin.cc:47:
/usr/include/npapi.h:419: error: `jref' does not name a type
/usr/include/npapi.h:456: error: `jref' does not name a type
In file included from gcjwebplugin.cc:48:
/usr/include/npupp.h:934: error: typedef `jref' is initialized (use __typeof__ instead)
/usr/include/npupp.h:934: error: `NPN_GetJavaPeerUPP' was not declared in this scope
/usr/include/npupp.h:934: error: expected `,' or `;' before '(' token
/usr/include/npupp.h:1068: error: `NPN_GetJavaPeerUPP' does not name a type
gcjwebplugin.cc:61:31: nsIPluginInstance.h: No such file or directory
gcjwebplugin.cc:62:35: nsIPluginInstancePeer.h: No such file or directory
gcjwebplugin.cc:63:31: nsIPluginTagInfo2.h: No such file or directory
gcjwebplugin.cc:145: error: ISO C++ forbids declaration of `NS_DEFINE_IID' with no type
gcjwebplugin.cc:145: error: `kIPluginTagInfo2IID' was not declared in this scope
gcjwebplugin.cc:145: error: `NS_IPLUGINTAGINFO2_IID' was not declared in this scope
gcjwebplugin.cc:145: error: initializer expression list treated as compound expression
gcjwebplugin.cc:203: error: ISO C++ forbids declaration of `nsIPluginTagInfo2' with no type
gcjwebplugin.cc:203: error: expected `;' before '*' token
gcjwebplugin.cc: In function `NPError GCJ_GetValue(NPP_t*, NPPVariable, void*)':
gcjwebplugin.cc:596: error: `NPPVpluginNeedsXEmbed' was not declared in this scope
gcjwebplugin.cc:599: error: `PRBool' was not declared in this scope
gcjwebplugin.cc:599: error: `bool_value' was not declared in this scope
gcjwebplugin.cc:599: error: expected primary-expression before ')' token
gcjwebplugin.cc:599: error: expected `;' before "value"
gcjwebplugin.cc:600: error: `PR_TRUE' was not declared in this scope
gcjwebplugin.cc:600: warning: unused variable 'PR_TRUE'
gcjwebplugin.cc:596: warning: unused variable 'NPPVpluginNeedsXEmbed'
gcjwebplugin.cc: In function `NPError GCJ_SetWindow(NPP_t*, NPWindow*)':
gcjwebplugin.cc:690: warning: int format, uint32 arg (arg 2)
gcjwebplugin.cc:708: warning: int format, uint32 arg (arg 2)
gcjwebplugin.cc: In function `gchar* plugin_get_documentbase(NPP_t*)':
gcjwebplugin.cc:872: error: `nsIPluginInstance' was not declared in this scope
gcjwebplugin.cc:872: error: `xpcom_instance' was not declared in this scope
gcjwebplugin.cc:873: error: `nsIPluginInstancePeer' was not declared in this scope
gcjwebplugin.cc:873: error: `peer' was not declared in this scope
gcjwebplugin.cc:874: error: `nsresult' was not declared in this scope
gcjwebplugin.cc:874: error: expected `;' before "result"
gcjwebplugin.cc:875: error: `nsIPluginTagInfo2' was not declared in this scope
gcjwebplugin.cc:875: error: `pluginTagInfo2' was not declared in this scope
gcjwebplugin.cc:880: error: expected primary-expression before ')' token
gcjwebplugin.cc:894: error: 'union info_union' has no member named 'info_field'
gcjwebplugin.cc:896: error: `result' was not declared in this scope
gcjwebplugin.cc:896: error: `kIPluginTagInfo2IID' was not declared in this scope
gcjwebplugin.cc:916: error: `NS_RELEASE' was not declared in this scope
gcjwebplugin.cc:873: warning: unused variable 'nsIPluginInstancePeer'
gcjwebplugin.cc:874: warning: unused variable 'nsresult'
gcjwebplugin.cc:875: warning: unused variable 'nsIPluginTagInfo2'
gcjwebplugin.cc:896: warning: unused variable 'kIPluginTagInfo2IID'
gcjwebplugin.cc: At global scope:
gcjwebplugin.cc:145: warning: 'NS_DEFINE_IID' defined but not used
make[2]: *** [libgcjwebplugin_la-gcjwebplugin.lo] Error 1
make[2]: Leaving directory `/usr/local/src/temp/classpath_cvs_060724/native/plugin'
make[1]: *** [all-recursive] Error 1
make[1]: Leaving directory `/usr/local/src/temp/classpath_cvs_060724/native'
make: *** [all-recursive] Error 1
root@axia3:/usr/local/src/temp/classpath_cvs_060724#