All pastes #989302 Raw Edit

Anonymous

public text v1 · immutable
#989302 ·published 2008-04-19 06:42 UTC
rendered paste body
make[2]: Entering directory `/media/ExtLinux/code/wine-git/dlls/schannel/tests'
make[2]: Nothing to be done for `all'.
make[2]: Leaving directory `/media/ExtLinux/code/wine-git/dlls/schannel/tests'
make[2]: Entering directory `/media/ExtLinux/code/wine-git/dlls/secur32/tests'
make[2]: Nothing to be done for `all'.
make[2]: Leaving directory `/media/ExtLinux/code/wine-git/dlls/secur32/tests'
make[2]: Entering directory `/media/ExtLinux/code/wine-git/dlls/serialui/tests'
make[2]: Nothing to be done for `all'.
make[2]: Leaving directory `/media/ExtLinux/code/wine-git/dlls/serialui/tests'
make[2]: Entering directory `/media/ExtLinux/code/wine-git/dlls/setupapi/tests'
make[2]: Nothing to be done for `all'.
make[2]: Leaving directory `/media/ExtLinux/code/wine-git/dlls/setupapi/tests'
make[2]: Entering directory `/media/ExtLinux/code/wine-git/dlls/shdocvw/tests'
make[2]: Nothing to be done for `all'.
make[2]: Leaving directory `/media/ExtLinux/code/wine-git/dlls/shdocvw/tests'
make[2]: Entering directory `/media/ExtLinux/code/wine-git/dlls/shell32/tests'
make[2]: Nothing to be done for `all'.
make[2]: Leaving directory `/media/ExtLinux/code/wine-git/dlls/shell32/tests'
make[2]: Entering directory `/media/ExtLinux/code/wine-git/dlls/shlwapi/tests'
make[2]: Nothing to be done for `all'.
make[2]: Leaving directory `/media/ExtLinux/code/wine-git/dlls/shlwapi/tests'
make[2]: Entering directory `/media/ExtLinux/code/wine-git/dlls/snmpapi/tests'
make[2]: Nothing to be done for `all'.
make[2]: Leaving directory `/media/ExtLinux/code/wine-git/dlls/snmpapi/tests'
make[2]: Entering directory `/media/ExtLinux/code/wine-git/dlls/spoolss/tests'
make[2]: Nothing to be done for `all'.
make[2]: Leaving directory `/media/ExtLinux/code/wine-git/dlls/spoolss/tests'
make[2]: Entering directory `/media/ExtLinux/code/wine-git/dlls/urlmon/tests'
make[2]: Nothing to be done for `all'.
make[2]: Leaving directory `/media/ExtLinux/code/wine-git/dlls/urlmon/tests'
make[2]: Entering directory `/media/ExtLinux/code/wine-git/dlls/user32/tests'
gcc -c -I. -I. -I../../../include -I../../../include   -D_REENTRANT -fPIC -Wall -pipe -fno-strict-aliasing -Wdeclaration-after-statement -Wwrite-strings -Wtype-limits -Wpointer-arith  -g -O2  -o menu.o menu.c
{standard input}: Assembler messages:
{standard input}:7412: Warning: end of file not at end of a line; newline inserted
{standard input}:7745: Error: unknown pseudo-op: `.l'
gcc: Internal error: Segmentation fault (program cc1)
Please submit a full bug report.
See <http://bugzilla.redhat.com/bugzilla> for instructions.
make[2]: *** [menu.o] Error 1
make[2]: Leaving directory `/media/ExtLinux/code/wine-git/dlls/user32/tests'
make[1]: *** [user32/tests] Error 2
make[1]: Leaving directory `/media/ExtLinux/code/wine-git/dlls'
make: *** [dlls] Error 2