| ../../config.h:89:1: error: "PACKAGE_VERSION" redefined
| In file included from /builder/newBuild/build/tmp/staging/arm-angstrom-linux-gnueabi/usr/include/libopkg/libopkg.h:20,
| from pk-backend-opkg.c:33:
| /builder/newBuild/build/tmp/staging/arm-angstrom-linux-gnueabi/usr/include/libopkg/config.h:161:1: error: this is the location of the previous definition
| In file included from /builder/newBuild/build/tmp/staging/arm-angstrom-linux-gnueabi/usr/include/libopkg/includes.h:4,
| from /builder/newBuild/build/tmp/staging/arm-angstrom-linux-gnueabi/usr/include/libopkg/pkg_dest.h:21,
| from /builder/newBuild/build/tmp/staging/arm-angstrom-linux-gnueabi/usr/include/libopkg/pkg.h:28,
| from /builder/newBuild/build/tmp/staging/arm-angstrom-linux-gnueabi/usr/include/libopkg/opkg_conf.h:25,
| from /builder/newBuild/build/tmp/staging/arm-angstrom-linux-gnueabi/usr/include/libopkg/libopkg.h:24,
| from pk-backend-opkg.c:33:
| ../../config.h:128:1: error: "VERSION" redefined
| In file included from /builder/newBuild/build/tmp/staging/arm-angstrom-linux-gnueabi/usr/include/libopkg/libopkg.h:20,
| from pk-backend-opkg.c:33:
| /builder/newBuild/build/tmp/staging/arm-angstrom-linux-gnueabi/usr/include/libopkg/config.h:170:1: error: this is the location of the previous definition
| In file included from pk-backend-opkg.c:33:
| /builder/newBuild/build/tmp/staging/arm-angstrom-linux-gnueabi/usr/include/libopkg/libopkg.h:27:27: error: opkg_download.h: No such file or directory
| /builder/newBuild/build/tmp/staging/arm-angstrom-linux-gnueabi/usr/include/libopkg/libopkg.h:28:24: error: opkg_utils.h: No such file or directory
| /builder/newBuild/build/tmp/staging/arm-angstrom-linux-gnueabi/usr/include/libopkg/libopkg.h:32:18: error: user.h: No such file or directory
| In file included from pk-backend-opkg.c:33:
| /builder/newBuild/build/tmp/staging/arm-angstrom-linux-gnueabi/usr/include/libopkg/libopkg.h:42: error: expected declaration specifiers or '...' before 'opkg_response_callback'
| /builder/newBuild/build/tmp/staging/arm-angstrom-linux-gnueabi/usr/include/libopkg/libopkg.h:78: error: expected '=', ',', ';', 'asm' or '__attribute__' before 'opkg_cb_response'
| /builder/newBuild/build/tmp/staging/arm-angstrom-linux-gnueabi/usr/include/libopkg/libopkg.h:81: error: expected '=', ',', ';', 'asm' or '__attribute__' before 'opkg_cb_download_progress'
| pk-backend-opkg.c:72: error: expected '=', ',', ';', 'asm' or '__attribute__' before 'opkg_cb_download_progress'
| pk-backend-opkg.c: In function 'backend_refresh_cache_thread':
| pk-backend-opkg.c:455: error: 'opkg_cb_download_progress' undeclared (first use in this function)
| pk-backend-opkg.c:455: error: (Each undeclared identifier is reported only once
| pk-backend-opkg.c:455: error: for each function it appears in.)
| pk-backend-opkg.c: In function 'backend_install_package_thread':
| pk-backend-opkg.c:667: error: 'opkg_cb_download_progress' undeclared (first use in this function)
| make[3]: *** [libpk_backend_opkg_la-pk-backend-opkg.lo] Error 1