/usr/src/ubnt-hal-0.6.280/src/madwifi-dfs-r3319-20080201/net80211/ieee80211_output.c:87:21: error: macro "for_each_netdev" requires 2 arguments, but only 1 given
/usr/src/ubnt-hal-0.6.280/src/madwifi-dfs-r3319-20080201/net80211/ieee80211_output.c: In function 'ieee80211_setup_macclone':
/usr/src/ubnt-hal-0.6.280/src/madwifi-dfs-r3319-20080201/net80211/ieee80211_output.c:87: error: 'for_each_netdev' undeclared (first use in this function)
/usr/src/ubnt-hal-0.6.280/src/madwifi-dfs-r3319-20080201/net80211/ieee80211_output.c:87: error: (Each undeclared identifier is reported only once
/usr/src/ubnt-hal-0.6.280/src/madwifi-dfs-r3319-20080201/net80211/ieee80211_output.c:87: error: for each function it appears in.)
/usr/src/ubnt-hal-0.6.280/src/madwifi-dfs-r3319-20080201/net80211/ieee80211_output.c:88: error: expected ';' before 'if'
make[4]: *** [/usr/src/ubnt-hal-0.6.280/src/madwifi-dfs-r3319-20080201/net80211/ieee80211_output.o] Error 1
make[3]: *** [/usr/src/ubnt-hal-0.6.280/src/madwifi-dfs-r3319-20080201/net80211] Error 2
make[2]: *** [_module_/usr/src/ubnt-hal-0.6.280/src/madwifi-dfs-r3319-20080201] Error 2
make[2]: Leaving directory `/usr/src/wireless-testing'
make[1]: *** [modules] Error 2
make[1]: Leaving directory `/usr/src/ubnt-hal-0.6.280/src/madwifi-dfs-r3319-20080201'
make: *** [build] Error 2