All pastes #986044 Raw Edit

Stuff

public text v1 · immutable
·published 2008-04-15 14:11 UTC
rendered paste body
 ccache arm-angstrom-linux-gnueabi-gcc -march=armv4t -mtune=arm920t -DHAVE_CONFIG_H -I. -I. -I../.. -isystem/home/dp/openmoko/build-xora/tmp/staging/arm-angstrom-linux-gnueabi/usr/include -Werror -Wcast-align -Wno-uninitialized -Wall -I../../src -I../../libpackagekit -I/home/dp/openmoko/build-xora/tmp/staging/arm-angstrom-linux-gnueabi/usr/include/glib-2.0 -I/home/dp/openmoko/build-xora/tmp/staging/arm-angstrom-linux-gnueabi/usr/lib/glib-2.0/include -pthread -I/home/dp/openmoko/build-xora/tmp/staging/arm-angstrom-linux-gnueabi/usr/include/dbus-1.0 -I/home/dp/openmoko/build-xora/tmp/staging/arm-angstrom-linux-gnueabi/usr/lib/dbus-1.0/include -I/home/dp/openmoko/build-xora/tmp/staging/arm-angstrom-linux-gnueabi/usr/include/glib-2.0 -I/home/dp/openmoko/build-xora/tmp/staging/arm-angstrom-linux-gnueabi/usr/lib/glib-2.0/include -I/home/dp/openmoko/build-xora/tmp/staging/arm-angstrom-linux-gnueabi/usr/include/glib-2.0 -I/home/dp/openmoko/build-xora/tmp/staging/arm-angstrom-linux-gnueabi/usr/lib/glib-2.0/include -I/home/dp/openmoko/build-xora/tmp/staging/arm-angstrom-linux-gnueabi/usr/include/libopkg -isystem/home/dp/openmoko/build-xora/tmp/staging/arm-angstrom-linux-gnueabi/usr/include -fexpensive-optimizations -fomit-frame-pointer -frename-registers -Os -MT libpk_backend_opkg_la-pk-backend-opkg.lo -MD -MP -MF .deps/libpk_backend_opkg_la-pk-backend-opkg.Tpo -c pk-backend-opkg.c  -fPIC -DPIC -o .libs/libpk_backend_opkg_la-pk-backend-opkg.o
In file included from /home/dp/openmoko/build-xora/tmp/staging/arm-angstrom-linux-gnueabi/usr/include/libopkg/includes.h:4,
                 from /home/dp/openmoko/build-xora/tmp/staging/arm-angstrom-linux-gnueabi/usr/include/libopkg/pkg_dest.h:21,
                 from /home/dp/openmoko/build-xora/tmp/staging/arm-angstrom-linux-gnueabi/usr/include/libopkg/pkg.h:28,
                 from /home/dp/openmoko/build-xora/tmp/staging/arm-angstrom-linux-gnueabi/usr/include/libopkg/opkg_conf.h:25,
                 from /home/dp/openmoko/build-xora/tmp/staging/arm-angstrom-linux-gnueabi/usr/include/libopkg/libopkg.h:24,
                 from pk-backend-opkg.c:33:
../../config.h:71:1: error: "PACKAGE" redefined
In file included from /home/dp/openmoko/build-xora/tmp/staging/arm-angstrom-linux-gnueabi/usr/include/libopkg/libopkg.h:20,
                 from pk-backend-opkg.c:33:
/home/dp/openmoko/build-xora/tmp/staging/arm-angstrom-linux-gnueabi/usr/include/libopkg/config.h:146:1: error: this is the location of the previous definition
In file included from /home/dp/openmoko/build-xora/tmp/staging/arm-angstrom-linux-gnueabi/usr/include/libopkg/includes.h:4,
                 from /home/dp/openmoko/build-xora/tmp/staging/arm-angstrom-linux-gnueabi/usr/include/libopkg/pkg_dest.h:21,
                 from /home/dp/openmoko/build-xora/tmp/staging/arm-angstrom-linux-gnueabi/usr/include/libopkg/pkg.h:28,
                 from /home/dp/openmoko/build-xora/tmp/staging/arm-angstrom-linux-gnueabi/usr/include/libopkg/opkg_conf.h:25,
                 from /home/dp/openmoko/build-xora/tmp/staging/arm-angstrom-linux-gnueabi/usr/include/libopkg/libopkg.h:24,
                 from pk-backend-opkg.c:33:
../../config.h:80:1: error: "PACKAGE_NAME" redefined
In file included from /home/dp/openmoko/build-xora/tmp/staging/arm-angstrom-linux-gnueabi/usr/include/libopkg/libopkg.h:20,
                 from pk-backend-opkg.c:33:
/home/dp/openmoko/build-xora/tmp/staging/arm-angstrom-linux-gnueabi/usr/include/libopkg/config.h:152:1: error: this is the location of the previous definition
In file included from /home/dp/openmoko/build-xora/tmp/staging/arm-angstrom-linux-gnueabi/usr/include/libopkg/includes.h:4,
                 from /home/dp/openmoko/build-xora/tmp/staging/arm-angstrom-linux-gnueabi/usr/include/libopkg/pkg_dest.h:21,
                 from /home/dp/openmoko/build-xora/tmp/staging/arm-angstrom-linux-gnueabi/usr/include/libopkg/pkg.h:28,
                 from /home/dp/openmoko/build-xora/tmp/staging/arm-angstrom-linux-gnueabi/usr/include/libopkg/opkg_conf.h:25,
                 from /home/dp/openmoko/build-xora/tmp/staging/arm-angstrom-linux-gnueabi/usr/include/libopkg/libopkg.h:24,
                 from pk-backend-opkg.c:33:
../../config.h:83:1: error: "PACKAGE_STRING" redefined
In file included from /home/dp/openmoko/build-xora/tmp/staging/arm-angstrom-linux-gnueabi/usr/include/libopkg/libopkg.h:20,
                 from pk-backend-opkg.c:33:
/home/dp/openmoko/build-xora/tmp/staging/arm-angstrom-linux-gnueabi/usr/include/libopkg/config.h:155:1: error: this is the location of the previous definition
In file included from /home/dp/openmoko/build-xora/tmp/staging/arm-angstrom-linux-gnueabi/usr/include/libopkg/includes.h:4,
                 from /home/dp/openmoko/build-xora/tmp/staging/arm-angstrom-linux-gnueabi/usr/include/libopkg/pkg_dest.h:21,
                 from /home/dp/openmoko/build-xora/tmp/staging/arm-angstrom-linux-gnueabi/usr/include/libopkg/pkg.h:28,
                 from /home/dp/openmoko/build-xora/tmp/staging/arm-angstrom-linux-gnueabi/usr/include/libopkg/opkg_conf.h:25,
                 from /home/dp/openmoko/build-xora/tmp/staging/arm-angstrom-linux-gnueabi/usr/include/libopkg/libopkg.h:24,
                 from pk-backend-opkg.c:33:
../../config.h:86:1: error: "PACKAGE_TARNAME" redefined
In file included from /home/dp/openmoko/build-xora/tmp/staging/arm-angstrom-linux-gnueabi/usr/include/libopkg/libopkg.h:20,
                 from pk-backend-opkg.c:33:
/home/dp/openmoko/build-xora/tmp/staging/arm-angstrom-linux-gnueabi/usr/include/libopkg/config.h:158:1: error: this is the location of the previous definition
In file included from /home/dp/openmoko/build-xora/tmp/staging/arm-angstrom-linux-gnueabi/usr/include/libopkg/includes.h:4,
                 from /home/dp/openmoko/build-xora/tmp/staging/arm-angstrom-linux-gnueabi/usr/include/libopkg/pkg_dest.h:21,
                 from /home/dp/openmoko/build-xora/tmp/staging/arm-angstrom-linux-gnueabi/usr/include/libopkg/pkg.h:28,
                 from /home/dp/openmoko/build-xora/tmp/staging/arm-angstrom-linux-gnueabi/usr/include/libopkg/opkg_conf.h:25,
                 from /home/dp/openmoko/build-xora/tmp/staging/arm-angstrom-linux-gnueabi/usr/include/libopkg/libopkg.h:24,
                 from pk-backend-opkg.c:33:
../../config.h:89:1: error: "PACKAGE_VERSION" redefined
In file included from /home/dp/openmoko/build-xora/tmp/staging/arm-angstrom-linux-gnueabi/usr/include/libopkg/libopkg.h:20,
                 from pk-backend-opkg.c:33:
/home/dp/openmoko/build-xora/tmp/staging/arm-angstrom-linux-gnueabi/usr/include/libopkg/config.h:161:1: error: this is the location of the previous definition
In file included from /home/dp/openmoko/build-xora/tmp/staging/arm-angstrom-linux-gnueabi/usr/include/libopkg/includes.h:4,
                 from /home/dp/openmoko/build-xora/tmp/staging/arm-angstrom-linux-gnueabi/usr/include/libopkg/pkg_dest.h:21,
                 from /home/dp/openmoko/build-xora/tmp/staging/arm-angstrom-linux-gnueabi/usr/include/libopkg/pkg.h:28,
                 from /home/dp/openmoko/build-xora/tmp/staging/arm-angstrom-linux-gnueabi/usr/include/libopkg/opkg_conf.h:25,
                 from /home/dp/openmoko/build-xora/tmp/staging/arm-angstrom-linux-gnueabi/usr/include/libopkg/libopkg.h:24,
                 from pk-backend-opkg.c:33:
../../config.h:128:1: error: "VERSION" redefined
In file included from /home/dp/openmoko/build-xora/tmp/staging/arm-angstrom-linux-gnueabi/usr/include/libopkg/libopkg.h:20,
                 from pk-backend-opkg.c:33:
/home/dp/openmoko/build-xora/tmp/staging/arm-angstrom-linux-gnueabi/usr/include/libopkg/config.h:170:1: error: this is the location of the previous definition
In file included from pk-backend-opkg.c:33:
/home/dp/openmoko/build-xora/tmp/staging/arm-angstrom-linux-gnueabi/usr/include/libopkg/libopkg.h:27:27: error: opkg_download.h: No such file or directory
/home/dp/openmoko/build-xora/tmp/staging/arm-angstrom-linux-gnueabi/usr/include/libopkg/libopkg.h:28:24: error: opkg_utils.h: No such file or directory
/home/dp/openmoko/build-xora/tmp/staging/arm-angstrom-linux-gnueabi/usr/include/libopkg/libopkg.h:32:18: error: user.h: No such file or directory
In file included from pk-backend-opkg.c:33:
/home/dp/openmoko/build-xora/tmp/staging/arm-angstrom-linux-gnueabi/usr/include/libopkg/libopkg.h:42: error: expected declaration specifiers or '...' before 'opkg_response_callback'
/home/dp/openmoko/build-xora/tmp/staging/arm-angstrom-linux-gnueabi/usr/include/libopkg/libopkg.h:78: error: expected '=', ',', ';', 'asm' or '__attribute__' before 'opkg_cb_response'
/home/dp/openmoko/build-xora/tmp/staging/arm-angstrom-linux-gnueabi/usr/include/libopkg/libopkg.h:81: error: expected '=', ',', ';', 'asm' or '__attribute__' before 'opkg_cb_download_progress'
pk-backend-opkg.c:72: error: expected '=', ',', ';', 'asm' or '__attribute__' before 'opkg_cb_download_progress'
pk-backend-opkg.c: In function 'backend_refresh_cache_thread':
pk-backend-opkg.c:455: error: 'opkg_cb_download_progress' undeclared (first use in this function)
pk-backend-opkg.c:455: error: (Each undeclared identifier is reported only once
pk-backend-opkg.c:455: error: for each function it appears in.)
pk-backend-opkg.c: In function 'backend_install_package_thread':
pk-backend-opkg.c:667: error: 'opkg_cb_download_progress' undeclared (first use in this function)
make[3]: *** [libpk_backend_opkg_la-pk-backend-opkg.lo] Error 1
make[3]: Leaving directory `/home/dp/openmoko/build-xora/tmp/work/armv4t-angstrom-linux-gnueabi/packagekit-0.1+git432046796fa420f57ab6c71081f7ba14e9a92574-r8/git/backends/opkg'
make[2]: *** [all-recursive] Error 1
make[2]: Leaving directory `/home/dp/openmoko/build-xora/tmp/work/armv4t-angstrom-linux-gnueabi/packagekit-0.1+git432046796fa420f57ab6c71081f7ba14e9a92574-r8/git/backends'
make[1]: *** [all-recursive] Error 1
make[1]: Leaving directory `/home/dp/openmoko/build-xora/tmp/work/armv4t-angstrom-linux-gnueabi/packagekit-0.1+git432046796fa420f57ab6c71081f7ba14e9a92574-r8/git'
make: *** [all] Error 2
FATAL: oe_runmake failed