rendered paste bodymake[4]: quittant le répertoire « /var/tmp/portage/libgphoto2-2.2.1-r1/work/libgphoto2-2.2.1/libgphoto2_port/disk »
Making all in ptpip
make[4]: entrant dans le répertoire « /var/tmp/portage/libgphoto2-2.2.1-r1/work/libgphoto2-2.2.1/libgphoto2_port/ptpip »
if /bin/sh ../libtool --tag=CC --mode=compile x86_64-pc-linux-gnu-gcc -DHAVE_CONFIG_H -I. -I. -I.. -I../libgphoto2_port -I.. -I../libgphoto2_port -DLOCALEDIR=\"/usr/share/locale\" -DIOLIBS=\"/usr/lib64/libgphoto2_port/0.6.1\" -Wall -Wmissing-declarations -Wmissing-prototypes -g -march=k8 -pipe -O2 -MT ptpip_la-ptpip.lo -MD -MP -MF ".deps/ptpip_la-ptpip.Tpo" -c -o ptpip_la-ptpip.lo `test -f 'ptpip.c' || echo './'`ptpip.c; \
then mv -f ".deps/ptpip_la-ptpip.Tpo" ".deps/ptpip_la-ptpip.Plo"; else rm -f ".deps/ptpip_la-ptpip.Tpo"; exit 1; fi
mkdir .libs
x86_64-pc-linux-gnu-gcc -DHAVE_CONFIG_H -I. -I. -I.. -I../libgphoto2_port -I.. -I../libgphoto2_port -DLOCALEDIR=\"/usr/share/locale\" -DIOLIBS=\"/usr/lib64/libgphoto2_port/0.6.1\" -Wall -Wmissing-declarations -Wmissing-prototypes -g -march=k8 -pipe -O2 -MT ptpip_la-ptpip.lo -MD -MP -MF .deps/ptpip_la-ptpip.Tpo -c ptpip.c -fPIC -DPIC -o .libs/ptpip_la-ptpip.o
x86_64-pc-linux-gnu-gcc -DHAVE_CONFIG_H -I. -I. -I.. -I../libgphoto2_port -I.. -I../libgphoto2_port -DLOCALEDIR=\"/usr/share/locale\" -DIOLIBS=\"/usr/lib64/libgphoto2_port/0.6.1\" -Wall -Wmissing-declarations -Wmissing-prototypes -g -march=k8 -pipe -O2 -MT ptpip_la-ptpip.lo -MD -MP -MF .deps/ptpip_la-ptpip.Tpo -c ptpip.c -o ptpip_la-ptpip.o >/dev/null 2>&1
/bin/sh ../libtool --tag=CC --mode=link x86_64-pc-linux-gnu-gcc -march=k8 -pipe -O2 -Wall -g -o ptpip.la -rpath /usr/lib64/libgphoto2_port/0.6.1 -module -no-undefined -avoid-version -export-dynamic -export-symbols ../iolib.sym ptpip_la-ptpip.lo ../libgphoto2_port/libgphoto2_port.la
echo "{ global:" > .libs/ptpip.ver
cat ../iolib.sym | sed -e "s/\(.*\)/\1;/" >> .libs/ptpip.ver
echo "local: *; };" >> .libs/ptpip.ver
x86_64-pc-linux-gnu-gcc -shared .libs/ptpip_la-ptpip.o -Wl,--rpath -Wl,/var/tmp/portage/libgphoto2-2.2.1-r1/work/libgphoto2-2.2.1/libgphoto2_port/libgphoto2_port/.libs ../libgphoto2_port/.libs/libgphoto2_port.so -march=k8 -Wl,-soname -Wl,ptpip.so -Wl,-version-script -Wl,.libs/ptpip.ver -o .libs/ptpip.so
x86_64-pc-linux-gnu-ar cru .libs/ptpip.a ptpip_la-ptpip.o
x86_64-pc-linux-gnu-ranlib .libs/ptpip.a
creating ptpip.la
(cd .libs && rm -f ptpip.la && ln -s ../ptpip.la ptpip.la)
make[4]: quittant le répertoire « /var/tmp/portage/libgphoto2-2.2.1-r1/work/libgphoto2-2.2.1/libgphoto2_port/ptpip »
Making all in doc
make[4]: entrant dans le répertoire « /var/tmp/portage/libgphoto2-2.2.1-r1/work/libgphoto2-2.2.1/libgphoto2_port/doc »
cd . && gtkdoc-scan --module=gphoto2-port --source-dir=../libgphoto2_port
cd . && gtkdoc-mktmpl --module=gphoto2-port
WARNING: No declaration found for: gp_port_get_error
###Can't parse args for function gp_port_set_error: ...)#ifdef __GNUC____attribute__((__format__(printf,2,3)))#endif;const char *gp_port_get_error (GPPort *port
WARNING: No declaration found for: GP_ERROR_IO_CLOSE
WARNING: No declaration found for: GP_ERROR_IO_OPEN
WARNING: No declaration found for: GP_ERROR_IO_PIN
WARNING: No declaration found for: GP_ERROR_IO_SERIAL_BREAK
WARNING: No declaration found for: GP_ERROR_IO_SERIAL_FLUSH
WARNING: No declaration found for: GP_ERROR_IO_TIMEOUT
###Can't parse args for function gp_log: ...)#ifdef __GNUC____attribute__((__format__(printf,3,4)))#endif;void gp_logv (GPLogLevel level, const char *domain, const char *format,va_list args)#ifdef __GNUC____attribute__((__format__(printf,3,0)))#endif;void gp_log_data (const char *domain, const char *data, unsigned int size
WARNING: No declaration found for: <TITLE>GPhoto2-Port-USB</FILE>
WARNING: No declaration found for: <TITLE>GPhoto2-Port-Serial</FILE>
=============================================================================
WARNING: 62 unused declarations.
These can be found in gphoto2-port-unused.txt.
They should be added to gphoto2-port-sections.txt in the appropriate place.
=============================================================================
cd . && gtkdoc-mkdb --module=gphoto2-port --source-dir=../libgphoto2_port
WARNING: Parameter described in source code comment block but does not exist -
FUNCTION: gp_port_set_error Parameter: Varargs.
WARNING: No declaration found for: gp_port_get_error
###Can't parse args for function gp_port_set_error: ...)#ifdef __GNUC____attribute__((__format__(printf,2,3)))#endif;const char *gp_port_get_error (GPPort *port
WARNING: No declaration found for: GP_ERROR_IO_CLOSE
WARNING: No declaration found for: GP_ERROR_IO_OPEN
WARNING: No declaration found for: GP_ERROR_IO_PIN
WARNING: No declaration found for: GP_ERROR_IO_SERIAL_BREAK
WARNING: No declaration found for: GP_ERROR_IO_SERIAL_FLUSH
WARNING: No declaration found for: GP_ERROR_IO_TIMEOUT
WARNING: Parameter described in source code comment block but does not exist -
FUNCTION: gp_log Parameter: Varargs.
WARNING: Parameter described in source code comment block but does not exist -
MACRO: GP_LOG Parameter: params.
WARNING: Parameter described in source code comment block but does not exist -
MACRO: GP_DEBUG Parameter: params.
###Can't parse args for function gp_log: ...)#ifdef __GNUC____attribute__((__format__(printf,3,4)))#endif;void gp_logv (GPLogLevel level, const char *domain, const char *format,va_list args)#ifdef __GNUC____attribute__((__format__(printf,3,0)))#endif;void gp_log_data (const char *domain, const char *data, unsigned int size
WARNING: No declaration found for: <TITLE>GPhoto2-Port-USB</FILE>
WARNING: No declaration found for: <TITLE>GPhoto2-Port-Serial</FILE>
25% symbol docs coverage (32 symbols documented, 8 symbols incomplete, 97 not documented)
See gphoto2-port-undocumented.txt for a list of missing docs.
The doc coverage percentage doesn't include intro sections.
if ! test -d html ; then mkdir html ; fi
cd html && gtkdoc-mkhtml gphoto2-port .././gphoto2-port-api.sgml
/usr/bin/openjade:/usr/share/sgml/docbook/xml-dtd-4.1.2/ent/iso-amsa.ent:8:19:*** glibc detected *** /usr/bin/openjade: munmap_chunk(): invalid pointer: 0x00007fffa15f43a0 ***
======= Backtrace: =========
/lib/libc.so.6[0x2ba50a7017ec]
/usr/lib/gcc/x86_64-pc-linux-gnu/3.4.6/libstdc++.so.6(_ZdlPv+0xe)[0x2ba50a2f213e]
/usr/lib64/libosp.so.4(_ZN6OpenSP15MessageReporter15dispatchMessageERKNS_7MessageE+0x11b)[0x2ba509df6d7b]
/usr/lib64/libospgrove.so.0(_ZN6OpenSP8GroveApp15dispatchMessageERKNS_7MessageE+0x20)[0x2ba509a97410]
/usr/lib64/libospgrove.so.0(_ZN6OpenSP31GroveBuilderMessageEventHandler7messageEPNS_12MessageEventE+0x44)[0x2ba509a9c644]
/usr/lib64/libosp.so.4(_ZN6OpenSP9Messenger7messageERKNS_12MessageType1ERKNS_10MessageArgE+0x76)[0x2ba509df51f6]
/usr/lib64/libosp.so.4(_ZN6OpenSP6Parser17parseNamedCharRefEv+0x22f)[0x2ba509e3689f]
/usr/lib64/libosp.so.4(_ZN6OpenSP6Parser12parseLiteralENS_4ModeES1_mRKNS_12MessageType1EjRNS_4TextE+0x6de)[0x2ba509e38aee]
/usr/lib64/libosp.so.4(_ZN6OpenSP6Parser21parseParameterLiteralEbRNS_4TextE+0x42)[0x2ba509e5c942]
/usr/lib64/libosp.so.4(_ZN6OpenSP6Parser10parseParamERKNS_13AllowedParamsEjRNS_5ParamE+0x7ab)[0x2ba509e60c0b]
/usr/lib64/libosp.so.4(_ZN6OpenSP6Parser15parseEntityDeclEv+0x320)[0x2ba509e42100]
/usr/lib64/libosp.so.4(_ZN6OpenSP6Parser12doDeclSubsetEv+0x636)[0x2ba509e51576]
/usr/lib64/libosp.so.4(_ZN6OpenSP6Parser8parseAllERNS_12EventHandlerEPVKi+0xa0)[0x2ba509dfea80]
/usr/lib64/libosp.so.4(_ZN6OpenSP9ParserApp8parseAllERNS_10SgmlParserERNS_12EventHandlerEPVKi+0xde)[0x2ba509e01a1e]
/usr/lib64/libosp.so.4(_ZN6OpenSP9ParserApp14generateEventsEPNS_22ErrorCountEventHandlerE+0x41)[0x2ba509e01ad1]
/usr/lib64/libospgrove.so.0[0x2ba509a97343]
/usr/lib64/libospgrove.so.0(_ZN6OpenSP8GroveApp14generateEventsEPNS_22ErrorCountEventHandlerE+0x22)[0x2ba509a97372]
/usr/lib64/libostyle.so.0(_ZN14OpenJade_DSSSL8DssslApp12processSysidERKN6OpenSP6StringIjEE+0xba)[0x2ba50981372a]
/usr/lib64/libosp.so.4(_ZN6OpenSP9EntityApp16processArgumentsEiPPc+0x90)[0x2ba509dd00c0]
/usr/lib64/libosp.so.4(_ZN6OpenSP10CmdLineApp3runEiPPc+0x90)[0x2ba509dbbb10]
/usr/bin/openjade[0x411bda]
/lib/libc.so.6(__libc_start_main+0xf6)[0x2ba50a6b5136]
/usr/bin/openjade(__gxx_personality_v0+0x181)[0x410d89]
======= Memory map: ========
00400000-004ae000 r-xp 00000000 03:08 198675 /usr/bin/openjade
005ae000-005b0000 rw-p 000ae000 03:08 198675 /usr/bin/openjade
005b0000-006c3000 rw-p 005b0000 00:00 0 [heap]
2ba5094b2000-2ba5094cd000 r-xp 00000000 03:08 510619 /lib64/ld-2.4.so
2ba5094cd000-2ba5094cf000 rw-p 2ba5094cd000 00:00 0
2ba5095cc000-2ba5095cd000 r--p 0001a000 03:08 510619 /lib64/ld-2.4.so
2ba5095cd000-2ba5095ce000 rw-p 0001b000 03:08 510619 /lib64/ld-2.4.so
2ba5095ce000-2ba5095d4000 r-xp 00000000 03:08 2513518 /usr/lib64/libsandbox.so.0.0.0
2ba5095d4000-2ba5096d3000 ---p 00006000 03:08 2513518 /usr/lib64/libsandbox.so.0.0.0
2ba5096d3000-2ba5096d4000 rw-p 00005000 03:08 2513518 /usr/lib64/libsandbox.so.0.0.0
2ba5096d4000-2ba5096d6000 rw-p 2ba5096d4000 00:00 0
2ba5096d6000-2ba509901000 r-xp 00000000 03:08 101186 /usr/lib64/libostyle.so.0.0.1
2ba509901000-2ba509a00000 ---p 0022b000 03:08 101186 /usr/lib64/libostyle.so.0.0.1
2ba509a00000-2ba509a3d000 rw-p 0022a000 03:08 101186 /usr/lib64/libostyle.so.0.0.1
2ba509a3d000-2ba509a3f000 rw-p 2ba509a3d000 00:00 0
2ba509a3f000-2ba509abb000 r-xp 00000000 03:08 101054 /usr/lib64/libospgrove.so.0.0.1
2ba509abb000-2ba509bbb000 ---p 0007c000 03:08 101054 /usr/lib64/libospgrove.so.0.0.1
2ba509bbb000-2ba509bd1000 rw-p 0007c000 03:08 101054 /usr/lib64/libospgrove.so.0.0.1
2ba509bd1000-2ba509be1000 r-xp 00000000 03:08 101196 /usr/lib64/libogrove.so.0.0.1
2ba509be1000-2ba509ce1000 ---p 00010000 03:08 101196 /usr/lib64/libogrove.so.0.0.1
2ba509ce1000-2ba509ce3000 rw-p 00010000 03:08 101196 /usr/lib64/libogrove.so.0.0.1
2ba509ce3000-2ba509ce4000 rw-p 2ba509ce3000 00:00 0
2ba509ce4000-2ba509ed7000 r-xp 00000000 03:08 2725562 /usr/lib64/libosp.so.5.0.0
2ba509ed7000-2ba509fd7000 ---p 001f3000 03:08 2725562 /usr/lib64/libosp.so.5.0.0
2ba509fd7000-2ba509feb000 rw-p 001f3000 03:08 2725562 /usr/lib64/libosp.so.5.0.0
2ba509feb000-2ba509ff9000 rw-p 2ba509feb000 00:00 0
2ba509ff9000-2ba509ffa000 r--p 00000000 03:08 2056871 /usr/lib64/locale/fr_FR.utf8/LC_IDENTIFICATION
2ba509ffa000-2ba50a001000 r--s 00000000 03:08 1945716 /usr/lib64/gconv/gconv-modules.cache
2ba50a001000-2ba50a002000 r--p 00000000 03:08 2056870 /usr/lib64/locale/fr_FR.utf8/LC_MEASUREMENT
2ba50a002000-2ba50a003000 r--p 00000000 03:08 2056869 /usr/lib64/locale/fr_FR.utf8/LC_TELEPHONE
2ba50a003000-2ba50a004000 r--p 00000000 03:08 2056868 /usr/lib64/locale/fr_FR.utf8/LC_ADDRESS
2ba50a004000-2ba50a005000 r--p 00000000 03:08 2056867 /usr/lib64/locale/fr_FR.utf8/LC_NAME
2ba50a005000-2ba50a006000 r--p 00000000 03:08 2056866 /usr/lib64/locale/fr_FR.utf8/LC_PAPER
2ba50a006000-2ba50a007000 r--p 00000000 03:08 2056865 /usr/lib64/locale/fr_FR.utf8/LC_MESSAGES/SYS_LC_MESSAGES
2ba50a007000-2ba50a008000 r--p 00000000 03:08 2056860 /usr/lib64/locale/fr_FR.utf8/LC_MONETARY
2ba50a017000-2ba50a028000 r-xp 00000000 03:08 510618 /lib64/libpthread-2.4.so
2ba50a028000-2ba50a127000 ---p 00011000 03:08 510618 /lib64/libpthread-2.4.so
2ba50a127000-2ba50a128000 r--p 00010000 03:08 510618 /lib64/libpthread-2.4.so
2ba50a128000-2ba50a129000 rw-p 00011000 03:08 510618 /lib64/libpthread-2.4.so
2ba50a129000-2ba50a12d000 rw-p 2ba50a129000 00:00 0
2ba50a12d000-2ba50a13f000 r-xp 00000000 03:08 510631 /lib64/libnsl-2.4.so
2ba50a13f000-2ba50a23f000 ---p 00012000 03:08 510631 /lib64/libnsl-2.4.so
2ba50a23f000-2ba50a241000 rw-p 00012000 03:08 510631 /lib64/libnsl-2.4.so
2ba50a241000-2ba50a244000 rw-p 2ba50a241000 00:00 0
2ba50a244000-2ba50a31a000 r-xp 00000000 03:08 2552927 /usr/lib64/gcc/x86_64-pc-linux-gnu/3.4.6/libstdc++.so.6.0.3
2ba50a31a000-2ba50a419000 ---p 000d6000 03:08 2552927 /usr/lib64/gcc/x86_64-pc-linux-gnu/3.4.6/libstdc++.so.6.0.3
2ba50a419000-2ba50a422000 rw-p 000d5000 03:08 2552927 /usr/lib64/gcc/x86_64-pc-linux-gnu/3.4.6/libstdc++.so.6.0.3
2ba50a422000-2ba50a434000 rw-p 2ba50a422000 00:00 0
2ba50a434000-2ba50a48b000 r-xp 00000000 03:08 510614 /lib64/libm-2.4.so
2ba50a48b000-2ba50a58a000 ---p 00057000 03:08 510614 /lib64/libm-2.4.so
2ba50a58a000-2ba50a58c000 rw-p 00056000 03:08 510614 /lib64/libm-2.4.so
2ba50a58c000-2ba50a597000 r-xp 00000000 03:08 2578982 /lib64/libgcc_s.so.1
2ba50a597000-2ba50a696000 ---p 0000b000 03:08 2578982 /lib64/libgcc_s.so.1
2ba50a696000-2ba50a697000 rw-p 0000a000 03:08 2578982 /lib64/libgcc_s.so.1
2ba50a697000-2ba50a698000 rw-p 2ba50a697000 00:00 0
2ba50a698000-2ba50a7ba000 r-xp 00000000 03:08 510637 /lib64/libc-2.4.so
2ba50a7ba000-2ba50a8ba000 ---p 00122000 03:08 510637 /lib64/libc-2.4.so
2ba50a8ba000-2ba50a8bd000 r--p 00122000 03:08 510637 /lib64/libc-2.4.so
2ba50a8bd000-2ba50a8bf000 rw-p 00125000 03:08 510637 /lib64/libc-2.4.so
2ba50a8bf000-2ba50a8c4000 rw-p 2ba50a8bf000 00:00 0
2ba50a8c4000-2ba50a8c6000 r-xp 00000000 03:08 510615 /lib64/libdl-2.4.so
2ba50a8c6000-2ba50a9c6000 ---p 00002000 03:08 510615 /lib64/libdl-2.4.so
2ba50a9c6000-2ba50a9c8000 rw-p 00002000 03:08 510615 /lib64/libdl-2.4.so
2ba50a9c8000-2ba50a9ca000 rw-p 2ba50a9c8000 00:00 0
2ba50a9ca000-2ba50aaa1000 r--p 00000000 03:08 2028531 /usr/lib64/locale/fr_FR.utf8/LC_COLLATE
2ba50aaa1000-2ba50aaa2000 r--p 00000000 03:08 2056859 /usr/lib64/locale/fr_FR.utf8/LC_TIME
2ba50aaa2000-2ba50aaa3000 r--p 00000000 03:08 2056858 /usr/lib64/locale/fr_FR.utf8/LC_NUMERIC
2ba50aaa3000-2ba50aade000 r--p 00000000 03:08 2056848 /usr/lib64/locale/fr_FR.utf8/LC_CTYPE
7fffa15e1000-7fffa15f8000 rw-p 7fffa15e1000 00:00 0 [stack]
ffffffffff600000-ffffffffffe00000 ---p 00000000 00:00 0 [vdso]
/usr/bin/gtkdoc-mkhtml: line 46: 12355 Abandon /usr/bin/openjade -t sgml-raw -w no-idref -d $gtkdocdir/gtk-doc.dsl -V "gtkdoc-bookname=$module" -V "gtkdoc-version=1.6" $gtkdocdir/gtk-doc.dcl $document
make[4]: *** [html] Erreur 134
make[4]: quittant le répertoire « /var/tmp/portage/libgphoto2-2.2.1-r1/work/libgphoto2-2.2.1/libgphoto2_port/doc »
make[3]: *** [all-recursive] Erreur 1
make[3]: quittant le répertoire « /var/tmp/portage/libgphoto2-2.2.1-r1/work/libgphoto2-2.2.1/libgphoto2_port »
make[2]: *** [all] Erreur 2
make[2]: quittant le répertoire « /var/tmp/portage/libgphoto2-2.2.1-r1/work/libgphoto2-2.2.1/libgphoto2_port »
make[1]: *** [all-recursive] Erreur 1
make[1]: quittant le répertoire « /var/tmp/portage/libgphoto2-2.2.1-r1/work/libgphoto2-2.2.1 »
make: *** [all] Erreur 2
!!! ERROR: media-libs/libgphoto2-2.2.1-r1 failed.
Call stack:
ebuild.sh, line 1545: Called dyn_compile
ebuild.sh, line 940: Called src_compile
libgphoto2-2.2.1-r1.ebuild, line 102: Called die