collect2: ld returned 1 exit status
make[2]: *** [test-pager] Error 1
make[2]: *** Waiting for unfinished jobs....
/usr/lib/libgdk-x11-2.0.so: undefined reference to `cairo_xlib_surface_create_for_bitmap'
/usr/lib/libgdk-x11-2.0.so: undefined reference to `cairo_xlib_surface_set_size'
/usr/lib/libgdk-x11-2.0.so: undefined reference to `cairo_xlib_surface_create'
collect2: ld returned 1 exit status
make[2]: *** [test-wnck] Error 1
i686-pc-linux-gnu-gcc -march=athlon-xp -O2 -pipe -fomit-frame-pointer -Wall -o .libs/wnckprop wnckprop.o ./.libs/libwnck-1.so /usr/lib/libgtk-x11-2.0.so /usr/lib/libgdk-x11-2.0.so /usr/lib/libatk-1.0.so /usr/lib/libgdk_pixbuf-2.0.so /usr/lib/libpangocairo-1.0.so /usr/lib/libpangoft2-1.0.so /usr/lib/libpango-1.0.so /usr/lib/libcairo.so /usr/lib/libfontconfig.so /usr/lib/libfreetype.so /usr/lib/libexpat.so /usr/lib/libpng12.so -lz -lm /usr/lib/libgobject-2.0.so /usr/lib/libgmodule-2.0.so /usr/lib/libglib-2.0.so /usr/lib/libstartup-notification-1.so /usr/lib/libSM.so /usr/lib/libICE.so /usr/lib/libXRes.so /usr/lib/libXext.so /usr/lib/libX11.so /usr/lib/libXau.so /usr/lib/libXdmcp.so -ldl
/usr/lib/libgdk-x11-2.0.so: undefined reference to `cairo_xlib_surface_create_for_bitmap'
/usr/lib/libgdk-x11-2.0.so: undefined reference to `cairo_xlib_surface_set_size'
/usr/lib/libgdk-x11-2.0.so: undefined reference to `cairo_xlib_surface_create'
collect2: ld returned 1 exit status
make[2]: *** [wnckprop] Error 1
make[2]: Leaving directory `/var/tmp/portage/x11-libs/libwnck-2.20.3/work/libwnck-2.20.3/libwnck'
make[1]: *** [all-recursive] Error 1
make[1]: Leaving directory `/var/tmp/portage/x11-libs/libwnck-2.20.3/work/libwnck-2.20.3'
make: *** [all] Error 2
*
* ERROR: x11-libs/libwnck-2.20.3 failed.
* Call stack:
* ebuild.sh, line 49: Called src_compile
* environment, line 612: Called gnome2_src_compile
* environment, line 546: Called die
* The specific snippet of code:
* emake || die "compile failure"
* The die message:
* compile failure
*
* If you need support, post the topmost build error, and the call stack if relevant.
* A complete build log is located at '/var/tmp/portage/x11-libs/libwnck-2.20.3/temp/build.log'.
* The ebuild environment file is located at '/var/tmp/portage/x11-libs/libwnck-2.20.3/temp/environment'.
*
* Messages for package x11-libs/libwnck-2.20.3:
*
* ERROR: x11-libs/libwnck-2.20.3 failed.
* Call stack:
* ebuild.sh, line 49: Called src_compile
* environment, line 612: Called gnome2_src_compile
* environment, line 546: Called die
* The specific snippet of code:
* emake || die "compile failure"
* The die message:
* compile failure
*
* If you need support, post the topmost build error, and the call stack if relevant.
* A complete build log is located at '/var/tmp/portage/x11-libs/libwnck-2.20.3/temp/build.log'.
* The ebuild environment file is located at '/var/tmp/portage/x11-libs/libwnck-2.20.3/temp/environment'.
*