In file included from KWinInterface_skel.cpp:9:
KWinInterface.h:6:24: error: dcopobject.h: No such file or directory
KWinInterface_skel.cpp:11:25: error: kdatastream.h: No such file or directory
KWinInterface.h:9: error: expected class-name before '{' token
KWinInterface.h:10: error: 'K_DCOP' does not name a type
KWinInterface_skel.cpp:22: error: expected ',' or '...' before '&' token
KWinInterface_skel.cpp:22: error: ISO C++ forbids declaration of 'QCString' with no type
KWinInterface_skel.cpp:22: error: no 'bool KWinInterface::process(int)' member function declared in class 'KWinInterface'
KWinInterface_skel.cpp: In member function 'bool KWinInterface::process(int)':
KWinInterface_skel.cpp:24: error: 'fun' was not declared in this scope
KWinInterface_skel.cpp:25: error: 'replyType' was not declared in this scope
KWinInterface_skel.cpp:26: error: 'reconfigure' was not declared in this scope
KWinInterface_skel.cpp:28: error: 'DCOPObject' has not been declared
KWinInterface_skel.cpp:28: error: 'data' was not declared in this scope
KWinInterface_skel.cpp:28: error: 'replyType' was not declared in this scope
KWinInterface_skel.cpp:28: error: 'replyData' was not declared in this scope
KWinInterface_skel.cpp: At global scope:
KWinInterface_skel.cpp:33: error: 'QCStringList' does not name a type
KWinInterface_skel.cpp:40: error: 'QCStringList' does not name a type
make[3]: *** [KWinInterface_skel.o] Error 1
make[3]: *** Waiting for unfinished jobs....
decorator.h:35:21: error: fixx11h.h: No such file or directory
decorator.h:36:21: error: kconfig.h: No such file or directory
decorator.h:37:35: error: kdecoration_plugins_p.h: No such file or directory
decorator.h:38:27: error: kdecoration_p.h: No such file or directory
decorator.h:39:19: error: netwm.h: No such file or directory
In file included from window.h:37,
from decorator.h:46,
from decorator.moc.cpp:11:
options.h:27:25: error: kdecoration.h: No such file or directory
In file included from decorator.h:47,
from decorator.moc.cpp:11:
KWinInterface.h:6:24: error: dcopobject.h: No such file or directory
In file included from window.h:36,
from window.moc.cpp:11:
utils.h:28:21: error: fixx11h.h: No such file or directory
In file included from window.h:37,
from window.moc.cpp:11:
options.h:27:25: error: kdecoration.h: No such file or directory
/usr/qt/3/include/qnamespace.h:750: error: expected identifier before numeric constant
/usr/qt/3/include/qnamespace.h:750: error: expected unqualified-id before numeric constant
/usr/qt/3/include/qevent.h:61: error: expected identifier before numeric constant
/usr/qt/3/include/qevent.h:61: error: expected `}' before numeric constant
/usr/qt/3/include/qevent.h:61: error: expected unqualified-id before numericconstant
/usr/qt/3/include/qevent.h:142: error: expected `)' before 'type'
/usr/qt/3/include/qevent.h:143: error: declaration of '~QEvent' as non-member
/usr/qt/3/include/qevent.h:144: error: 'Type' does not name a type
/usr/qt/3/include/qevent.h:145: error: non-member function 'bool spontaneous()' cannot have cv-qualifier
/usr/qt/3/include/qevent.h: In function 'bool spontaneous()':
/usr/qt/3/include/qevent.h:145: error: 'spont' was not declared in this scope
/usr/qt/3/include/qevent.h: At global scope:
/usr/qt/3/include/qevent.h:146: error: expected unqualified-id before 'protected'
/usr/qt/3/include/qevent.h:148: error: expected unqualified-id before 'private'
/usr/qt/3/include/qevent.h:150: error: invalid function declaration
/usr/qt/3/include/qevent.h:153: error: 'friend' can only be specified insidea class
/usr/qt/3/include/qevent.h:154: error: 'friend' can only be specified insidea class
/usr/qt/3/include/qevent.h:155: error: 'friend' can only be specified insidea class
/usr/qt/3/include/qevent.h:156: error: 'friend' can only be specified insidea class
/usr/qt/3/include/qevent.h:157: error: expected declaration before '}' token
make[3]: *** [decorator.moc.o] Error 1
options.h:35: error: expected class-name before '{' token
options.h:83: error: 'WindowOperation' does not name a type
options.h:119: error: 'KDecorationDefines' has not been declared
options.h:119: error: ISO C++ forbids declaration of 'WindowOperation' with no type
options.h:120: error: expected ';' before 'windowOperation'
options.h:126: error: 'KDecorationDefines' has not been declared
options.h:126: error: ISO C++ forbids declaration of 'WindowOperation' with no type
options.h:126: error: expected ';' before 'OpTitlebarDblClick'
options.h:35: warning: 'class KWD::Options' has virtual functions but non-virtual destructor
window.h:45: error: expected class-name before '{' token
window.h:64: error: 'MaximizeMode' does not name a type
window.h:76: error: 'NET' has not been declared
window.h:76: error: ISO C++ forbids declaration of 'WindowType' with no type
window.h:76: error: 'WindowType' declared as a 'virtual' field
window.h:77: error: expected ';' before 'windowType'
window.h:78: error: 'QIconSet' does not name a type
window.h:83: error: 'WindowOperation' has not been declared
window.h:92: error: 'MaximizeMode' has not been declared
window.h:189: error: 'NET' has not been declared
window.h:189: error: ISO C++ forbids declaration of 'Direction' with no type
window.h:189: error: expected ';' before 'positionToDirection'
window.h:207: error: 'QIconSet' does not name a type
window.moc.cpp: In member function 'virtual void* KWD::Window::qt_cast(constchar*)':
window.moc.cpp:89: error: 'KDecorationBridge' was not declared in this scope
window.moc.cpp:89: error: expected primary-expression before ')' token
window.moc.cpp:89: error: expected ';' before 'this'
window.moc.cpp:89: warning: statement has no effect
make[3]: *** [window.moc.o] Error 1
make[3]: Leaving directory `/var/tmp/portage/x11-wm/compiz-0.6.2-r1/work/compiz-0.6.2/kde/window-decorator'
make[2]: *** [all-recursive] Error 1
make[2]: Leaving directory `/var/tmp/portage/x11-wm/compiz-0.6.2-r1/work/compiz-0.6.2/kde'
make[1]: *** [all-recursive] Error 1
make[1]: Leaving directory `/var/tmp/portage/x11-wm/compiz-0.6.2-r1/work/compiz-0.6.2'
make: *** [all] Error 2
*
* ERROR: x11-wm/compiz-0.6.2-r1 failed.
* Call stack:
* ebuild.sh, line 49: Called src_compile
* environment, line 2592: Called die
* The specific snippet of code:
* emake || die
* The die message:
* (no error message)
*
* If you need support, post the topmost build error, and the call stack if relevant.
* A complete build log is located at '/var/tmp/portage/x11-wm/compiz-0.6.2-r1/temp/build.log'.
* The ebuild environment file is located at '/var/tmp/portage/x11-wm/compiz-0.6.2-r1/temp/environment'.
*
* Messages for package x11-wm/compiz-0.6.2-r1:
*
* ERROR: x11-wm/compiz-0.6.2-r1 failed.
* Call stack:
* ebuild.sh, line 49: Called src_compile
* environment, line 2592: Called die
* The specific snippet of code:
* emake || die
* The die message:
* (no error message)
*
* If you need support, post the topmost build error, and the call stack if relevant.
* A complete build log is located at '/var/tmp/portage/x11-wm/compiz-0.6.2-r1/temp/build.log'.
* The ebuild environment file is located at '/var/tmp/portage/x11-wm/compiz-0.6.2-r1/temp/environment'.
*