makeobj[0]: Entering directory `/home/harry/kde/build/KDE/kdebase/workspace/plasma'
cd /home/harry/kde/build/KDE/kdebase && /usr/bin/cmake -H/home/harry/kde/src/KDE/kdebase -B/home/harry/kde/build/KDE/kdebase --check-build-system CMakeFiles/Makefile.cmake 0
-- Found Qt-Version 4.4.0-rc1 (using /home/harry/qt-copy/bin/qmake)
-- Found X11: /usr/lib/libX11.so
-- Found KDE 4.1 include dir: /home/harry/kde/include
-- Found KDE 4.1 library dir: /home/harry/kde/lib
-- Found KDE4 kconfig_compiler preprocessor: /home/harry/kde/bin/kconfig_compiler
-- Found KDE4 automoc: /home/harry/kde/bin/kde4automoc
-- Found Strigi: /usr/lib/libstreams.so
-- Found Strigi: /usr/lib/libstreams.so
-- Found KDE PIM libraries
-- Soprano version 2.0.97 is too old. Please install 2.0.98 or newer
-- Found Nepomuk: /home/harry/kde/lib/libnepomuk.so
-- Create macro to display info at the end of install
-- Found Strigi: /usr/lib/libstreams.so
-- Found Soprano: /home/harry/kde/lib/libsoprano.so
-- Found Soprano includes: /home/harry/kde/include
-- Found Soprano Index: SOPRANO_INDEX_LIBRARIES-NOTFOUND
-- Found Soprano Client: /home/harry/kde/lib/libsopranoclient.so
-- Found Nepomuk: /home/harry/kde/lib/libnepomuk.so
-- Found Soprano: /home/harry/kde/lib/libsoprano.so
-- Found Soprano includes: /home/harry/kde/include
-- Found Soprano Index: SOPRANO_INDEX_LIBRARIES-NOTFOUND
-- Found Soprano Client: /home/harry/kde/lib/libsopranoclient.so
-- cmake package FindWebKitKde.cmake was not found. This package needs webkitkde to be compile all program
-- Could not find OPTIONAL package PCIUTILS
-- Could not find OPTIONAL package RAW1394
-- Found Strigi: /usr/lib/libstreams.so
-- Adding support for OpenGL applets to libplasma
-- Found BlueZ: /usr/lib/libbluetooth.so
-- Found PNG: /usr/lib/libpng.so
-- Found Sensors: /usr/include
-- Found Freetype: -lfreetype -lz
-- option: USE_XKLAVIER <ON>
-- Found LibXKlavier: -I/usr/include/glib-2.0 -I/usr/lib/glib-2.0/include -I/usr/include/libxml2
-- Found GLIB2: /usr/lib/libglib-2.0.so
-- Found GObject libraries: /usr/lib/libgobject-2.0.so;/usr/lib/libgmodule-2.0.so;/usr/lib/libgthread-2.0.so;/usr/lib/libglib-2.0.so
-- Found GObject includes : /usr/include/glib-2.0/gobject
-- /home/harry/kde/src/KDE/kdebase/workspace/kcontrol: skipped subdir $(KSMCARD_SUBDIR)
--
-----------------------------------------------------------------------------
-- The following external packages were located on your system.
-- This installation will have the extra features provided by these packages.
+ Nepomuk
+ Xine
+ XCB
+ OpenGL
+ XKB
+ BlueZ
+ NetworkManager 0.6.5
+ lm-sensors
+ Compositing support
+ Captury framework
+ libusb
+ libxft
-----------------------------------------------------------------------------
-- The following OPTIONAL packages could NOT be located on your system.
-- Consider installing them to enable more features from this software.
+ Soprano: Soprano Libraries <kdesupport>
Required to build Nepomuk.
+ Xine: xine-lib v1.1.7 was found on your system. This version is known to have problems when playing short sounds. Consider upgrading to version 1.1.9 or above. <http://sourceforge.net/project/showfiles.php?group_id=9655&package_id=9732>
+ PCIUTILS: PciUtils is a library for direct access to PCI slots <http://atrey.karlin.mff.cuni.cz/~mj/pciutils.shtml>
View PCI details in kinfocenter.
+ RAW1394: library for direct access to IEEE 1394 bus <http://www.linux1394.org/>
View FireWire devices in kinfocenter.
-----------------------------------------------------------------------------
-- Configuring done
-- Generating done
-- Build files have been written to: /home/harry/kde/build/KDE/kdebase
cd /home/harry/kde/build/KDE/kdebase && /usr/bin/cmake -E cmake_progress_start /home/harry/kde/build/KDE/kdebase/CMakeFiles 11
cd /home/harry/kde/build/KDE/kdebase && /usr/bin/make -f CMakeFiles/Makefile2 workspace/plasma/all
make[1]: Entering directory `/home/harry/kde/build/KDE/kdebase'
/usr/bin/make -f workspace/libs/plasma/CMakeFiles/plasma.dir/build.make workspace/libs/plasma/CMakeFiles/plasma.dir/depend
/usr/bin/make -f workspace/libs/kworkspace/CMakeFiles/kworkspace.dir/build.make workspace/libs/kworkspace/CMakeFiles/kworkspace.dir/depend
/usr/bin/make -f workspace/libs/taskmanager/CMakeFiles/taskmanager.dir/build.make workspace/libs/taskmanager/CMakeFiles/taskmanager.dir/depend
make[2]: Entering directory `/home/harry/kde/build/KDE/kdebase'
make[2]: Nothing to be done for `workspace/libs/kworkspace/CMakeFiles/kworkspace.dir/depend'.
make[2]: Leaving directory `/home/harry/kde/build/KDE/kdebase'
/usr/bin/make -f workspace/libs/kworkspace/CMakeFiles/kworkspace.dir/build.make workspace/libs/kworkspace/CMakeFiles/kworkspace.dir/build
make[2]: Entering directory `/home/harry/kde/build/KDE/kdebase'
make[2]: Nothing to be done for `workspace/libs/taskmanager/CMakeFiles/taskmanager.dir/depend'.
make[2]: Leaving directory `/home/harry/kde/build/KDE/kdebase'
/usr/bin/make -f workspace/libs/taskmanager/CMakeFiles/taskmanager.dir/build.make workspace/libs/taskmanager/CMakeFiles/taskmanager.dir/build
make[2]: Entering directory `/home/harry/kde/build/KDE/kdebase'
make[2]: Nothing to be done for `workspace/libs/taskmanager/CMakeFiles/taskmanager.dir/build'.
make[2]: Leaving directory `/home/harry/kde/build/KDE/kdebase'
/usr/bin/cmake -E cmake_progress_report /home/harry/kde/build/KDE/kdebase/CMakeFiles
[ 0%] make[2]: Entering directory `/home/harry/kde/build/KDE/kdebase'
make[2]: Nothing to be done for `workspace/libs/kworkspace/CMakeFiles/kworkspace.dir/build'.
make[2]: Leaving directory `/home/harry/kde/build/KDE/kdebase'
/usr/bin/cmake -E cmake_progress_report /home/harry/kde/build/KDE/kdebase/CMakeFiles
Built target taskmanager
[ 0%] Built target kworkspace
make[2]: Entering directory `/home/harry/kde/build/KDE/kdebase'
make[2]: Nothing to be done for `workspace/libs/plasma/CMakeFiles/plasma.dir/depend'.
make[2]: Leaving directory `/home/harry/kde/build/KDE/kdebase'
/usr/bin/make -f workspace/libs/plasma/CMakeFiles/plasma.dir/build.make workspace/libs/plasma/CMakeFiles/plasma.dir/build
make[2]: Entering directory `/home/harry/kde/build/KDE/kdebase'
Linking CXX shared library ../../../lib/libplasma.so
cd /home/harry/kde/build/KDE/kdebase/workspace/libs/plasma && /usr/bin/cmake -P CMakeFiles/plasma.dir/cmake_clean_target.cmake
cd /home/harry/kde/build/KDE/kdebase/workspace/libs/plasma && /usr/bin/cmake -E cmake_link_script CMakeFiles/plasma.dir/link.txt --verbose=1
/usr/lib/icecc/bin/c++ -fPIC -pipe -O2 -march=nocona -Wnon-virtual-dtor -Wno-long-long -ansi -Wundef -Wcast-align -Wchar-subscripts -Wall -W -Wpointer-arith -Wformat-security -fno-exceptions -fno-check-new -fno-common -Woverloaded-virtual -fvisibility=hidden -g3 -fno-inline -Wl,--enable-new-dtags -Wl,--fatal-warnings -Wl,--no-undefined -lc -shared -Wl,-soname,libplasma.so.1 -o ../../../lib/libplasma.so.1.0.0 "CMakeFiles/plasma.dir/plasma_automoc.o" "CMakeFiles/plasma.dir/packagemetadata.o" "CMakeFiles/plasma.dir/packagestructure.o" "CMakeFiles/plasma.dir/package.o" "CMakeFiles/plasma.dir/abstractrunner.o" "CMakeFiles/plasma.dir/animator.o" "CMakeFiles/plasma.dir/applet.o" "CMakeFiles/plasma.dir/appletbrowser.o" "CMakeFiles/plasma.dir/appletbrowser/customdragtreeview.o" "CMakeFiles/plasma.dir/appletbrowser/kcategorizeditemsview.o" "CMakeFiles/plasma.dir/appletbrowser/kcategorizeditemsviewdelegate.o" "CMakeFiles/plasma.dir/appletbrowser/kcategorizeditemsviewmodels.o" "CMakeFiles/plasma.dir/appletbrowser/openwidgetassistant.o" "CMakeFiles/plasma.dir/appletbrowser/plasmaappletitemmodel.o" "CMakeFiles/plasma.dir/applethandle.o" "CMakeFiles/plasma.dir/configxml.o" "CMakeFiles/plasma.dir/containment.o" "CMakeFiles/plasma.dir/corona.o" "CMakeFiles/plasma.dir/datacontainer.o" "CMakeFiles/plasma.dir/dataengine.o" "CMakeFiles/plasma.dir/dataenginemanager.o" "CMakeFiles/plasma.dir/dialog.o" "CMakeFiles/plasma.dir/packages.o" "CMakeFiles/plasma.dir/phase.o" "CMakeFiles/plasma.dir/plasma.o" "CMakeFiles/plasma.dir/searchmatch.o" "CMakeFiles/plasma.dir/searchcontext.o" "CMakeFiles/plasma.dir/shadowitem.o" "CMakeFiles/plasma.dir/svg.o" "CMakeFiles/plasma.dir/svgpanel.o" "CMakeFiles/plasma.dir/theme.o" "CMakeFiles/plasma.dir/toolbox.o" "CMakeFiles/plasma.dir/paneltoolbox.o" "CMakeFiles/plasma.dir/desktoptoolbox.o" "CMakeFiles/plasma.dir/uiloader.o" "CMakeFiles/plasma.dir/view.o" "CMakeFiles/plasma.dir/delegate.o" "CMakeFiles/plasma.dir/scripting/appletscript.o" "CMakeFiles/plasma.dir/scripting/dataenginescript.o" "CMakeFiles/plasma.dir/scripting/runnerscript.o" "CMakeFiles/plasma.dir/scripting/scriptengine.o" "CMakeFiles/plasma.dir/widgets/icon.o" "CMakeFiles/plasma.dir/widgets/webcontent.o" "CMakeFiles/plasma.dir/glapplet.o" -L/home/harry/qt-copy/lib -L/home/harry/kde/lib -lQtCore -lpthread-lkdecore -lkdeui -lz -lstreamanalyzer -lstreams -lQtCore -lpthread -lkdecore -lsolid -lfam -lXrender -lkio -lQtCore -lpthread -lkdecore -lkdeui -lkio -lz -lQtCore -lpthread -lkdecore -lsolid -lkfile -Wl,-Bstatic -lQtUiTools -Wl,-Bdynamic -lQtWebKit -lQtOpenGL -lGL -lkdeui -lQtSvg -lSM -lICE -lX11 -lXext -lXft -lXau -lXdmcp -lXcursor -lXfixes -lstreamanalyzer -lstreams -lfam -lXrender -lQtNetwork-lbz2 -lresolv -lQtDBus -lQtXml -lQtGui -Wl,-rpath,/home/harry/qt-copy/lib:/home/harry/kde/lib
CMakeFiles/plasma.dir/applet.o:(.data.rel.ro._ZTVN6Plasma6AppletE[vtable for Plasma::Applet]+0x7c): undefined reference to `Plasma::Applet::focusInEvent(QFocusEvent*)'
CMakeFiles/plasma.dir/applet.o:(.data.rel.ro._ZTVN6Plasma6AppletE[vtable for Plasma::Applet]+0x134): undefined reference to `non-virtual thunk to Plasma::Applet::focusInEvent(QFocusEvent*)'
CMakeFiles/plasma.dir/containment.o:(.data.rel.ro._ZTVN6Plasma11ContainmentE[vtable for Plasma::Containment]+0x7c): undefined reference to `Plasma::Applet::focusInEvent(QFocusEvent*)'
CMakeFiles/plasma.dir/containment.o:(.data.rel.ro._ZTVN6Plasma11ContainmentE[vtable for Plasma::Containment]+0x148): undefined reference to `non-virtual thunk to Plasma::Applet::focusInEvent(QFocusEvent*)'
CMakeFiles/plasma.dir/glapplet.o:(.data.rel.ro._ZTVN6Plasma8GLAppletE[vtable for Plasma::GLApplet]+0x7c): undefined reference to `Plasma::Applet::focusInEvent(QFocusEvent*)'
CMakeFiles/plasma.dir/glapplet.o:(.data.rel.ro._ZTVN6Plasma8GLAppletE[vtable for Plasma::GLApplet]+0x138): undefined reference to `non-virtual thunk to Plasma::Applet::focusInEvent(QFocusEvent*)'
collect2: ld returned 1 exit status
make[2]: *** [lib/libplasma.so.1.0.0] Error 1
make[2]: Leaving directory `/home/harry/kde/build/KDE/kdebase'
make[1]: *** [workspace/libs/plasma/CMakeFiles/plasma.dir/all] Error 2
make[1]: Leaving directory `/home/harry/kde/build/KDE/kdebase'
make: *** [all] Error 2
makeobj[0]: Leaving directory `/home/harry/kde/build/KDE/kdebase/workspace/plasma'