make[5]: Leaving directory `/opt/wow-development/5629/trunk/src/bindings/ScriptDev2/sql'
make[5]: Entering directory `/opt/wow-development/5629/trunk/src/bindings/ScriptDev2'
/bin/sh ../../../libtool --tag=CXX --mode=compile g++ -DHAVE_CONFIG_H -I. -I../../.. -I/usr/include/mysql -I. -I./../../../dep/include -I./../../shared/ -I./../../framework/ -g -DMANGOS_DEBUG -DDO_MYSQL -O0 -MT ScriptMgr.lo -MD -MP -MF .deps/ScriptMgr.Tpo -c -o ScriptMgr.lo ScriptMgr.cpp
g++ -DHAVE_CONFIG_H -I. -I../../.. -I/usr/include/mysql -I. -I./../../../dep/include -I./../../shared/ -I./../../framework/ -g -DMANGOS_DEBUG -DDO_MYSQL -O0 -MT ScriptMgr.lo -MD -MP -MF .deps/ScriptMgr.Tpo -c ScriptMgr.cpp -fPIC -DPIC -o .libs/ScriptMgr.o
ScriptMgr.cpp:7:23: error: GossipDef.h: No such file or directory
ScriptMgr.cpp:8:20: error: Player.h: No such file or directory
ScriptMgr.cpp:9:24: error: GameObject.h: No such file or directory
ScriptMgr.cpp:10:17: error: Map.h: No such file or directory
In file included from scripts/creature/mob_event_ai.h:17,
from ScriptMgr.cpp:17:
scripts/creature/../../include/sc_creature.h:5:24: error: CreatureAI.h: No such file or directory
scripts/creature/../../include/sc_creature.h:6:22: error: Creature.h: No such file or directory
./../../shared/Database/Database.h:54: error: ISO C++ forbids declaration of 'QueryResult' with no type
./../../shared/Database/Database.h:54: error: 'QueryResult' declared as a 'virtual' field
./../../shared/Database/Database.h:54: error: expected ';' before '*' token
./../../shared/Database/Database.h:55: error: ISO C++ forbids declaration of 'QueryResult' with no type
./../../shared/Database/Database.h:55: error: expected ';' before '*' token
./../../shared/Database/Database.h:59: error: expected ',' or '...' before '(' token
./../../shared/Database/Database.h:59: error: cannot declare pointer to 'void' member
./../../shared/Database/Database.h:61: error: expected ',' or '...' before '(' token
./../../shared/Database/Database.h:61: error: cannot declare pointer to 'void' member
./../../shared/Database/Database.h:63: error: expected ',' or '...' before '(' token
./../../shared/Database/Database.h:63: error: cannot declare pointer to 'void' member
./../../shared/Database/Database.h:65: error: expected ',' or '...' before '(' token
./../../shared/Database/Database.h:65: error: cannot declare pointer to 'void' member
./../../shared/Database/Database.h:67: error: expected ',' or '...' before '(' token
./../../shared/Database/Database.h:67: error: cannot declare pointer to 'void' member
./../../shared/Database/Database.h:69: error: expected ',' or '...' before '(' token
./../../shared/Database/Database.h:69: error: cannot declare pointer to 'void' member
./../../shared/Database/DatabaseMysql.h:49: error: ISO C++ forbids declaration of 'QueryResult' with no type
./../../shared/Database/DatabaseMysql.h:49: error: expected ';' before '*' token
scripts/creature/../../include/sc_creature.h:43: error: invalid use of undefined type 'struct CreatureAI'
ScriptMgr.h:23: error: forward declaration of 'struct CreatureAI'
scripts/creature/../../include/sc_creature.h:52: error: 'Unit' has not been declared
scripts/creature/../../include/sc_creature.h:55: error: 'Unit' has not been declared
scripts/creature/../../include/sc_creature.h:61: error: 'Unit' has not been declared
scripts/creature/../../include/sc_creature.h:64: error: 'Unit' has not been declared
scripts/creature/../../include/sc_creature.h:67: error: 'Unit' has not been declared
scripts/creature/../../include/sc_creature.h:70: error: 'Unit' has not been declared
scripts/creature/../../include/sc_creature.h:76: error: 'Unit' has not been declared
scripts/creature/../../include/sc_creature.h:79: error: 'Unit' has not been declared
scripts/creature/../../include/sc_creature.h:101: error: 'Unit' has not been declared
scripts/creature/../../include/sc_creature.h:108: error: 'Unit' has not been declared
scripts/creature/../../include/sc_creature.h:117: error: 'Unit' has not been declared
scripts/creature/../../include/sc_creature.h:120: error: 'Unit' has not been declared
scripts/creature/../../include/sc_creature.h:123: error: 'Unit' has not been declared
scripts/creature/../../include/sc_creature.h:126: error: 'Unit' has not been declared
scripts/creature/../../include/sc_creature.h:129: error: 'Unit' has not been declared
scripts/creature/../../include/sc_creature.h:135: error: 'Unit' has not been declared
scripts/creature/../../include/sc_creature.h:138: error: 'Unit' has not been declared
scripts/creature/../../include/sc_creature.h:144: error: 'Unit' has not been declared
scripts/creature/../../include/sc_creature.h:150: error: ISO C++ forbids declaration of 'Unit' with no type
scripts/creature/../../include/sc_creature.h:150: error: expected ';' before '*' token
scripts/creature/../../include/sc_creature.h:153: error: expected ';' before '(' token
scripts/creature/../../include/sc_creature.h:156: error: 'Unit' has not been declared
ScriptMgr.cpp: In function 'void LoadDatabase()':
ScriptMgr.cpp:590: error: 'error_log' was not declared in this scope
ScriptMgr.cpp:594: error: 'error_log' was not declared in this scope
ScriptMgr.cpp:598: error: 'QueryResult' was not declared in this scope
ScriptMgr.cpp:598: error: 'result' was not declared in this scope
ScriptMgr.cpp:601: error: 'class DatabaseMysql' has no member named 'PQuery'
ScriptMgr.cpp:606: error: 'Field' was not declared in this scope
ScriptMgr.cpp:606: error: 'fields' was not declared in this scope
ScriptMgr.cpp:607: error: 'outstring_log' was not declared in this scope
ScriptMgr.cpp:610: error: type '<type error>' argument given to 'delete', expected pointer
ScriptMgr.cpp:612: error: 'error_log' was not declared in this scope
ScriptMgr.cpp:618: error: 'class DatabaseMysql' has no member named 'PQuery'
ScriptMgr.cpp:623: error: 'outstring_log' was not declared in this scope
ScriptMgr.cpp:631: error: 'Field' was not declared in this scope
ScriptMgr.cpp:631: error: 'fields' was not declared in this scope
ScriptMgr.cpp:645: error: 'error_log' was not declared in this scope
ScriptMgr.cpp:652: error: type '<type error>' argument given to 'delete', expected pointer
ScriptMgr.cpp:657: error: 'outstring_log' was not declared in this scope
ScriptMgr.cpp:660: error: 'class DatabaseMysql' has no member named 'PQuery'
ScriptMgr.cpp:668: error: 'outstring_log' was not declared in this scope
ScriptMgr.cpp:675: error: 'Field' was not declared in this scope
ScriptMgr.cpp:675: error: 'fields' was not declared in this scope
ScriptMgr.cpp:692: error: type '<type error>' argument given to 'delete', expected pointer
ScriptMgr.cpp:696: error: 'outstring_log' was not declared in this scope
ScriptMgr.cpp:699: error: 'class DatabaseMysql' has no member named 'PQuery'
ScriptMgr.cpp:707: error: 'outstring_log' was not declared in this scope
ScriptMgr.cpp:714: error: 'Field' was not declared in this scope
ScriptMgr.cpp:714: error: 'fields' was not declared in this scope
ScriptMgr.cpp:729: error: 'error_log' was not declared in this scope
ScriptMgr.cpp:733: error: 'error_log' was not declared in this scope
ScriptMgr.cpp:752: error: 'error_log' was not declared in this scope
ScriptMgr.cpp:765: error: 'error_log' was not declared in this scope
ScriptMgr.cpp:777: error: 'error_log' was not declared in this scope
ScriptMgr.cpp:783: error: 'error_log' was not declared in this scope
ScriptMgr.cpp:789: error: 'error_log' was not declared in this scope
ScriptMgr.cpp:796: error: 'error_log' was not declared in this scope
ScriptMgr.cpp:803: error: 'error_log' was not declared in this scope
ScriptMgr.cpp:813: error: 'error_log' was not declared in this scope
ScriptMgr.cpp:818: error: 'error_log' was not declared in this scope
ScriptMgr.cpp:830: error: 'error_log' was not declared in this scope
ScriptMgr.cpp:839: error: type '<type error>' argument given to 'delete', expected pointer
ScriptMgr.cpp:843: error: 'outstring_log' was not declared in this scope
ScriptMgr.cpp: In function 'void ScriptsInit()':
ScriptMgr.cpp:875: error: 'outstring_log' was not declared in this scope
ScriptMgr.cpp:881: error: 'error_log' was not declared in this scope
ScriptMgr.cpp:887: error: 'error_log' was not declared in this scope
ScriptMgr.cpp:895: error: 'error_log' was not declared in this scope
ScriptMgr.cpp: In function 'const char* GetLocalizedText(uint32)':
ScriptMgr.cpp:1455: error: 'error_log' was not declared in this scope
ScriptMgr.cpp:1463: error: 'error_log' was not declared in this scope
ScriptMgr.cpp: In function 'bool GossipHello(Player*, Creature*)':
ScriptMgr.cpp:1529: error: invalid use of undefined type 'struct Creature'
ScriptMgr.h:22: error: forward declaration of 'struct Creature'
ScriptMgr.cpp:1532: error: invalid use of undefined type 'struct Player'
ScriptMgr.h:21: error: forward declaration of 'struct Player'
ScriptMgr.cpp: In function 'bool GossipSelect(Player*, Creature*, uint32, uint32)':
ScriptMgr.cpp:1541: error: 'debug_log' was not declared in this scope
ScriptMgr.cpp:1543: error: invalid use of undefined type 'struct Creature'
ScriptMgr.h:22: error: forward declaration of 'struct Creature'
ScriptMgr.cpp:1546: error: invalid use of undefined type 'struct Player'
ScriptMgr.h:21: error: forward declaration of 'struct Player'
ScriptMgr.cpp: In function 'bool GossipSelectWithCode(Player*, Creature*, uint32, uint32, const char*)':
ScriptMgr.cpp:1555: error: 'debug_log' was not declared in this scope
ScriptMgr.cpp:1557: error: invalid use of undefined type 'struct Creature'
ScriptMgr.h:22: error: forward declaration of 'struct Creature'
ScriptMgr.cpp:1560: error: invalid use of undefined type 'struct Player'
ScriptMgr.h:21: error: forward declaration of 'struct Player'
ScriptMgr.cpp: In function 'bool QuestAccept(Player*, Creature*, const Quest*)':
ScriptMgr.cpp:1569: error: invalid use of undefined type 'struct Creature'
ScriptMgr.h:22: error: forward declaration of 'struct Creature'
ScriptMgr.cpp:1572: error: invalid use of undefined type 'struct Player'
ScriptMgr.h:21: error: forward declaration of 'struct Player'
ScriptMgr.cpp: In function 'bool QuestSelect(Player*, Creature*, const Quest*)':
ScriptMgr.cpp:1581: error: invalid use of undefined type 'struct Creature'
ScriptMgr.h:22: error: forward declaration of 'struct Creature'
ScriptMgr.cpp:1584: error: invalid use of undefined type 'struct Player'
ScriptMgr.h:21: error: forward declaration of 'struct Player'
ScriptMgr.cpp: In function 'bool QuestComplete(Player*, Creature*, const Quest*)':
ScriptMgr.cpp:1593: error: invalid use of undefined type 'struct Creature'
ScriptMgr.h:22: error: forward declaration of 'struct Creature'
ScriptMgr.cpp:1596: error: invalid use of undefined type 'struct Player'
ScriptMgr.h:21: error: forward declaration of 'struct Player'
ScriptMgr.cpp: In function 'bool ChooseReward(Player*, Creature*, const Quest*, uint32)':
ScriptMgr.cpp:1605: error: invalid use of undefined type 'struct Creature'
ScriptMgr.h:22: error: forward declaration of 'struct Creature'
ScriptMgr.cpp:1608: error: invalid use of undefined type 'struct Player'
ScriptMgr.h:21: error: forward declaration of 'struct Player'
ScriptMgr.cpp: In function 'uint32 NPCDialogStatus(Player*, Creature*)':
ScriptMgr.cpp:1617: error: invalid use of undefined type 'struct Creature'
ScriptMgr.h:22: error: forward declaration of 'struct Creature'
ScriptMgr.cpp:1620: error: invalid use of undefined type 'struct Player'
ScriptMgr.h:21: error: forward declaration of 'struct Player'
ScriptMgr.cpp: In function 'uint32 GODialogStatus(Player*, GameObject*)':
ScriptMgr.cpp:1629: error: invalid use of undefined type 'struct GameObject'
ScriptMgr.h:27: error: forward declaration of 'struct GameObject'
ScriptMgr.cpp:1632: error: invalid use of undefined type 'struct Player'
ScriptMgr.h:21: error: forward declaration of 'struct Player'
ScriptMgr.cpp: In function 'bool ItemHello(Player*, Item*, const Quest*)':
ScriptMgr.cpp:1641: error: invalid use of undefined type 'struct Item'
ScriptMgr.h:26: error: forward declaration of 'struct Item'
ScriptMgr.cpp:1644: error: invalid use of undefined type 'struct Player'
ScriptMgr.h:21: error: forward declaration of 'struct Player'
ScriptMgr.cpp: In function 'bool ItemQuestAccept(Player*, Item*, const Quest*)':
ScriptMgr.cpp:1653: error: invalid use of undefined type 'struct Item'
ScriptMgr.h:26: error: forward declaration of 'struct Item'
ScriptMgr.cpp:1656: error: invalid use of undefined type 'struct Player'
ScriptMgr.h:21: error: forward declaration of 'struct Player'
ScriptMgr.cpp: In function 'bool GOHello(Player*, GameObject*)':
ScriptMgr.cpp:1665: error: invalid use of undefined type 'struct GameObject'
ScriptMgr.h:27: error: forward declaration of 'struct GameObject'
ScriptMgr.cpp:1668: error: invalid use of undefined type 'struct Player'
ScriptMgr.h:21: error: forward declaration of 'struct Player'
ScriptMgr.cpp: In function 'bool GOQuestAccept(Player*, GameObject*, const Quest*)':
ScriptMgr.cpp:1677: error: invalid use of undefined type 'struct GameObject'
ScriptMgr.h:27: error: forward declaration of 'struct GameObject'
ScriptMgr.cpp:1680: error: invalid use of undefined type 'struct Player'
ScriptMgr.h:21: error: forward declaration of 'struct Player'
ScriptMgr.cpp: In function 'bool GOChooseReward(Player*, GameObject*, const Quest*, uint32)':
ScriptMgr.cpp:1689: error: invalid use of undefined type 'struct GameObject'
ScriptMgr.h:27: error: forward declaration of 'struct GameObject'
ScriptMgr.cpp:1692: error: invalid use of undefined type 'struct Player'
ScriptMgr.h:21: error: forward declaration of 'struct Player'
ScriptMgr.cpp: In function 'bool AreaTrigger(Player*, const Quest*, uint32)':
ScriptMgr.cpp:1705: error: invalid use of undefined type 'struct Player'
ScriptMgr.h:21: error: forward declaration of 'struct Player'
ScriptMgr.cpp: In function 'CreatureAI* GetAI(Creature*)':
ScriptMgr.cpp:1712: error: invalid use of undefined type 'struct Creature'
ScriptMgr.h:22: error: forward declaration of 'struct Creature'
ScriptMgr.cpp: In function 'bool ItemUse(Player*, Item*, const SpellCastTargets&)':
ScriptMgr.cpp:1723: error: invalid use of undefined type 'struct Item'
ScriptMgr.h:26: error: forward declaration of 'struct Item'
ScriptMgr.cpp: In function 'bool ReceiveEmote(Player*, Creature*, uint32)':
ScriptMgr.cpp:1734: error: invalid use of undefined type 'struct Creature'
ScriptMgr.h:22: error: forward declaration of 'struct Creature'
ScriptMgr.cpp: In function 'InstanceData* CreateInstanceData(Map*)':
ScriptMgr.cpp:1745: error: invalid use of undefined type 'struct Map'
ScriptMgr.h:29: error: forward declaration of 'struct Map'
make[5]: *** [ScriptMgr.lo] Error 1
make[5]: Leaving directory `/opt/wow-development/5629/trunk/src/bindings/ScriptDev2'
make[4]: *** [all-recursive] Error 1
make[4]: Leaving directory `/opt/wow-development/5629/trunk/src/bindings/ScriptDev2'
make[3]: *** [all-recursive] Error 1
make[3]: Leaving directory `/opt/wow-development/5629/trunk/src/bindings'
make[2]: *** [all-recursive] Error 1
make[2]: Leaving directory `/opt/wow-development/5629/trunk/src'
make[1]: *** [all-recursive] Error 1
make[1]: Leaving directory `/opt/wow-development/5629/trunk'
make: *** [all] Error 2