All pastes #984835 Raw Edit

Unnamed

public text v1 · immutable
·published 2008-04-14 16:28 UTC
rendered paste body
[ 45%] Building CXX object workspace/libs/plasma/CMakeFiles/plasma.dir/widgets/webcontent.o
"/home/luc/repositories/KDE4/kdebase/workspace/libs/plasma/widgets/webcontent.h", line 62: Error: Virtual function Plasma::WebContent::geometry() const returns QSizeF, while QGraphicsWidget::geometry() const returns QRectF.
"/home/luc/repositories/KDE4/kdebase/workspace/libs/plasma/widgets/webcontent.cpp", line 76: Error: contentsSize is not a member of QWebFrame.
2 Error(s) detected.
make[3]: *** [workspace/libs/plasma/CMakeFiles/plasma.dir/widgets/webcontent.o] Error 2
make[3]: Leaving directory `/home/luc/packages/BUILD/KDE4/kdebase'
make[2]: *** [workspace/libs/plasma/CMakeFiles/plasma.dir/all] Error 2
make[2]: *** Waiting for unfinished jobs....
[ 45%] Building CXX object workspace/ksplash/ksplashx/CMakeFiles/ksplashx.dir/qcolor.o
[ 45%] Building CXX object workspace/ksplash/ksplashx/CMakeFiles/ksplashx.dir/qcolor_x11.o
[ 45%] Building CXX object workspace/ksplash/ksplashx/CMakeFiles/ksplashx.dir/qcolor_p.o
[ 45%] Building CXX object workspace/ksplash/ksplashx/CMakeFiles/ksplashx.dir/x11_defs.o
[ 45%] Building CXX object workspace/ksplash/ksplashx/CMakeFiles/ksplashx.dir/defs.o
"/home/luc/repositories/KDE4/kdebase/workspace/ksplash/ksplashx/x11_defs.cpp", line 175: Warning (Anachronism): Formal argument 1 of type extern "C" int(*)(_XDisplay*,XErrorEvent*) in call to XSetErrorHandler(extern "C" int(*)(_XDisplay*,XErrorEvent*)) is being passed int(*)(_XDisplay*,XErrorEvent*).
1 Warning(s) detected.
[ 45%] Building CXX object workspace/ksplash/ksplashx/CMakeFiles/ksplashx.dir/splash.o
[ 45%] Building CXX object workspace/ksplash/ksplashx/CMakeFiles/ksplashx.dir/qrect.o
[ 45%] Building CXX object workspace/ksplash/ksplashx/CMakeFiles/ksplashx.dir/kcpuinfo.o
[ 45%] Building CXX object workspace/ksplash/ksplashx/CMakeFiles/ksplashx.dir/scale.o
Linking CXX executable ksplashx
make[3]: Leaving directory `/home/luc/packages/BUILD/KDE4/kdebase'
[ 45%] Built target ksplashx
make[2]: Leaving directory `/home/luc/packages/BUILD/KDE4/kdebase'
make[1]: *** [all] Error 2
make[1]: Leaving directory `/home/luc/packages/BUILD/KDE4/kdebase'
make: *** [build] Error 2