linuxmce@dcerouter:/home/src/charon-merge$ ./configure
linuxmce@dcerouter:/home/src/charon-merge$ make
I need to run sudo...
"src/Ubuntu_Helpers/"/RunFunction.sh /home/src/charon-merge SUDO_Install_Build_Needed_Packages_SUDO
OK
Retrieving updated package lists
Failed to fetch http://linuxmce.com/ubuntu/./Packages.gz 302 Found
E: Some index files failed to download, they have been ignored, or old ones used instead.
Installing general development packages
.................E: Broken packages
Error installing libavcodec-dev
.E: Broken packages
Error installing libavformat-dev
....E: Broken packages
Error installing libcdio-dev
........................E: Broken packages
Error installing libpostproc-dev
.....................................................E: Broken packages
Error installing liblame-dev
......
Installing mysql stuff
E: Broken packages
Installing libxine development packages
.............E: Broken packages
Error installing libcdio-dev
....E: Broken packages
Error installing libavformat-dev
.E: Broken packages
Error installing libpostproc-dev
.E: Broken packages
Error installing libavcodec-dev
..
Installing Linux headers for installed Linux release, needed for pluto-asterisk
Installing lirc-source for installed Linux release
ivtv-source (TODO still needed? -- dtk)
Installing KDE development libraries 710
E: Package libjasper-dev has no installation candidate
Removing libdvdnav-dev to make room for libxine version
make start_build_db
make[1]: Entering directory `/home/src/charon-merge'
make[1]: Leaving directory `/home/src/charon-merge'
make create_cdrom
make[1]: Entering directory `/home/src/charon-merge'
I need to run sudo...
"src/Ubuntu_Helpers/"/RunFunction.sh /home/src/charon-merge SUDO_Install_Build_Needed_Packages_SUDO
make start_build_db
make[2]: Entering directory `/home/src/charon-merge'
make[2]: Leaving directory `/home/src/charon-merge'
cp -R /home/src/charon-merge/build/DisklessFS build/tmp/home/
make video_wizard_videos build_replacement_packages build_pluto
make[2]: Entering directory `/home/src/charon-merge'
I need to run sudo...
"src/Ubuntu_Helpers/"/RunFunction.sh /home/src/charon-merge SUDO_Install_Build_Needed_Packages_SUDO
make start_build_db
make[3]: Entering directory `/home/src/charon-merge'
make[3]: Leaving directory `/home/src/charon-merge'
make ivtv_drivers lirc_drivers
make[3]: Entering directory `/home/src/charon-merge'
I need to run sudo...
Package: ivtv-modules
.
Package: lirc-modules
Unpacking Linux Source
Building lirc-modules
ln: creating symbolic link `./video' to `../../../linux-source-2.6.20/drivers/video/': File exists
Reading package lists... Done
Building dependency tree
Reading state information... Done
0 upgraded, 0 newly installed, 1 reinstalled, 0 to remove and 1 not upgraded.
Need to get 0B/286kB of archives.
After unpacking 0B of additional disk space will be used.
WARNING: The following packages cannot be authenticated!
lirc-modules-source
Authentication warning overridden.
Preconfiguring packages ...
(Reading database ... 112102 files and directories currently installed.)
Preparing to replace lirc-modules-source 0.8.1+cvs20070310-0ubuntu2 (using .../lirc-modules-source_0.8.1+cvs20070310-0ubuntu2_all.deb) ...
Unpacking replacement lirc-modules-source ...
Setting up lirc-modules-source (0.8.1+cvs20070310-0ubuntu2) ...
.
Updated infos about 1 packages
Extracting the package tarball, /usr/src/lirc-modules.tar.gz, please wait...
make[4]: Entering directory `/usr/src/modules/lirc'
sed -e "s!\$KVERS!`sed -n -e '/UTS_RELEASE/s/^[^"]*"\([^"]*\)".*$/\1/p' /usr/src/linux/include/linux/version.h`!g; s!\$KSRC!/usr/src/linux!; s!\$KARCH!i386!; s!\$KEMAIL!!; s!\$KMAINT!!; s!\$KDREV!"Custom.1.00"!; s!\$DEBDATE!Mon, 14 Apr 2008 11:56:18 -0400!" debian/control.in > debian/control
sed: can't read /usr/src/linux/include/linux/version.h: No such file or directory
/usr/bin/make -w -f debian/rules clean
make[5]: Entering directory `/usr/src/modules/lirc'
dh_testdir
dh_testroot
rm -f build-stamp configure-stamp
# Add here commands to clean up after the build process.
/usr/bin/make clean
sed: can't read /usr/src/linux/2.6.20-15-generic/build/include/linux/version.h: No such file or directory
make[6]: Entering directory `/usr/src/modules/lirc'
/usr/bin/make clean -C drivers SUBDIRS="lirc_atiusb lirc_bt829 lirc_cmdir lirc_gpio lirc_i2c lirc_igorplugusb lirc_imon lirc_it87 lirc_mceusb lirc_mceusb2 lirc_parallel lirc_pvr150 lirc_sasem lirc_serial lirc_sir lirc_streamzap"
sed: can't read /usr/src/linux/2.6.20-15-generic/build/include/linux/version.h: No such file or directory
make[7]: Entering directory `/usr/src/modules/lirc/drivers'
Making clean in lirc_streamzap
make[8]: Entering directory `/usr/src/modules/lirc/drivers/lirc_streamzap'
test -z "lirc_streamzap.o .lirc_streamzap.o.flags lirc_streamzap.mod.c lirc_streamzap.ko *~" || rm -f lirc_streamzap.o .lirc_streamzap.o.flags lirc_streamzap.mod.c lirc_streamzap.ko *~
rm -rf .libs _libs
rm -f *.o
rm -f *.lo
make[8]: Leaving directory `/usr/src/modules/lirc/drivers/lirc_streamzap'
Making clean in lirc_sir
make[8]: Entering directory `/usr/src/modules/lirc/drivers/lirc_sir'
test -z "lirc_sir.o .lirc_sir.o.flags lirc_sir.mod.c lirc_sir.ko *~" || rm -f lirc_sir.o .lirc_sir.o.flags lirc_sir.mod.c lirc_sir.ko *~
rm -rf .libs _libs
rm -f *.o
rm -f *.lo
make[8]: Leaving directory `/usr/src/modules/lirc/drivers/lirc_sir'
Making clean in lirc_serial
make[8]: Entering directory `/usr/src/modules/lirc/drivers/lirc_serial'
test -z "lirc_serial.o .lirc_serial.o.flags lirc_serial.mod.c lirc_serial.ko *~" || rm -f lirc_serial.o .lirc_serial.o.flags lirc_serial.mod.c lirc_serial.ko *~
rm -rf .libs _libs
rm -f *.o
rm -f *.lo
make[8]: Leaving directory `/usr/src/modules/lirc/drivers/lirc_serial'
Making clean in lirc_sasem
make[8]: Entering directory `/usr/src/modules/lirc/drivers/lirc_sasem'
test -z "lirc_sasem.o .lirc_sasem.o.flags lirc_sasem.mod.c lirc_sasem.ko *~" || rm -f lirc_sasem.o .lirc_sasem.o.flags lirc_sasem.mod.c lirc_sasem.ko *~
rm -rf .libs _libs
rm -f *.o
rm -f *.lo
make[8]: Leaving directory `/usr/src/modules/lirc/drivers/lirc_sasem'
Making clean in lirc_pvr150
make[8]: Entering directory `/usr/src/modules/lirc/drivers/lirc_pvr150'
test -z "lirc_pvr150.o .lirc_pvr150.o.flags lirc_pvr150.mod.c lirc_pvr150.ko *~" || rm -f lirc_pvr150.o .lirc_pvr150.o.flags lirc_pvr150.mod.c lirc_pvr150.ko *~
rm -rf .libs _libs
rm -f *.o
rm -f *.lo
make[8]: Leaving directory `/usr/src/modules/lirc/drivers/lirc_pvr150'
Making clean in lirc_parallel
make[8]: Entering directory `/usr/src/modules/lirc/drivers/lirc_parallel'
test -z "lirc_parallel.o .lirc_parallel.o.flags lirc_parallel.mod.c lirc_parallel.ko *~" || rm -f lirc_parallel.o .lirc_parallel.o.flags lirc_parallel.mod.c lirc_parallel.ko *~
rm -rf .libs _libs
rm -f *.o
rm -f *.lo
make[8]: Leaving directory `/usr/src/modules/lirc/drivers/lirc_parallel'
Making clean in lirc_mceusb2
make[8]: Entering directory `/usr/src/modules/lirc/drivers/lirc_mceusb2'
test -z "lirc_mceusb2.o .lirc_mceusb2.o.flags lirc_mceusb2.mod.c lirc_mceusb2.ko *~" || rm -f lirc_mceusb2.o .lirc_mceusb2.o.flags lirc_mceusb2.mod.c lirc_mceusb2.ko *~
rm -rf .libs _libs
rm -f *.o
rm -f *.lo
make[8]: Leaving directory `/usr/src/modules/lirc/drivers/lirc_mceusb2'
Making clean in lirc_mceusb
make[8]: Entering directory `/usr/src/modules/lirc/drivers/lirc_mceusb'
test -z "lirc_mceusb.o .lirc_mceusb.o.flags lirc_mceusb.mod.c lirc_mceusb.ko *~" || rm -f lirc_mceusb.o .lirc_mceusb.o.flags lirc_mceusb.mod.c lirc_mceusb.ko *~
rm -rf .libs _libs
rm -f *.o
rm -f *.lo
make[8]: Leaving directory `/usr/src/modules/lirc/drivers/lirc_mceusb'
Making clean in lirc_it87
make[8]: Entering directory `/usr/src/modules/lirc/drivers/lirc_it87'
test -z "lirc_it87.o .lirc_it87.o.flags lirc_it87.mod.c lirc_it87.ko *~" || rm -f lirc_it87.o .lirc_it87.o.flags lirc_it87.mod.c lirc_it87.ko *~
rm -rf .libs _libs
rm -f *.o
rm -f *.lo
make[8]: Leaving directory `/usr/src/modules/lirc/drivers/lirc_it87'
Making clean in lirc_imon
make[8]: Entering directory `/usr/src/modules/lirc/drivers/lirc_imon'
test -z "lirc_imon.o .lirc_imon.o.flags lirc_imon.mod.c lirc_imon.ko *~" || rm -f lirc_imon.o .lirc_imon.o.flags lirc_imon.mod.c lirc_imon.ko *~
rm -rf .libs _libs
rm -f *.o
rm -f *.lo
make[8]: Leaving directory `/usr/src/modules/lirc/drivers/lirc_imon'
Making clean in lirc_igorplugusb
make[8]: Entering directory `/usr/src/modules/lirc/drivers/lirc_igorplugusb'
test -z "lirc_igorplugusb.o .lirc_igorplugusb.o.flags lirc_igorplugusb.mod.c lirc_igorplugusb.ko *~" || rm -f lirc_igorplugusb.o .lirc_igorplugusb.o.flags lirc_igorplugusb.mod.c lirc_igorplugusb.ko *~
rm -rf .libs _libs
rm -f *.o
rm -f *.lo
make[8]: Leaving directory `/usr/src/modules/lirc/drivers/lirc_igorplugusb'
Making clean in lirc_i2c
make[8]: Entering directory `/usr/src/modules/lirc/drivers/lirc_i2c'
test -z "lirc_i2c.o .lirc_i2c.o.flags lirc_i2c.mod.c lirc_i2c.ko *~" || rm -f lirc_i2c.o .lirc_i2c.o.flags lirc_i2c.mod.c lirc_i2c.ko *~
rm -rf .libs _libs
rm -f *.o
rm -f *.lo
make[8]: Leaving directory `/usr/src/modules/lirc/drivers/lirc_i2c'
Making clean in lirc_gpio
make[8]: Entering directory `/usr/src/modules/lirc/drivers/lirc_gpio'
test -z "lirc_gpio.o .lirc_gpio.o.flags lirc_gpio.mod.c lirc_gpio.ko *~" || rm -f lirc_gpio.o .lirc_gpio.o.flags lirc_gpio.mod.c lirc_gpio.ko *~
rm -rf .libs _libs
rm -f *.o
rm -f *.lo
make[8]: Leaving directory `/usr/src/modules/lirc/drivers/lirc_gpio'
Making clean in lirc_cmdir
make[8]: Entering directory `/usr/src/modules/lirc/drivers/lirc_cmdir'
test -z "lirc_cmdir.o .lirc_cmdir.o.flags lirc_cmdir.mod.c lirc_cmdir.ko *~" || rm -f lirc_cmdir.o .lirc_cmdir.o.flags lirc_cmdir.mod.c lirc_cmdir.ko *~
rm -rf .libs _libs
rm -f *.o
rm -f *.lo
make[8]: Leaving directory `/usr/src/modules/lirc/drivers/lirc_cmdir'
Making clean in lirc_bt829
make[8]: Entering directory `/usr/src/modules/lirc/drivers/lirc_bt829'
test -z "lirc_bt829.o .lirc_bt829.o.flags lirc_bt829.mod.c lirc_bt829.ko *~" || rm -f lirc_bt829.o .lirc_bt829.o.flags lirc_bt829.mod.c lirc_bt829.ko *~
rm -rf .libs _libs
rm -f *.o
rm -f *.lo
make[8]: Leaving directory `/usr/src/modules/lirc/drivers/lirc_bt829'
Making clean in lirc_atiusb
make[8]: Entering directory `/usr/src/modules/lirc/drivers/lirc_atiusb'
test -z "lirc_atiusb.o .lirc_atiusb.o.flags lirc_atiusb.mod.c lirc_atiusb.ko *~" || rm -f lirc_atiusb.o .lirc_atiusb.o.flags lirc_atiusb.mod.c lirc_atiusb.ko *~
rm -rf .libs _libs
rm -f *.o
rm -f *.lo
make[8]: Leaving directory `/usr/src/modules/lirc/drivers/lirc_atiusb'
Making clean in .
make[8]: Entering directory `/usr/src/modules/lirc/drivers'
test -z "*~" || rm -f *~
rm -rf .libs _libs
rm -f *.lo
make[8]: Leaving directory `/usr/src/modules/lirc/drivers'
make[7]: Leaving directory `/usr/src/modules/lirc/drivers'
rm -rf modules
make[6]: Leaving directory `/usr/src/modules/lirc'
dh_clean
rm -f debian/control
make[5]: Leaving directory `/usr/src/modules/lirc'
make[4]: Leaving directory `/usr/src/modules/lirc'
make[4]: Entering directory `/usr/src/modules/lirc'
/usr/bin/make -w -f debian/rules binary-modules
make[5]: Entering directory `/usr/src/modules/lirc'
sed -e "s!\$KVERS!2.6.20-15-generic!g; s!\$KSRC!/lib/modules/2.6.20-15-generic/build!; s!\$KARCH!i386!; s!\$KEMAIL!!; s!\$KMAINT!!; s!\$KDREV!2.6.20-15.27!; s!\$DEBDATE!Mon, 14 Apr 2008 11:56:19 -0400!" debian/control.in > debian/control
dh_testdir
# Add here commands to configure the package.
touch configure-stamp
dh_testdir
# Add here commands to compile the package.
/usr/bin/make debconf
make[6]: Entering directory `/usr/src/modules/lirc'
mkdir modules
/usr/bin/make -C drivers SUBDIRS="lirc_dev"
make[7]: Entering directory `/usr/src/modules/lirc/drivers'
Making all in lirc_dev
make[8]: Entering directory `/usr/src/modules/lirc/drivers/lirc_dev'
make[8]: Nothing to be done for `all'.
make[8]: Leaving directory `/usr/src/modules/lirc/drivers/lirc_dev'
make[8]: Entering directory `/usr/src/modules/lirc/drivers'
make[8]: Nothing to be done for `all-am'.
make[8]: Leaving directory `/usr/src/modules/lirc/drivers'
make[7]: Leaving directory `/usr/src/modules/lirc/drivers'
cp drivers/lirc_dev/lirc_dev.ko modules
/usr/bin/make -C drivers SUBDIRS="lirc_atiusb"
make[7]: Entering directory `/usr/src/modules/lirc/drivers'
Making all in lirc_atiusb
make[8]: Entering directory `/usr/src/modules/lirc/drivers/lirc_atiusb'
mv Makefile Makefile.automake
cp ../Makefile.kernel Makefile
/usr/bin/make -C /lib/modules/2.6.20-15-generic/build SUBDIRS=/usr/src/modules/lirc/drivers/lirc_atiusb modules \
KBUILD_VERBOSE=1
make[9]: Entering directory `/usr/src/linux-headers-2.6.20-15-generic'
test -e include/linux/autoconf.h -a -e include/config/auto.conf || ( \
echo; \
echo " ERROR: Kernel configuration is invalid."; \
echo " include/linux/autoconf.h or include/config/auto.conf are missing."; \
echo " Run 'make oldconfig && make prepare' on kernel src to fix it."; \
echo; \
/bin/false)
mkdir -p /usr/src/modules/lirc/drivers/lirc_atiusb/.tmp_versions
rm -f /usr/src/modules/lirc/drivers/lirc_atiusb/.tmp_versions/*
/usr/bin/make -f scripts/Makefile.build obj=/usr/src/modules/lirc/drivers/lirc_atiusb
gcc -m32 -Wp,-MD,/usr/src/modules/lirc/drivers/lirc_atiusb/.lirc_atiusb.o.d -nostdinc -isystem /usr/lib/gcc/i486-linux-gnu/4.1.2/include -D__KERNEL__ -Iinclude -include include/linux/autoconf.h -Iubuntu/include -Wall -Wundef -Wstrict-prototypes -Wno-trigraphs -fno-strict-aliasing -fno-common -O2 -pipe -msoft-float -mregparm=3 -mpreferred-stack-boundary=2 -march=i586 -mtune=generic -ffreestanding -maccumulate-outgoing-args -DCONFIG_AS_CFI=1 -DCONFIG_AS_CFI_SIGNAL_FRAME=1 -Iinclude/asm-i386/mach-default -fomit-frame-pointer -g -fno-stack-protector -Wdeclaration-after-statement -Wno-pointer-sign -DIRCTL_DEV_MAJOR=61 -DEXPORT_SYMTAB -DHAVE_CONFIG_H -I. -I../.. -I/usr/src/modules/lirc/drivers/lirc_atiusb/../.. -I/lib/modules/2.6.20-15-generic/build/include/ -I/lib/modules/2.6.20-15-generic/build/drivers/media/video/ -DMODULE -D"KBUILD_STR(s)=#s" -D"KBUILD_BASENAME=KBUILD_STR(lirc_atiusb)" -D"KBUILD_MODNAME=KBUILD_STR(lirc_atiusb)" -c -o /usr/src/modules/lirc/drivers/lirc_atiusb/.tmp_lirc_atiusb.o /usr/src/modules/lirc/drivers/lirc_atiusb/lirc_atiusb.c
/usr/src/modules/lirc/drivers/lirc_atiusb/lirc_atiusb.c: In function ‘send_outbound_init’:
/usr/src/modules/lirc/drivers/lirc_atiusb/lirc_atiusb.c:1098: warning: passing argument 6 of ‘usb_fill_int_urb’ from incompatible pointer type
/usr/src/modules/lirc/drivers/lirc_atiusb/lirc_atiusb.c: In function ‘usb_remote_probe’:
/usr/src/modules/lirc/drivers/lirc_atiusb/lirc_atiusb.c:1174: warning: passing argument 6 of ‘usb_fill_int_urb’ from incompatible pointer type
Building modules, stage 2.
/usr/bin/make -f /usr/src/linux-headers-2.6.20-15-generic/scripts/Makefile.modpost
scripts/mod/modpost -m -a -i /usr/src/linux-headers-2.6.20-15-generic/Module.symvers -I /usr/src/modules/lirc/drivers/lirc_atiusb/Module.symvers -o /usr/src/modules/lirc/drivers/lirc_atiusb/Module.symvers -w /usr/src/modules/lirc/drivers/lirc_atiusb/lirc_atiusb.o
WARNING: "lirc_register_plugin" [/usr/src/modules/lirc/drivers/lirc_atiusb/lirc_atiusb.ko] undefined!
WARNING: "lirc_unregister_plugin" [/usr/src/modules/lirc/drivers/lirc_atiusb/lirc_atiusb.ko] undefined!
gcc -m32 -Wp,-MD,/usr/src/modules/lirc/drivers/lirc_atiusb/.lirc_atiusb.mod.o.d -nostdinc -isystem /usr/lib/gcc/i486-linux-gnu/4.1.2/include -D__KERNEL__ -Iinclude -include include/linux/autoconf.h -Iubuntu/include -Wall -Wundef -Wstrict-prototypes -Wno-trigraphs -fno-strict-aliasing -fno-common -O2 -pipe -msoft-float -mregparm=3 -mpreferred-stack-boundary=2 -march=i586 -mtune=generic -ffreestanding -maccumulate-outgoing-args -DCONFIG_AS_CFI=1 -DCONFIG_AS_CFI_SIGNAL_FRAME=1 -Iinclude/asm-i386/mach-default -fomit-frame-pointer -g -fno-stack-protector -Wdeclaration-after-statement -Wno-pointer-sign -D"KBUILD_STR(s)=#s" -D"KBUILD_BASENAME=KBUILD_STR(lirc_atiusb.mod)" -D"KBUILD_MODNAME=KBUILD_STR(lirc_atiusb)" -DMODULE -c -o /usr/src/modules/lirc/drivers/lirc_atiusb/lirc_atiusb.mod.o /usr/src/modules/lirc/drivers/lirc_atiusb/lirc_atiusb.mod.c
ld -m elf_i386 -m elf_i386 -r -o /usr/src/modules/lirc/drivers/lirc_atiusb/lirc_atiusb.ko /usr/src/modules/lirc/drivers/lirc_atiusb/lirc_atiusb.o /usr/src/modules/lirc/drivers/lirc_atiusb/lirc_atiusb.mod.o
make[9]: Leaving directory `/usr/src/linux-headers-2.6.20-15-generic'
mv Makefile.automake Makefile
make[8]: Leaving directory `/usr/src/modules/lirc/drivers/lirc_atiusb'
make[8]: Entering directory `/usr/src/modules/lirc/drivers'
make[8]: Nothing to be done for `all-am'.
make[8]: Leaving directory `/usr/src/modules/lirc/drivers'
make[7]: Leaving directory `/usr/src/modules/lirc/drivers'
cp drivers/lirc_atiusb/lirc_atiusb.ko modules
/usr/bin/make -C drivers SUBDIRS="lirc_bt829"
make[7]: Entering directory `/usr/src/modules/lirc/drivers'
Making all in lirc_bt829
make[8]: Entering directory `/usr/src/modules/lirc/drivers/lirc_bt829'
mv Makefile Makefile.automake
cp ../Makefile.kernel Makefile
/usr/bin/make -C /lib/modules/2.6.20-15-generic/build SUBDIRS=/usr/src/modules/lirc/drivers/lirc_bt829 modules \
KBUILD_VERBOSE=1
make[9]: Entering directory `/usr/src/linux-headers-2.6.20-15-generic'
test -e include/linux/autoconf.h -a -e include/config/auto.conf || ( \
echo; \
echo " ERROR: Kernel configuration is invalid."; \
echo " include/linux/autoconf.h or include/config/auto.conf are missing."; \
echo " Run 'make oldconfig && make prepare' on kernel src to fix it."; \
echo; \
/bin/false)
mkdir -p /usr/src/modules/lirc/drivers/lirc_bt829/.tmp_versions
rm -f /usr/src/modules/lirc/drivers/lirc_bt829/.tmp_versions/*
/usr/bin/make -f scripts/Makefile.build obj=/usr/src/modules/lirc/drivers/lirc_bt829
gcc -m32 -Wp,-MD,/usr/src/modules/lirc/drivers/lirc_bt829/.lirc_bt829.o.d -nostdinc -isystem /usr/lib/gcc/i486-linux-gnu/4.1.2/include -D__KERNEL__ -Iinclude -include include/linux/autoconf.h -Iubuntu/include -Wall -Wundef -Wstrict-prototypes -Wno-trigraphs -fno-strict-aliasing -fno-common -O2 -pipe -msoft-float -mregparm=3 -mpreferred-stack-boundary=2 -march=i586 -mtune=generic -ffreestanding -maccumulate-outgoing-args -DCONFIG_AS_CFI=1 -DCONFIG_AS_CFI_SIGNAL_FRAME=1 -Iinclude/asm-i386/mach-default -fomit-frame-pointer -g -fno-stack-protector -Wdeclaration-after-statement -Wno-pointer-sign -DIRCTL_DEV_MAJOR=61 -DEXPORT_SYMTAB -DHAVE_CONFIG_H -I. -I../.. -I/usr/src/modules/lirc/drivers/lirc_bt829/../.. -I/lib/modules/2.6.20-15-generic/build/include/ -I/lib/modules/2.6.20-15-generic/build/drivers/media/video/ -DMODULE -D"KBUILD_STR(s)=#s" -D"KBUILD_BASENAME=KBUILD_STR(lirc_bt829)" -D"KBUILD_MODNAME=KBUILD_STR(lirc_bt829)" -c -o /usr/src/modules/lirc/drivers/lirc_bt829/.tmp_lirc_bt829.o /usr/src/modules/lirc/drivers/lirc_bt829/lirc_bt829.c
Building modules, stage 2.
/usr/bin/make -f /usr/src/linux-headers-2.6.20-15-generic/scripts/Makefile.modpost
scripts/mod/modpost -m -a -i /usr/src/linux-headers-2.6.20-15-generic/Module.symvers -I /usr/src/modules/lirc/drivers/lirc_bt829/Module.symvers -o /usr/src/modules/lirc/drivers/lirc_bt829/Module.symvers -w /usr/src/modules/lirc/drivers/lirc_bt829/lirc_bt829.o
WARNING: "lirc_register_plugin" [/usr/src/modules/lirc/drivers/lirc_bt829/lirc_bt829.ko] undefined!
WARNING: "lirc_unregister_plugin" [/usr/src/modules/lirc/drivers/lirc_bt829/lirc_bt829.ko] undefined!
gcc -m32 -Wp,-MD,/usr/src/modules/lirc/drivers/lirc_bt829/.lirc_bt829.mod.o.d -nostdinc -isystem /usr/lib/gcc/i486-linux-gnu/4.1.2/include -D__KERNEL__ -Iinclude -include include/linux/autoconf.h -Iubuntu/include -Wall -Wundef -Wstrict-prototypes -Wno-trigraphs -fno-strict-aliasing -fno-common -O2 -pipe -msoft-float -mregparm=3 -mpreferred-stack-boundary=2 -march=i586 -mtune=generic -ffreestanding -maccumulate-outgoing-args -DCONFIG_AS_CFI=1 -DCONFIG_AS_CFI_SIGNAL_FRAME=1 -Iinclude/asm-i386/mach-default -fomit-frame-pointer -g -fno-stack-protector -Wdeclaration-after-statement -Wno-pointer-sign -D"KBUILD_STR(s)=#s" -D"KBUILD_BASENAME=KBUILD_STR(lirc_bt829.mod)" -D"KBUILD_MODNAME=KBUILD_STR(lirc_bt829)" -DMODULE -c -o /usr/src/modules/lirc/drivers/lirc_bt829/lirc_bt829.mod.o /usr/src/modules/lirc/drivers/lirc_bt829/lirc_bt829.mod.c
ld -m elf_i386 -m elf_i386 -r -o /usr/src/modules/lirc/drivers/lirc_bt829/lirc_bt829.ko /usr/src/modules/lirc/drivers/lirc_bt829/lirc_bt829.o /usr/src/modules/lirc/drivers/lirc_bt829/lirc_bt829.mod.o
make[9]: Leaving directory `/usr/src/linux-headers-2.6.20-15-generic'
mv Makefile.automake Makefile
make[8]: Leaving directory `/usr/src/modules/lirc/drivers/lirc_bt829'
make[8]: Entering directory `/usr/src/modules/lirc/drivers'
make[8]: Nothing to be done for `all-am'.
make[8]: Leaving directory `/usr/src/modules/lirc/drivers'
make[7]: Leaving directory `/usr/src/modules/lirc/drivers'
cp drivers/lirc_bt829/lirc_bt829.ko modules
/usr/bin/make -C drivers SUBDIRS="lirc_cmdir"
make[7]: Entering directory `/usr/src/modules/lirc/drivers'
Making all in lirc_cmdir
make[8]: Entering directory `/usr/src/modules/lirc/drivers/lirc_cmdir'
mv Makefile Makefile.automake
cp ../Makefile.kernel Makefile
/usr/bin/make -C /lib/modules/2.6.20-15-generic/build SUBDIRS=/usr/src/modules/lirc/drivers/lirc_cmdir modules \
KBUILD_VERBOSE=1
make[9]: Entering directory `/usr/src/linux-headers-2.6.20-15-generic'
test -e include/linux/autoconf.h -a -e include/config/auto.conf || ( \
echo; \
echo " ERROR: Kernel configuration is invalid."; \
echo " include/linux/autoconf.h or include/config/auto.conf are missing."; \
echo " Run 'make oldconfig && make prepare' on kernel src to fix it."; \
echo; \
/bin/false)
mkdir -p /usr/src/modules/lirc/drivers/lirc_cmdir/.tmp_versions
rm -f /usr/src/modules/lirc/drivers/lirc_cmdir/.tmp_versions/*
/usr/bin/make -f scripts/Makefile.build obj=/usr/src/modules/lirc/drivers/lirc_cmdir
gcc -m32 -Wp,-MD,/usr/src/modules/lirc/drivers/lirc_cmdir/.lirc_cmdir.o.d -nostdinc -isystem /usr/lib/gcc/i486-linux-gnu/4.1.2/include -D__KERNEL__ -Iinclude -include include/linux/autoconf.h -Iubuntu/include -Wall -Wundef -Wstrict-prototypes -Wno-trigraphs -fno-strict-aliasing -fno-common -O2 -pipe -msoft-float -mregparm=3 -mpreferred-stack-boundary=2 -march=i586 -mtune=generic -ffreestanding -maccumulate-outgoing-args -DCONFIG_AS_CFI=1 -DCONFIG_AS_CFI_SIGNAL_FRAME=1 -Iinclude/asm-i386/mach-default -fomit-frame-pointer -g -fno-stack-protector -Wdeclaration-after-statement -Wno-pointer-sign -DIRCTL_DEV_MAJOR=61 -DEXPORT_SYMTAB -DHAVE_CONFIG_H -I. -I../.. -I/usr/src/modules/lirc/drivers/lirc_cmdir/../.. -I/lib/modules/2.6.20-15-generic/build/include/ -I/lib/modules/2.6.20-15-generic/build/drivers/media/video/ -DMODULE -D"KBUILD_STR(s)=#s" -D"KBUILD_BASENAME=KBUILD_STR(lirc_cmdir)" -D"KBUILD_MODNAME=KBUILD_STR(lirc_cmdir)" -c -o /usr/src/modules/lirc/drivers/lirc_cmdir/.tmp_lirc_cmdir.o /usr/src/modules/lirc/drivers/lirc_cmdir/lirc_cmdir.c
/usr/src/modules/lirc/drivers/lirc_cmdir/lirc_cmdir.c: In function ‘lirc_write’:
/usr/src/modules/lirc/drivers/lirc_cmdir/lirc_cmdir.c:356: warning: unused variable ‘cur_freq’
/usr/src/modules/lirc/drivers/lirc_cmdir/lirc_cmdir.c:354: warning: unused variable ‘num_bytes_to_send’
Building modules, stage 2.
/usr/bin/make -f /usr/src/linux-headers-2.6.20-15-generic/scripts/Makefile.modpost
scripts/mod/modpost -m -a -i /usr/src/linux-headers-2.6.20-15-generic/Module.symvers -I /usr/src/modules/lirc/drivers/lirc_cmdir/Module.symvers -o /usr/src/modules/lirc/drivers/lirc_cmdir/Module.symvers -w /usr/src/modules/lirc/drivers/lirc_cmdir/lirc_cmdir.o
WARNING: "cmdir_read" [/usr/src/modules/lirc/drivers/lirc_cmdir/lirc_cmdir.ko] undefined!
WARNING: "lirc_register_plugin" [/usr/src/modules/lirc/drivers/lirc_cmdir/lirc_cmdir.ko] undefined!
WARNING: "set_tx_channels" [/usr/src/modules/lirc/drivers/lirc_cmdir/lirc_cmdir.ko] undefined!
WARNING: "cmdir_write" [/usr/src/modules/lirc/drivers/lirc_cmdir/lirc_cmdir.ko] undefined!
WARNING: "lirc_unregister_plugin" [/usr/src/modules/lirc/drivers/lirc_cmdir/lirc_cmdir.ko] undefined!
gcc -m32 -Wp,-MD,/usr/src/modules/lirc/drivers/lirc_cmdir/.lirc_cmdir.mod.o.d -nostdinc -isystem /usr/lib/gcc/i486-linux-gnu/4.1.2/include -D__KERNEL__ -Iinclude -include include/linux/autoconf.h -Iubuntu/include -Wall -Wundef -Wstrict-prototypes -Wno-trigraphs -fno-strict-aliasing -fno-common -O2 -pipe -msoft-float -mregparm=3 -mpreferred-stack-boundary=2 -march=i586 -mtune=generic -ffreestanding -maccumulate-outgoing-args -DCONFIG_AS_CFI=1 -DCONFIG_AS_CFI_SIGNAL_FRAME=1 -Iinclude/asm-i386/mach-default -fomit-frame-pointer -g -fno-stack-protector -Wdeclaration-after-statement -Wno-pointer-sign -D"KBUILD_STR(s)=#s" -D"KBUILD_BASENAME=KBUILD_STR(lirc_cmdir.mod)" -D"KBUILD_MODNAME=KBUILD_STR(lirc_cmdir)" -DMODULE -c -o /usr/src/modules/lirc/drivers/lirc_cmdir/lirc_cmdir.mod.o /usr/src/modules/lirc/drivers/lirc_cmdir/lirc_cmdir.mod.c
ld -m elf_i386 -m elf_i386 -r -o /usr/src/modules/lirc/drivers/lirc_cmdir/lirc_cmdir.ko /usr/src/modules/lirc/drivers/lirc_cmdir/lirc_cmdir.o /usr/src/modules/lirc/drivers/lirc_cmdir/lirc_cmdir.mod.o
make[9]: Leaving directory `/usr/src/linux-headers-2.6.20-15-generic'
mv Makefile.automake Makefile
make[8]: Leaving directory `/usr/src/modules/lirc/drivers/lirc_cmdir'
make[8]: Entering directory `/usr/src/modules/lirc/drivers'
make[8]: Nothing to be done for `all-am'.
make[8]: Leaving directory `/usr/src/modules/lirc/drivers'
make[7]: Leaving directory `/usr/src/modules/lirc/drivers'
cp drivers/lirc_cmdir/lirc_cmdir.ko modules
/usr/bin/make -C drivers SUBDIRS="lirc_gpio"
make[7]: Entering directory `/usr/src/modules/lirc/drivers'
Making all in lirc_gpio
make[8]: Entering directory `/usr/src/modules/lirc/drivers/lirc_gpio'
mv Makefile Makefile.automake
cp ../Makefile.kernel Makefile
/usr/bin/make -C /lib/modules/2.6.20-15-generic/build SUBDIRS=/usr/src/modules/lirc/drivers/lirc_gpio modules \
KBUILD_VERBOSE=1
make[9]: Entering directory `/usr/src/linux-headers-2.6.20-15-generic'
test -e include/linux/autoconf.h -a -e include/config/auto.conf || ( \
echo; \
echo " ERROR: Kernel configuration is invalid."; \
echo " include/linux/autoconf.h or include/config/auto.conf are missing."; \
echo " Run 'make oldconfig && make prepare' on kernel src to fix it."; \
echo; \
/bin/false)
mkdir -p /usr/src/modules/lirc/drivers/lirc_gpio/.tmp_versions
rm -f /usr/src/modules/lirc/drivers/lirc_gpio/.tmp_versions/*
/usr/bin/make -f scripts/Makefile.build obj=/usr/src/modules/lirc/drivers/lirc_gpio
gcc -m32 -Wp,-MD,/usr/src/modules/lirc/drivers/lirc_gpio/.lirc_gpio.o.d -nostdinc -isystem /usr/lib/gcc/i486-linux-gnu/4.1.2/include -D__KERNEL__ -Iinclude -include include/linux/autoconf.h -Iubuntu/include -Wall -Wundef -Wstrict-prototypes -Wno-trigraphs -fno-strict-aliasing -fno-common -O2 -pipe -msoft-float -mregparm=3 -mpreferred-stack-boundary=2 -march=i586 -mtune=generic -ffreestanding -maccumulate-outgoing-args -DCONFIG_AS_CFI=1 -DCONFIG_AS_CFI_SIGNAL_FRAME=1 -Iinclude/asm-i386/mach-default -fomit-frame-pointer -g -fno-stack-protector -Wdeclaration-after-statement -Wno-pointer-sign -DIRCTL_DEV_MAJOR=61 -DEXPORT_SYMTAB -DHAVE_CONFIG_H -I. -I../.. -I/usr/src/modules/lirc/drivers/lirc_gpio/../.. -I/lib/modules/2.6.20-15-generic/build/include/ -I/lib/modules/2.6.20-15-generic/build/drivers/media/video/ -DMODULE -D"KBUILD_STR(s)=#s" -D"KBUILD_BASENAME=KBUILD_STR(lirc_gpio)" -D"KBUILD_MODNAME=KBUILD_STR(lirc_gpio)" -c -o /usr/src/modules/lirc/drivers/lirc_gpio/.tmp_lirc_gpio.o /usr/src/modules/lirc/drivers/lirc_gpio/lirc_gpio.c
/usr/src/modules/lirc/drivers/lirc_gpio/lirc_gpio.c:91:1: warning: "dprintk" redefined
In file included from /usr/src/modules/lirc/drivers/lirc_gpio/lirc_gpio.c:62:
/usr/src/modules/lirc/drivers/lirc_gpio/extra_2.6.20/bttvp.h:232:1: warning: this is the location of the previous definition
Building modules, stage 2.
/usr/bin/make -f /usr/src/linux-headers-2.6.20-15-generic/scripts/Makefile.modpost
scripts/mod/modpost -m -a -i /usr/src/linux-headers-2.6.20-15-generic/Module.symvers -I /usr/src/modules/lirc/drivers/lirc_gpio/Module.symvers -o /usr/src/modules/lirc/drivers/lirc_gpio/Module.symvers -w /usr/src/modules/lirc/drivers/lirc_gpio/lirc_gpio.o
WARNING: "lirc_register_plugin" [/usr/src/modules/lirc/drivers/lirc_gpio/lirc_gpio.ko] undefined!
WARNING: "lirc_unregister_plugin" [/usr/src/modules/lirc/drivers/lirc_gpio/lirc_gpio.ko] undefined!
gcc -m32 -Wp,-MD,/usr/src/modules/lirc/drivers/lirc_gpio/.lirc_gpio.mod.o.d -nostdinc -isystem /usr/lib/gcc/i486-linux-gnu/4.1.2/include -D__KERNEL__ -Iinclude -include include/linux/autoconf.h -Iubuntu/include -Wall -Wundef -Wstrict-prototypes -Wno-trigraphs -fno-strict-aliasing -fno-common -O2 -pipe -msoft-float -mregparm=3 -mpreferred-stack-boundary=2 -march=i586 -mtune=generic -ffreestanding -maccumulate-outgoing-args -DCONFIG_AS_CFI=1 -DCONFIG_AS_CFI_SIGNAL_FRAME=1 -Iinclude/asm-i386/mach-default -fomit-frame-pointer -g -fno-stack-protector -Wdeclaration-after-statement -Wno-pointer-sign -D"KBUILD_STR(s)=#s" -D"KBUILD_BASENAME=KBUILD_STR(lirc_gpio.mod)" -D"KBUILD_MODNAME=KBUILD_STR(lirc_gpio)" -DMODULE -c -o /usr/src/modules/lirc/drivers/lirc_gpio/lirc_gpio.mod.o /usr/src/modules/lirc/drivers/lirc_gpio/lirc_gpio.mod.c
ld -m elf_i386 -m elf_i386 -r -o /usr/src/modules/lirc/drivers/lirc_gpio/lirc_gpio.ko /usr/src/modules/lirc/drivers/lirc_gpio/lirc_gpio.o /usr/src/modules/lirc/drivers/lirc_gpio/lirc_gpio.mod.o
make[9]: Leaving directory `/usr/src/linux-headers-2.6.20-15-generic'
mv Makefile.automake Makefile
make[8]: Leaving directory `/usr/src/modules/lirc/drivers/lirc_gpio'
make[8]: Entering directory `/usr/src/modules/lirc/drivers'
make[8]: Nothing to be done for `all-am'.
make[8]: Leaving directory `/usr/src/modules/lirc/drivers'
make[7]: Leaving directory `/usr/src/modules/lirc/drivers'
cp drivers/lirc_gpio/lirc_gpio.ko modules
/usr/bin/make -C drivers SUBDIRS="lirc_i2c"
make[7]: Entering directory `/usr/src/modules/lirc/drivers'
Making all in lirc_i2c
make[8]: Entering directory `/usr/src/modules/lirc/drivers/lirc_i2c'
mv Makefile Makefile.automake
cp ../Makefile.kernel Makefile
/usr/bin/make -C /lib/modules/2.6.20-15-generic/build SUBDIRS=/usr/src/modules/lirc/drivers/lirc_i2c modules \
KBUILD_VERBOSE=1
make[9]: Entering directory `/usr/src/linux-headers-2.6.20-15-generic'
test -e include/linux/autoconf.h -a -e include/config/auto.conf || ( \
echo; \
echo " ERROR: Kernel configuration is invalid."; \
echo " include/linux/autoconf.h or include/config/auto.conf are missing."; \
echo " Run 'make oldconfig && make prepare' on kernel src to fix it."; \
echo; \
/bin/false)
mkdir -p /usr/src/modules/lirc/drivers/lirc_i2c/.tmp_versions
rm -f /usr/src/modules/lirc/drivers/lirc_i2c/.tmp_versions/*
/usr/bin/make -f scripts/Makefile.build obj=/usr/src/modules/lirc/drivers/lirc_i2c
gcc -m32 -Wp,-MD,/usr/src/modules/lirc/drivers/lirc_i2c/.lirc_i2c.o.d -nostdinc -isystem /usr/lib/gcc/i486-linux-gnu/4.1.2/include -D__KERNEL__ -Iinclude -include include/linux/autoconf.h -Iubuntu/include -Wall -Wundef -Wstrict-prototypes -Wno-trigraphs -fno-strict-aliasing -fno-common -O2 -pipe -msoft-float -mregparm=3 -mpreferred-stack-boundary=2 -march=i586 -mtune=generic -ffreestanding -maccumulate-outgoing-args -DCONFIG_AS_CFI=1 -DCONFIG_AS_CFI_SIGNAL_FRAME=1 -Iinclude/asm-i386/mach-default -fomit-frame-pointer -g -fno-stack-protector -Wdeclaration-after-statement -Wno-pointer-sign -DIRCTL_DEV_MAJOR=61 -DEXPORT_SYMTAB -DHAVE_CONFIG_H -I. -I../.. -I/usr/src/modules/lirc/drivers/lirc_i2c/../.. -I/lib/modules/2.6.20-15-generic/build/include/ -I/lib/modules/2.6.20-15-generic/build/drivers/media/video/ -DMODULE -D"KBUILD_STR(s)=#s" -D"KBUILD_BASENAME=KBUILD_STR(lirc_i2c)" -D"KBUILD_MODNAME=KBUILD_STR(lirc_i2c)" -c -o /usr/src/modules/lirc/drivers/lirc_i2c/.tmp_lirc_i2c.o /usr/src/modules/lirc/drivers/lirc_i2c/lirc_i2c.c
Building modules, stage 2.
/usr/bin/make -f /usr/src/linux-headers-2.6.20-15-generic/scripts/Makefile.modpost
scripts/mod/modpost -m -a -i /usr/src/linux-headers-2.6.20-15-generic/Module.symvers -I /usr/src/modules/lirc/drivers/lirc_i2c/Module.symvers -o /usr/src/modules/lirc/drivers/lirc_i2c/Module.symvers -w /usr/src/modules/lirc/drivers/lirc_i2c/lirc_i2c.o
WARNING: "lirc_register_plugin" [/usr/src/modules/lirc/drivers/lirc_i2c/lirc_i2c.ko] undefined!
WARNING: "lirc_unregister_plugin" [/usr/src/modules/lirc/drivers/lirc_i2c/lirc_i2c.ko] undefined!
gcc -m32 -Wp,-MD,/usr/src/modules/lirc/drivers/lirc_i2c/.lirc_i2c.mod.o.d -nostdinc -isystem /usr/lib/gcc/i486-linux-gnu/4.1.2/include -D__KERNEL__ -Iinclude -include include/linux/autoconf.h -Iubuntu/include -Wall -Wundef -Wstrict-prototypes -Wno-trigraphs -fno-strict-aliasing -fno-common -O2 -pipe -msoft-float -mregparm=3 -mpreferred-stack-boundary=2 -march=i586 -mtune=generic -ffreestanding -maccumulate-outgoing-args -DCONFIG_AS_CFI=1 -DCONFIG_AS_CFI_SIGNAL_FRAME=1 -Iinclude/asm-i386/mach-default -fomit-frame-pointer -g -fno-stack-protector -Wdeclaration-after-statement -Wno-pointer-sign -D"KBUILD_STR(s)=#s" -D"KBUILD_BASENAME=KBUILD_STR(lirc_i2c.mod)" -D"KBUILD_MODNAME=KBUILD_STR(lirc_i2c)" -DMODULE -c -o /usr/src/modules/lirc/drivers/lirc_i2c/lirc_i2c.mod.o /usr/src/modules/lirc/drivers/lirc_i2c/lirc_i2c.mod.c
ld -m elf_i386 -m elf_i386 -r -o /usr/src/modules/lirc/drivers/lirc_i2c/lirc_i2c.ko /usr/src/modules/lirc/drivers/lirc_i2c/lirc_i2c.o /usr/src/modules/lirc/drivers/lirc_i2c/lirc_i2c.mod.o
make[9]: Leaving directory `/usr/src/linux-headers-2.6.20-15-generic'
mv Makefile.automake Makefile
make[8]: Leaving directory `/usr/src/modules/lirc/drivers/lirc_i2c'
make[8]: Entering directory `/usr/src/modules/lirc/drivers'
make[8]: Nothing to be done for `all-am'.
make[8]: Leaving directory `/usr/src/modules/lirc/drivers'
make[7]: Leaving directory `/usr/src/modules/lirc/drivers'
cp drivers/lirc_i2c/lirc_i2c.ko modules
/usr/bin/make -C drivers SUBDIRS="lirc_igorplugusb"
make[7]: Entering directory `/usr/src/modules/lirc/drivers'
Making all in lirc_igorplugusb
make[8]: Entering directory `/usr/src/modules/lirc/drivers/lirc_igorplugusb'
mv Makefile Makefile.automake
cp ../Makefile.kernel Makefile
/usr/bin/make -C /lib/modules/2.6.20-15-generic/build SUBDIRS=/usr/src/modules/lirc/drivers/lirc_igorplugusb modules \
KBUILD_VERBOSE=1
make[9]: Entering directory `/usr/src/linux-headers-2.6.20-15-generic'
test -e include/linux/autoconf.h -a -e include/config/auto.conf || ( \
echo; \
echo " ERROR: Kernel configuration is invalid."; \
echo " include/linux/autoconf.h or include/config/auto.conf are missing."; \
echo " Run 'make oldconfig && make prepare' on kernel src to fix it."; \
echo; \
/bin/false)
mkdir -p /usr/src/modules/lirc/drivers/lirc_igorplugusb/.tmp_versions
rm -f /usr/src/modules/lirc/drivers/lirc_igorplugusb/.tmp_versions/*
/usr/bin/make -f scripts/Makefile.build obj=/usr/src/modules/lirc/drivers/lirc_igorplugusb
gcc -m32 -Wp,-MD,/usr/src/modules/lirc/drivers/lirc_igorplugusb/.lirc_igorplugusb.o.d -nostdinc -isystem /usr/lib/gcc/i486-linux-gnu/4.1.2/include -D__KERNEL__ -Iinclude -include include/linux/autoconf.h -Iubuntu/include -Wall -Wundef -Wstrict-prototypes -Wno-trigraphs -fno-strict-aliasing -fno-common -O2 -pipe -msoft-float -mregparm=3 -mpreferred-stack-boundary=2 -march=i586 -mtune=generic -ffreestanding -maccumulate-outgoing-args -DCONFIG_AS_CFI=1 -DCONFIG_AS_CFI_SIGNAL_FRAME=1 -Iinclude/asm-i386/mach-default -fomit-frame-pointer -g -fno-stack-protector -Wdeclaration-after-statement -Wno-pointer-sign -DIRCTL_DEV_MAJOR=61 -DEXPORT_SYMTAB -DHAVE_CONFIG_H -I. -I../.. -I/usr/src/modules/lirc/drivers/lirc_igorplugusb/../.. -I/lib/modules/2.6.20-15-generic/build/include/ -I/lib/modules/2.6.20-15-generic/build/drivers/media/video/ -DMODULE -D"KBUILD_STR(s)=#s" -D"KBUILD_BASENAME=KBUILD_STR(lirc_igorplugusb)" -D"KBUILD_MODNAME=KBUILD_STR(lirc_igorplugusb)" -c -o /usr/src/modules/lirc/drivers/lirc_igorplugusb/.tmp_lirc_igorplugusb.o /usr/src/modules/lirc/drivers/lirc_igorplugusb/lirc_igorplugusb.c
Building modules, stage 2.
/usr/bin/make -f /usr/src/linux-headers-2.6.20-15-generic/scripts/Makefile.modpost
scripts/mod/modpost -m -a -i /usr/src/linux-headers-2.6.20-15-generic/Module.symvers -I /usr/src/modules/lirc/drivers/lirc_igorplugusb/Module.symvers -o /usr/src/modules/lirc/drivers/lirc_igorplugusb/Module.symvers -w /usr/src/modules/lirc/drivers/lirc_igorplugusb/lirc_igorplugusb.o
WARNING: "lirc_register_plugin" [/usr/src/modules/lirc/drivers/lirc_igorplugusb/lirc_igorplugusb.ko] undefined!
WARNING: "lirc_unregister_plugin" [/usr/src/modules/lirc/drivers/lirc_igorplugusb/lirc_igorplugusb.ko] undefined!
gcc -m32 -Wp,-MD,/usr/src/modules/lirc/drivers/lirc_igorplugusb/.lirc_igorplugusb.mod.o.d -nostdinc -isystem /usr/lib/gcc/i486-linux-gnu/4.1.2/include -D__KERNEL__ -Iinclude -include include/linux/autoconf.h -Iubuntu/include -Wall -Wundef -Wstrict-prototypes -Wno-trigraphs -fno-strict-aliasing -fno-common -O2 -pipe -msoft-float -mregparm=3 -mpreferred-stack-boundary=2 -march=i586 -mtune=generic -ffreestanding -maccumulate-outgoing-args -DCONFIG_AS_CFI=1 -DCONFIG_AS_CFI_SIGNAL_FRAME=1 -Iinclude/asm-i386/mach-default -fomit-frame-pointer -g -fno-stack-protector -Wdeclaration-after-statement -Wno-pointer-sign -D"KBUILD_STR(s)=#s" -D"KBUILD_BASENAME=KBUILD_STR(lirc_igorplugusb.mod)" -D"KBUILD_MODNAME=KBUILD_STR(lirc_igorplugusb)" -DMODULE -c -o /usr/src/modules/lirc/drivers/lirc_igorplugusb/lirc_igorplugusb.mod.o /usr/src/modules/lirc/drivers/lirc_igorplugusb/lirc_igorplugusb.mod.c
ld -m elf_i386 -m elf_i386 -r -o /usr/src/modules/lirc/drivers/lirc_igorplugusb/lirc_igorplugusb.ko /usr/src/modules/lirc/drivers/lirc_igorplugusb/lirc_igorplugusb.o /usr/src/modules/lirc/drivers/lirc_igorplugusb/lirc_igorplugusb.mod.o
make[9]: Leaving directory `/usr/src/linux-headers-2.6.20-15-generic'
mv Makefile.automake Makefile
make[8]: Leaving directory `/usr/src/modules/lirc/drivers/lirc_igorplugusb'
make[8]: Entering directory `/usr/src/modules/lirc/drivers'
make[8]: Nothing to be done for `all-am'.
make[8]: Leaving directory `/usr/src/modules/lirc/drivers'
make[7]: Leaving directory `/usr/src/modules/lirc/drivers'
cp drivers/lirc_igorplugusb/lirc_igorplugusb.ko modules
/usr/bin/make -C drivers SUBDIRS="lirc_imon"
make[7]: Entering directory `/usr/src/modules/lirc/drivers'
Making all in lirc_imon
make[8]: Entering directory `/usr/src/modules/lirc/drivers/lirc_imon'
mv Makefile Makefile.automake
cp ../Makefile.kernel Makefile
/usr/bin/make -C /lib/modules/2.6.20-15-generic/build SUBDIRS=/usr/src/modules/lirc/drivers/lirc_imon modules \
KBUILD_VERBOSE=1
make[9]: Entering directory `/usr/src/linux-headers-2.6.20-15-generic'
test -e include/linux/autoconf.h -a -e include/config/auto.conf || ( \
echo; \
echo " ERROR: Kernel configuration is invalid."; \
echo " include/linux/autoconf.h or include/config/auto.conf are missing."; \
echo " Run 'make oldconfig && make prepare' on kernel src to fix it."; \
echo; \
/bin/false)
mkdir -p /usr/src/modules/lirc/drivers/lirc_imon/.tmp_versions
rm -f /usr/src/modules/lirc/drivers/lirc_imon/.tmp_versions/*
/usr/bin/make -f scripts/Makefile.build obj=/usr/src/modules/lirc/drivers/lirc_imon
gcc -m32 -Wp,-MD,/usr/src/modules/lirc/drivers/lirc_imon/.lirc_imon.o.d -nostdinc -isystem /usr/lib/gcc/i486-linux-gnu/4.1.2/include -D__KERNEL__ -Iinclude -include include/linux/autoconf.h -Iubuntu/include -Wall -Wundef -Wstrict-prototypes -Wno-trigraphs -fno-strict-aliasing -fno-common -O2 -pipe -msoft-float -mregparm=3 -mpreferred-stack-boundary=2 -march=i586 -mtune=generic -ffreestanding -maccumulate-outgoing-args -DCONFIG_AS_CFI=1 -DCONFIG_AS_CFI_SIGNAL_FRAME=1 -Iinclude/asm-i386/mach-default -fomit-frame-pointer -g -fno-stack-protector -Wdeclaration-after-statement -Wno-pointer-sign -DIRCTL_DEV_MAJOR=61 -DEXPORT_SYMTAB -DHAVE_CONFIG_H -I. -I../.. -I/usr/src/modules/lirc/drivers/lirc_imon/../.. -I/lib/modules/2.6.20-15-generic/build/include/ -I/lib/modules/2.6.20-15-generic/build/drivers/media/video/ -DMODULE -D"KBUILD_STR(s)=#s" -D"KBUILD_BASENAME=KBUILD_STR(lirc_imon)" -D"KBUILD_MODNAME=KBUILD_STR(lirc_imon)" -c -o /usr/src/modules/lirc/drivers/lirc_imon/.tmp_lirc_imon.o /usr/src/modules/lirc/drivers/lirc_imon/lirc_imon.c
/usr/src/modules/lirc/drivers/lirc_imon/lirc_imon.c: In function ‘send_packet’:
/usr/src/modules/lirc/drivers/lirc_imon/lirc_imon.c:415: warning: passing argument 6 of ‘usb_fill_int_urb’ from incompatible pointer type
/usr/src/modules/lirc/drivers/lirc_imon/lirc_imon.c: In function ‘ir_open’:
/usr/src/modules/lirc/drivers/lirc_imon/lirc_imon.c:684: warning: passing argument 6 of ‘usb_fill_int_urb’ from incompatible pointer type
Building modules, stage 2.
/usr/bin/make -f /usr/src/linux-headers-2.6.20-15-generic/scripts/Makefile.modpost
scripts/mod/modpost -m -a -i /usr/src/linux-headers-2.6.20-15-generic/Module.symvers -I /usr/src/modules/lirc/drivers/lirc_imon/Module.symvers -o /usr/src/modules/lirc/drivers/lirc_imon/Module.symvers -w /usr/src/modules/lirc/drivers/lirc_imon/lirc_imon.o
WARNING: "lirc_register_plugin" [/usr/src/modules/lirc/drivers/lirc_imon/lirc_imon.ko] undefined!
WARNING: "lirc_unregister_plugin" [/usr/src/modules/lirc/drivers/lirc_imon/lirc_imon.ko] undefined!
gcc -m32 -Wp,-MD,/usr/src/modules/lirc/drivers/lirc_imon/.lirc_imon.mod.o.d -nostdinc -isystem /usr/lib/gcc/i486-linux-gnu/4.1.2/include -D__KERNEL__ -Iinclude -include include/linux/autoconf.h -Iubuntu/include -Wall -Wundef -Wstrict-prototypes -Wno-trigraphs -fno-strict-aliasing -fno-common -O2 -pipe -msoft-float -mregparm=3 -mpreferred-stack-boundary=2 -march=i586 -mtune=generic -ffreestanding -maccumulate-outgoing-args -DCONFIG_AS_CFI=1 -DCONFIG_AS_CFI_SIGNAL_FRAME=1 -Iinclude/asm-i386/mach-default -fomit-frame-pointer -g -fno-stack-protector -Wdeclaration-after-statement -Wno-pointer-sign -D"KBUILD_STR(s)=#s" -D"KBUILD_BASENAME=KBUILD_STR(lirc_imon.mod)" -D"KBUILD_MODNAME=KBUILD_STR(lirc_imon)" -DMODULE -c -o /usr/src/modules/lirc/drivers/lirc_imon/lirc_imon.mod.o /usr/src/modules/lirc/drivers/lirc_imon/lirc_imon.mod.c
ld -m elf_i386 -m elf_i386 -r -o /usr/src/modules/lirc/drivers/lirc_imon/lirc_imon.ko /usr/src/modules/lirc/drivers/lirc_imon/lirc_imon.o /usr/src/modules/lirc/drivers/lirc_imon/lirc_imon.mod.o
make[9]: Leaving directory `/usr/src/linux-headers-2.6.20-15-generic'
mv Makefile.automake Makefile
make[8]: Leaving directory `/usr/src/modules/lirc/drivers/lirc_imon'
make[8]: Entering directory `/usr/src/modules/lirc/drivers'
make[8]: Nothing to be done for `all-am'.
make[8]: Leaving directory `/usr/src/modules/lirc/drivers'
make[7]: Leaving directory `/usr/src/modules/lirc/drivers'
cp drivers/lirc_imon/lirc_imon.ko modules
/usr/bin/make -C drivers SUBDIRS="lirc_it87" DEFS="-DHAVE_CONFIG_H -I. -I../.. "
make[7]: Entering directory `/usr/src/modules/lirc/drivers'
Making all in lirc_it87
make[8]: Entering directory `/usr/src/modules/lirc/drivers/lirc_it87'
mv Makefile Makefile.automake
cp ../Makefile.kernel Makefile
/usr/bin/make -C /lib/modules/2.6.20-15-generic/build SUBDIRS=/usr/src/modules/lirc/drivers/lirc_it87 modules \
KBUILD_VERBOSE=1
make[9]: Entering directory `/usr/src/linux-headers-2.6.20-15-generic'
test -e include/linux/autoconf.h -a -e include/config/auto.conf || ( \
echo; \
echo " ERROR: Kernel configuration is invalid."; \
echo " include/linux/autoconf.h or include/config/auto.conf are missing."; \
echo " Run 'make oldconfig && make prepare' on kernel src to fix it."; \
echo; \
/bin/false)
mkdir -p /usr/src/modules/lirc/drivers/lirc_it87/.tmp_versions
rm -f /usr/src/modules/lirc/drivers/lirc_it87/.tmp_versions/*
/usr/bin/make -f scripts/Makefile.build obj=/usr/src/modules/lirc/drivers/lirc_it87
gcc -m32 -Wp,-MD,/usr/src/modules/lirc/drivers/lirc_it87/.lirc_it87.o.d -nostdinc -isystem /usr/lib/gcc/i486-linux-gnu/4.1.2/include -D__KERNEL__ -Iinclude -include include/linux/autoconf.h -Iubuntu/include -Wall -Wundef -Wstrict-prototypes -Wno-trigraphs -fno-strict-aliasing -fno-common -O2 -pipe -msoft-float -mregparm=3 -mpreferred-stack-boundary=2 -march=i586 -mtune=generic -ffreestanding -maccumulate-outgoing-args -DCONFIG_AS_CFI=1 -DCONFIG_AS_CFI_SIGNAL_FRAME=1 -Iinclude/asm-i386/mach-default -fomit-frame-pointer -g -fno-stack-protector -Wdeclaration-after-statement -Wno-pointer-sign -DIRCTL_DEV_MAJOR=61 -DEXPORT_SYMTAB -DHAVE_CONFIG_H -I. -I../.. -I. -I../.. -I/usr/src/modules/lirc/drivers/lirc_it87/../.. -I/lib/modules/2.6.20-15-generic/build/include/ -I/lib/modules/2.6.20-15-generic/build/drivers/media/video/ -DMODULE -D"KBUILD_STR(s)=#s" -D"KBUILD_BASENAME=KBUILD_STR(lirc_it87)" -D"KBUILD_MODNAME=KBUILD_STR(lirc_it87)" -c -o /usr/src/modules/lirc/drivers/lirc_it87/.tmp_lirc_it87.o /usr/src/modules/lirc/drivers/lirc_it87/lirc_it87.c
/usr/src/modules/lirc/drivers/lirc_it87/lirc_it87.c:387:5: warning: "WE_DONT_USE_LOCAL_OPEN_CLOSE" is not defined
/usr/src/modules/lirc/drivers/lirc_it87/lirc_it87.c:395:5: warning: "WE_DONT_USE_LOCAL_OPEN_CLOSE" is not defined
/usr/src/modules/lirc/drivers/lirc_it87/lirc_it87.c: In function ‘init_port’:
/usr/src/modules/lirc/drivers/lirc_it87/lirc_it87.c:929: warning: passing argument 2 of ‘request_irq’ from incompatible pointer type
Building modules, stage 2.
/usr/bin/make -f /usr/src/linux-headers-2.6.20-15-generic/scripts/Makefile.modpost
scripts/mod/modpost -m -a -i /usr/src/linux-headers-2.6.20-15-generic/Module.symvers -I /usr/src/modules/lirc/drivers/lirc_it87/Module.symvers -o /usr/src/modules/lirc/drivers/lirc_it87/Module.symvers -w /usr/src/modules/lirc/drivers/lirc_it87/lirc_it87.o
WARNING: "lirc_register_plugin" [/usr/src/modules/lirc/drivers/lirc_it87/lirc_it87.ko] undefined!
WARNING: "lirc_unregister_plugin" [/usr/src/modules/lirc/drivers/lirc_it87/lirc_it87.ko] undefined!
gcc -m32 -Wp,-MD,/usr/src/modules/lirc/drivers/lirc_it87/.lirc_it87.mod.o.d -nostdinc -isystem /usr/lib/gcc/i486-linux-gnu/4.1.2/include -D__KERNEL__ -Iinclude -include include/linux/autoconf.h -Iubuntu/include -Wall -Wundef -Wstrict-prototypes -Wno-trigraphs -fno-strict-aliasing -fno-common -O2 -pipe -msoft-float -mregparm=3 -mpreferred-stack-boundary=2 -march=i586 -mtune=generic -ffreestanding -maccumulate-outgoing-args -DCONFIG_AS_CFI=1 -DCONFIG_AS_CFI_SIGNAL_FRAME=1 -Iinclude/asm-i386/mach-default -fomit-frame-pointer -g -fno-stack-protector -Wdeclaration-after-statement -Wno-pointer-sign -D"KBUILD_STR(s)=#s" -D"KBUILD_BASENAME=KBUILD_STR(lirc_it87.mod)" -D"KBUILD_MODNAME=KBUILD_STR(lirc_it87)" -DMODULE -c -o /usr/src/modules/lirc/drivers/lirc_it87/lirc_it87.mod.o /usr/src/modules/lirc/drivers/lirc_it87/lirc_it87.mod.c
ld -m elf_i386 -m elf_i386 -r -o /usr/src/modules/lirc/drivers/lirc_it87/lirc_it87.ko /usr/src/modules/lirc/drivers/lirc_it87/lirc_it87.o /usr/src/modules/lirc/drivers/lirc_it87/lirc_it87.mod.o
make[9]: Leaving directory `/usr/src/linux-headers-2.6.20-15-generic'
mv Makefile.automake Makefile
make[8]: Leaving directory `/usr/src/modules/lirc/drivers/lirc_it87'
make[8]: Entering directory `/usr/src/modules/lirc/drivers'
make[8]: Nothing to be done for `all-am'.
make[8]: Leaving directory `/usr/src/modules/lirc/drivers'
make[7]: Leaving directory `/usr/src/modules/lirc/drivers'
cp drivers/lirc_it87/lirc_it87.ko modules
/usr/bin/make -C drivers SUBDIRS="lirc_mceusb"
make[7]: Entering directory `/usr/src/modules/lirc/drivers'
Making all in lirc_mceusb
make[8]: Entering directory `/usr/src/modules/lirc/drivers/lirc_mceusb'
mv Makefile Makefile.automake
cp ../Makefile.kernel Makefile
/usr/bin/make -C /lib/modules/2.6.20-15-generic/build SUBDIRS=/usr/src/modules/lirc/drivers/lirc_mceusb modules \
KBUILD_VERBOSE=1
make[9]: Entering directory `/usr/src/linux-headers-2.6.20-15-generic'
test -e include/linux/autoconf.h -a -e include/config/auto.conf || ( \
echo; \
echo " ERROR: Kernel configuration is invalid."; \
echo " include/linux/autoconf.h or include/config/auto.conf are missing."; \
echo " Run 'make oldconfig && make prepare' on kernel src to fix it."; \
echo; \
/bin/false)
mkdir -p /usr/src/modules/lirc/drivers/lirc_mceusb/.tmp_versions
rm -f /usr/src/modules/lirc/drivers/lirc_mceusb/.tmp_versions/*
/usr/bin/make -f scripts/Makefile.build obj=/usr/src/modules/lirc/drivers/lirc_mceusb
gcc -m32 -Wp,-MD,/usr/src/modules/lirc/drivers/lirc_mceusb/.lirc_mceusb.o.d -nostdinc -isystem /usr/lib/gcc/i486-linux-gnu/4.1.2/include -D__KERNEL__ -Iinclude -include include/linux/autoconf.h -Iubuntu/include -Wall -Wundef -Wstrict-prototypes -Wno-trigraphs -fno-strict-aliasing -fno-common -O2 -pipe -msoft-float -mregparm=3 -mpreferred-stack-boundary=2 -march=i586 -mtune=generic -ffreestanding -maccumulate-outgoing-args -DCONFIG_AS_CFI=1 -DCONFIG_AS_CFI_SIGNAL_FRAME=1 -Iinclude/asm-i386/mach-default -fomit-frame-pointer -g -fno-stack-protector -Wdeclaration-after-statement -Wno-pointer-sign -DIRCTL_DEV_MAJOR=61 -DEXPORT_SYMTAB -DHAVE_CONFIG_H -I. -I../.. -I/usr/src/modules/lirc/drivers/lirc_mceusb/../.. -I/lib/modules/2.6.20-15-generic/build/include/ -I/lib/modules/2.6.20-15-generic/build/drivers/media/video/ -DMODULE -D"KBUILD_STR(s)=#s" -D"KBUILD_BASENAME=KBUILD_STR(lirc_mceusb)" -D"KBUILD_MODNAME=KBUILD_STR(lirc_mceusb)" -c -o /usr/src/modules/lirc/drivers/lirc_mceusb/.tmp_lirc_mceusb.o /usr/src/modules/lirc/drivers/lirc_mceusb/lirc_mceusb.c
/usr/src/modules/lirc/drivers/lirc_mceusb/lirc_mceusb.c: In function ‘mceusb_probe’:
/usr/src/modules/lirc/drivers/lirc_mceusb/lirc_mceusb.c:811: warning: passing argument 6 of ‘usb_fill_bulk_urb’ from incompatible pointer type
Building modules, stage 2.
/usr/bin/make -f /usr/src/linux-headers-2.6.20-15-generic/scripts/Makefile.modpost
scripts/mod/modpost -m -a -i /usr/src/linux-headers-2.6.20-15-generic/Module.symvers -I /usr/src/modules/lirc/drivers/lirc_mceusb/Module.symvers -o /usr/src/modules/lirc/drivers/lirc_mceusb/Module.symvers -w /usr/src/modules/lirc/drivers/lirc_mceusb/lirc_mceusb.o
WARNING: "lirc_register_plugin" [/usr/src/modules/lirc/drivers/lirc_mceusb/lirc_mceusb.ko] undefined!
WARNING: "lirc_unregister_plugin" [/usr/src/modules/lirc/drivers/lirc_mceusb/lirc_mceusb.ko] undefined!
gcc -m32 -Wp,-MD,/usr/src/modules/lirc/drivers/lirc_mceusb/.lirc_mceusb.mod.o.d -nostdinc -isystem /usr/lib/gcc/i486-linux-gnu/4.1.2/include -D__KERNEL__ -Iinclude -include include/linux/autoconf.h -Iubuntu/include -Wall -Wundef -Wstrict-prototypes -Wno-trigraphs -fno-strict-aliasing -fno-common -O2 -pipe -msoft-float -mregparm=3 -mpreferred-stack-boundary=2 -march=i586 -mtune=generic -ffreestanding -maccumulate-outgoing-args -DCONFIG_AS_CFI=1 -DCONFIG_AS_CFI_SIGNAL_FRAME=1 -Iinclude/asm-i386/mach-default -fomit-frame-pointer -g -fno-stack-protector -Wdeclaration-after-statement -Wno-pointer-sign -D"KBUILD_STR(s)=#s" -D"KBUILD_BASENAME=KBUILD_STR(lirc_mceusb.mod)" -D"KBUILD_MODNAME=KBUILD_STR(lirc_mceusb)" -DMODULE -c -o /usr/src/modules/lirc/drivers/lirc_mceusb/lirc_mceusb.mod.o /usr/src/modules/lirc/drivers/lirc_mceusb/lirc_mceusb.mod.c
ld -m elf_i386 -m elf_i386 -r -o /usr/src/modules/lirc/drivers/lirc_mceusb/lirc_mceusb.ko /usr/src/modules/lirc/drivers/lirc_mceusb/lirc_mceusb.o /usr/src/modules/lirc/drivers/lirc_mceusb/lirc_mceusb.mod.o
make[9]: Leaving directory `/usr/src/linux-headers-2.6.20-15-generic'
mv Makefile.automake Makefile
make[8]: Leaving directory `/usr/src/modules/lirc/drivers/lirc_mceusb'
make[8]: Entering directory `/usr/src/modules/lirc/drivers'
make[8]: Nothing to be done for `all-am'.
make[8]: Leaving directory `/usr/src/modules/lirc/drivers'
make[7]: Leaving directory `/usr/src/modules/lirc/drivers'
cp drivers/lirc_mceusb/lirc_mceusb.ko modules
/usr/bin/make -C drivers SUBDIRS="lirc_mceusb2"
make[7]: Entering directory `/usr/src/modules/lirc/drivers'
Making all in lirc_mceusb2
make[8]: Entering directory `/usr/src/modules/lirc/drivers/lirc_mceusb2'
mv Makefile Makefile.automake
cp ../Makefile.kernel Makefile
/usr/bin/make -C /lib/modules/2.6.20-15-generic/build SUBDIRS=/usr/src/modules/lirc/drivers/lirc_mceusb2 modules \
KBUILD_VERBOSE=1
make[9]: Entering directory `/usr/src/linux-headers-2.6.20-15-generic'
test -e include/linux/autoconf.h -a -e include/config/auto.conf || ( \
echo; \
echo " ERROR: Kernel configuration is invalid."; \
echo " include/linux/autoconf.h or include/config/auto.conf are missing."; \
echo " Run 'make oldconfig && make prepare' on kernel src to fix it."; \
echo; \
/bin/false)
mkdir -p /usr/src/modules/lirc/drivers/lirc_mceusb2/.tmp_versions
rm -f /usr/src/modules/lirc/drivers/lirc_mceusb2/.tmp_versions/*
/usr/bin/make -f scripts/Makefile.build obj=/usr/src/modules/lirc/drivers/lirc_mceusb2
gcc -m32 -Wp,-MD,/usr/src/modules/lirc/drivers/lirc_mceusb2/.lirc_mceusb2.o.d -nostdinc -isystem /usr/lib/gcc/i486-linux-gnu/4.1.2/include -D__KERNEL__ -Iinclude -include include/linux/autoconf.h -Iubuntu/include -Wall -Wundef -Wstrict-prototypes -Wno-trigraphs -fno-strict-aliasing -fno-common -O2 -pipe -msoft-float -mregparm=3 -mpreferred-stack-boundary=2 -march=i586 -mtune=generic -ffreestanding -maccumulate-outgoing-args -DCONFIG_AS_CFI=1 -DCONFIG_AS_CFI_SIGNAL_FRAME=1 -Iinclude/asm-i386/mach-default -fomit-frame-pointer -g -fno-stack-protector -Wdeclaration-after-statement -Wno-pointer-sign -DIRCTL_DEV_MAJOR=61 -DEXPORT_SYMTAB -DHAVE_CONFIG_H -I. -I../.. -I/usr/src/modules/lirc/drivers/lirc_mceusb2/../.. -I/lib/modules/2.6.20-15-generic/build/include/ -I/lib/modules/2.6.20-15-generic/build/drivers/media/video/ -DMODULE -D"KBUILD_STR(s)=#s" -D"KBUILD_BASENAME=KBUILD_STR(lirc_mceusb2)" -D"KBUILD_MODNAME=KBUILD_STR(lirc_mceusb2)" -c -o /usr/src/modules/lirc/drivers/lirc_mceusb2/.tmp_lirc_mceusb2.o /usr/src/modules/lirc/drivers/lirc_mceusb2/lirc_mceusb2.c
/usr/src/modules/lirc/drivers/lirc_mceusb2/lirc_mceusb2.c: In function ‘request_packet_async’:
/usr/src/modules/lirc/drivers/lirc_mceusb2/lirc_mceusb2.c:240: warning: passing argument 6 of ‘usb_fill_int_urb’ from incompatible pointer type
/usr/src/modules/lirc/drivers/lirc_mceusb2/lirc_mceusb2.c:248: warning: passing argument 6 of ‘usb_fill_int_urb’ from incompatible pointer type
/usr/src/modules/lirc/drivers/lirc_mceusb2/lirc_mceusb2.c: In function ‘usb_remote_probe’:
/usr/src/modules/lirc/drivers/lirc_mceusb2/lirc_mceusb2.c:787: warning: passing argument 6 of ‘usb_fill_int_urb’ from incompatible pointer type
Building modules, stage 2.
/usr/bin/make -f /usr/src/linux-headers-2.6.20-15-generic/scripts/Makefile.modpost
scripts/mod/modpost -m -a -i /usr/src/linux-headers-2.6.20-15-generic/Module.symvers -I /usr/src/modules/lirc/drivers/lirc_mceusb2/Module.symvers -o /usr/src/modules/lirc/drivers/lirc_mceusb2/Module.symvers -w /usr/src/modules/lirc/drivers/lirc_mceusb2/lirc_mceusb2.o
WARNING: "lirc_register_plugin" [/usr/src/modules/lirc/drivers/lirc_mceusb2/lirc_mceusb2.ko] undefined!
WARNING: "lirc_unregister_plugin" [/usr/src/modules/lirc/drivers/lirc_mceusb2/lirc_mceusb2.ko] undefined!
WARNING: "lirc_get_pdata" [/usr/src/modules/lirc/drivers/lirc_mceusb2/lirc_mceusb2.ko] undefined!
gcc -m32 -Wp,-MD,/usr/src/modules/lirc/drivers/lirc_mceusb2/.lirc_mceusb2.mod.o.d -nostdinc -isystem /usr/lib/gcc/i486-linux-gnu/4.1.2/include -D__KERNEL__ -Iinclude -include include/linux/autoconf.h -Iubuntu/include -Wall -Wundef -Wstrict-prototypes -Wno-trigraphs -fno-strict-aliasing -fno-common -O2 -pipe -msoft-float -mregparm=3 -mpreferred-stack-boundary=2 -march=i586 -mtune=generic -ffreestanding -maccumulate-outgoing-args -DCONFIG_AS_CFI=1 -DCONFIG_AS_CFI_SIGNAL_FRAME=1 -Iinclude/asm-i386/mach-default -fomit-frame-pointer -g -fno-stack-protector -Wdeclaration-after-statement -Wno-pointer-sign -D"KBUILD_STR(s)=#s" -D"KBUILD_BASENAME=KBUILD_STR(lirc_mceusb2.mod)" -D"KBUILD_MODNAME=KBUILD_STR(lirc_mceusb2)" -DMODULE -c -o /usr/src/modules/lirc/drivers/lirc_mceusb2/lirc_mceusb2.mod.o /usr/src/modules/lirc/drivers/lirc_mceusb2/lirc_mceusb2.mod.c
ld -m elf_i386 -m elf_i386 -r -o /usr/src/modules/lirc/drivers/lirc_mceusb2/lirc_mceusb2.ko /usr/src/modules/lirc/drivers/lirc_mceusb2/lirc_mceusb2.o /usr/src/modules/lirc/drivers/lirc_mceusb2/lirc_mceusb2.mod.o
make[9]: Leaving directory `/usr/src/linux-headers-2.6.20-15-generic'
mv Makefile.automake Makefile
make[8]: Leaving directory `/usr/src/modules/lirc/drivers/lirc_mceusb2'
make[8]: Entering directory `/usr/src/modules/lirc/drivers'
make[8]: Nothing to be done for `all-am'.
make[8]: Leaving directory `/usr/src/modules/lirc/drivers'
make[7]: Leaving directory `/usr/src/modules/lirc/drivers'
cp drivers/lirc_mceusb2/lirc_mceusb2.ko modules
/usr/bin/make -C drivers SUBDIRS="lirc_sasem"
make[7]: Entering directory `/usr/src/modules/lirc/drivers'
Making all in lirc_sasem
make[8]: Entering directory `/usr/src/modules/lirc/drivers/lirc_sasem'
mv Makefile Makefile.automake
cp ../Makefile.kernel Makefile
/usr/bin/make -C /lib/modules/2.6.20-15-generic/build SUBDIRS=/usr/src/modules/lirc/drivers/lirc_sasem modules \
KBUILD_VERBOSE=1
make[9]: Entering directory `/usr/src/linux-headers-2.6.20-15-generic'
test -e include/linux/autoconf.h -a -e include/config/auto.conf || ( \
echo; \
echo " ERROR: Kernel configuration is invalid."; \
echo " include/linux/autoconf.h or include/config/auto.conf are missing."; \
echo " Run 'make oldconfig && make prepare' on kernel src to fix it."; \
echo; \
/bin/false)
mkdir -p /usr/src/modules/lirc/drivers/lirc_sasem/.tmp_versions
rm -f /usr/src/modules/lirc/drivers/lirc_sasem/.tmp_versions/*
/usr/bin/make -f scripts/Makefile.build obj=/usr/src/modules/lirc/drivers/lirc_sasem
gcc -m32 -Wp,-MD,/usr/src/modules/lirc/drivers/lirc_sasem/.lirc_sasem.o.d -nostdinc -isystem /usr/lib/gcc/i486-linux-gnu/4.1.2/include -D__KERNEL__ -Iinclude -include include/linux/autoconf.h -Iubuntu/include -Wall -Wundef -Wstrict-prototypes -Wno-trigraphs -fno-strict-aliasing -fno-common -O2 -pipe -msoft-float -mregparm=3 -mpreferred-stack-boundary=2 -march=i586 -mtune=generic -ffreestanding -maccumulate-outgoing-args -DCONFIG_AS_CFI=1 -DCONFIG_AS_CFI_SIGNAL_FRAME=1 -Iinclude/asm-i386/mach-default -fomit-frame-pointer -g -fno-stack-protector -Wdeclaration-after-statement -Wno-pointer-sign -DIRCTL_DEV_MAJOR=61 -DEXPORT_SYMTAB -DHAVE_CONFIG_H -I. -I../.. -I/usr/src/modules/lirc/drivers/lirc_sasem/../.. -I/lib/modules/2.6.20-15-generic/build/include/ -I/lib/modules/2.6.20-15-generic/build/drivers/media/video/ -DMODULE -D"KBUILD_STR(s)=#s" -D"KBUILD_BASENAME=KBUILD_STR(lirc_sasem)" -D"KBUILD_MODNAME=KBUILD_STR(lirc_sasem)" -c -o /usr/src/modules/lirc/drivers/lirc_sasem/.tmp_lirc_sasem.o /usr/src/modules/lirc/drivers/lirc_sasem/lirc_sasem.c
/usr/src/modules/lirc/drivers/lirc_sasem/lirc_sasem.c: In function ‘send_packet’:
/usr/src/modules/lirc/drivers/lirc_sasem/lirc_sasem.c:419: warning: passing argument 6 of ‘usb_fill_int_urb’ from incompatible pointer type
/usr/src/modules/lirc/drivers/lirc_sasem/lirc_sasem.c: In function ‘ir_open’:
/usr/src/modules/lirc/drivers/lirc_sasem/lirc_sasem.c:565: warning: passing argument 6 of ‘usb_fill_int_urb’ from incompatible pointer type
Building modules, stage 2.
/usr/bin/make -f /usr/src/linux-headers-2.6.20-15-generic/scripts/Makefile.modpost
scripts/mod/modpost -m -a -i /usr/src/linux-headers-2.6.20-15-generic/Module.symvers -I /usr/src/modules/lirc/drivers/lirc_sasem/Module.symvers -o /usr/src/modules/lirc/drivers/lirc_sasem/Module.symvers -w /usr/src/modules/lirc/drivers/lirc_sasem/lirc_sasem.o
WARNING: "lirc_register_plugin" [/usr/src/modules/lirc/drivers/lirc_sasem/lirc_sasem.ko] undefined!
WARNING: "lirc_unregister_plugin" [/usr/src/modules/lirc/drivers/lirc_sasem/lirc_sasem.ko] undefined!
gcc -m32 -Wp,-MD,/usr/src/modules/lirc/drivers/lirc_sasem/.lirc_sasem.mod.o.d -nostdinc -isystem /usr/lib/gcc/i486-linux-gnu/4.1.2/include -D__KERNEL__ -Iinclude -include include/linux/autoconf.h -Iubuntu/include -Wall -Wundef -Wstrict-prototypes -Wno-trigraphs -fno-strict-aliasing -fno-common -O2 -pipe -msoft-float -mregparm=3 -mpreferred-stack-boundary=2 -march=i586 -mtune=generic -ffreestanding -maccumulate-outgoing-args -DCONFIG_AS_CFI=1 -DCONFIG_AS_CFI_SIGNAL_FRAME=1 -Iinclude/asm-i386/mach-default -fomit-frame-pointer -g -fno-stack-protector -Wdeclaration-after-statement -Wno-pointer-sign -D"KBUILD_STR(s)=#s" -D"KBUILD_BASENAME=KBUILD_STR(lirc_sasem.mod)" -D"KBUILD_MODNAME=KBUILD_STR(lirc_sasem)" -DMODULE -c -o /usr/src/modules/lirc/drivers/lirc_sasem/lirc_sasem.mod.o /usr/src/modules/lirc/drivers/lirc_sasem/lirc_sasem.mod.c
ld -m elf_i386 -m elf_i386 -r -o /usr/src/modules/lirc/drivers/lirc_sasem/lirc_sasem.ko /usr/src/modules/lirc/drivers/lirc_sasem/lirc_sasem.o /usr/src/modules/lirc/drivers/lirc_sasem/lirc_sasem.mod.o
make[9]: Leaving directory `/usr/src/linux-headers-2.6.20-15-generic'
mv Makefile.automake Makefile
make[8]: Leaving directory `/usr/src/modules/lirc/drivers/lirc_sasem'
make[8]: Entering directory `/usr/src/modules/lirc/drivers'
make[8]: Nothing to be done for `all-am'.
make[8]: Leaving directory `/usr/src/modules/lirc/drivers'
make[7]: Leaving directory `/usr/src/modules/lirc/drivers'
cp drivers/lirc_sasem/lirc_sasem.ko modules
/usr/bin/make -C drivers SUBDIRS="lirc_serial" DEFS="-DHAVE_CONFIG_H -I. -I../.. -DLIRC_SERIAL_TRANSMITTER -DLIRC_PORT=0x2f8 -DLIRC_IRQ=3 "
make[7]: Entering directory `/usr/src/modules/lirc/drivers'
Making all in lirc_serial
make[8]: Entering directory `/usr/src/modules/lirc/drivers/lirc_serial'
mv Makefile Makefile.automake
cp ../Makefile.kernel Makefile
/usr/bin/make -C /lib/modules/2.6.20-15-generic/build SUBDIRS=/usr/src/modules/lirc/drivers/lirc_serial modules \
KBUILD_VERBOSE=1
make[9]: Entering directory `/usr/src/linux-headers-2.6.20-15-generic'
test -e include/linux/autoconf.h -a -e include/config/auto.conf || ( \
echo; \
echo " ERROR: Kernel configuration is invalid."; \
echo " include/linux/autoconf.h or include/config/auto.conf are missing."; \
echo " Run 'make oldconfig && make prepare' on kernel src to fix it."; \
echo; \
/bin/false)
mkdir -p /usr/src/modules/lirc/drivers/lirc_serial/.tmp_versions
rm -f /usr/src/modules/lirc/drivers/lirc_serial/.tmp_versions/*
/usr/bin/make -f scripts/Makefile.build obj=/usr/src/modules/lirc/drivers/lirc_serial
gcc -m32 -Wp,-MD,/usr/src/modules/lirc/drivers/lirc_serial/.lirc_serial.o.d -nostdinc -isystem /usr/lib/gcc/i486-linux-gnu/4.1.2/include -D__KERNEL__ -Iinclude -include include/linux/autoconf.h -Iubuntu/include -Wall -Wundef -Wstrict-prototypes -Wno-trigraphs -fno-strict-aliasing -fno-common -O2 -pipe -msoft-float -mregparm=3 -mpreferred-stack-boundary=2 -march=i586 -mtune=generic -ffreestanding -maccumulate-outgoing-args -DCONFIG_AS_CFI=1 -DCONFIG_AS_CFI_SIGNAL_FRAME=1 -Iinclude/asm-i386/mach-default -fomit-frame-pointer -g -fno-stack-protector -Wdeclaration-after-statement -Wno-pointer-sign -DIRCTL_DEV_MAJOR=61 -DEXPORT_SYMTAB -DHAVE_CONFIG_H -I. -I../.. -DLIRC_SERIAL_TRANSMITTER -DLIRC_PORT=0x2f8 -DLIRC_IRQ=3 -I. -I../.. -I/usr/src/modules/lirc/drivers/lirc_serial/../.. -I/lib/modules/2.6.20-15-generic/build/include/ -I/lib/modules/2.6.20-15-generic/build/drivers/media/video/ -DMODULE -D"KBUILD_STR(s)=#s" -D"KBUILD_BASENAME=KBUILD_STR(lirc_serial)" -D"KBUILD_MODNAME=KBUILD_STR(lirc_serial)" -c -o /usr/src/modules/lirc/drivers/lirc_serial/.tmp_lirc_serial.o /usr/src/modules/lirc/drivers/lirc_serial/lirc_serial.c
/usr/src/modules/lirc/drivers/lirc_serial/lirc_serial.c:67:2: warning: #warning "******************************************"
/usr/src/modules/lirc/drivers/lirc_serial/lirc_serial.c:68:2: warning: #warning " Your serial port driver is compiled into "
/usr/src/modules/lirc/drivers/lirc_serial/lirc_serial.c:69:2: warning: #warning " the kernel. You will have to release the "
/usr/src/modules/lirc/drivers/lirc_serial/lirc_serial.c:70:2: warning: #warning " port you want to use for LIRC with: "
/usr/src/modules/lirc/drivers/lirc_serial/lirc_serial.c:71:2: warning: #warning " setserial /dev/ttySx uart none "
/usr/src/modules/lirc/drivers/lirc_serial/lirc_serial.c:72:2: warning: #warning "******************************************"
/usr/src/modules/lirc/drivers/lirc_serial/lirc_serial.c:118:2: warning: #warning "Note: using rdtsc instruction"
/usr/src/modules/lirc/drivers/lirc_serial/lirc_serial.c: In function ‘set_use_inc’:
/usr/src/modules/lirc/drivers/lirc_serial/lirc_serial.c:973: warning: passing argument 2 of ‘request_irq’ from incompatible pointer type
Building modules, stage 2.
/usr/bin/make -f /usr/src/linux-headers-2.6.20-15-generic/scripts/Makefile.modpost
scripts/mod/modpost -m -a -i /usr/src/linux-headers-2.6.20-15-generic/Module.symvers -I /usr/src/modules/lirc/drivers/lirc_serial/Module.symvers -o /usr/src/modules/lirc/drivers/lirc_serial/Module.symvers -w /usr/src/modules/lirc/drivers/lirc_serial/lirc_serial.o
WARNING: "lirc_register_plugin" [/usr/src/modules/lirc/drivers/lirc_serial/lirc_serial.ko] undefined!
WARNING: "lirc_unregister_plugin" [/usr/src/modules/lirc/drivers/lirc_serial/lirc_serial.ko] undefined!
gcc -m32 -Wp,-MD,/usr/src/modules/lirc/drivers/lirc_serial/.lirc_serial.mod.o.d -nostdinc -isystem /usr/lib/gcc/i486-linux-gnu/4.1.2/include -D__KERNEL__ -Iinclude -include include/linux/autoconf.h -Iubuntu/include -Wall -Wundef -Wstrict-prototypes -Wno-trigraphs -fno-strict-aliasing -fno-common -O2 -pipe -msoft-float -mregparm=3 -mpreferred-stack-boundary=2 -march=i586 -mtune=generic -ffreestanding -maccumulate-outgoing-args -DCONFIG_AS_CFI=1 -DCONFIG_AS_CFI_SIGNAL_FRAME=1 -Iinclude/asm-i386/mach-default -fomit-frame-pointer -g -fno-stack-protector -Wdeclaration-after-statement -Wno-pointer-sign -D"KBUILD_STR(s)=#s" -D"KBUILD_BASENAME=KBUILD_STR(lirc_serial.mod)" -D"KBUILD_MODNAME=KBUILD_STR(lirc_serial)" -DMODULE -c -o /usr/src/modules/lirc/drivers/lirc_serial/lirc_serial.mod.o /usr/src/modules/lirc/drivers/lirc_serial/lirc_serial.mod.c
ld -m elf_i386 -m elf_i386 -r -o /usr/src/modules/lirc/drivers/lirc_serial/lirc_serial.ko /usr/src/modules/lirc/drivers/lirc_serial/lirc_serial.o /usr/src/modules/lirc/drivers/lirc_serial/lirc_serial.mod.o
make[9]: Leaving directory `/usr/src/linux-headers-2.6.20-15-generic'
mv Makefile.automake Makefile
make[8]: Leaving directory `/usr/src/modules/lirc/drivers/lirc_serial'
make[8]: Entering directory `/usr/src/modules/lirc/drivers'
make[8]: Nothing to be done for `all-am'.
make[8]: Leaving directory `/usr/src/modules/lirc/drivers'
make[7]: Leaving directory `/usr/src/modules/lirc/drivers'
cp drivers/lirc_serial/lirc_serial.ko modules
/usr/bin/make -C drivers SUBDIRS="lirc_sir" DEFS="-DHAVE_CONFIG_H -I. -I../.. -DLIRC_PORT=0x2f8 -DLIRC_IRQ=3 "
make[7]: Entering directory `/usr/src/modules/lirc/drivers'
Making all in lirc_sir
make[8]: Entering directory `/usr/src/modules/lirc/drivers/lirc_sir'
mv Makefile Makefile.automake
cp ../Makefile.kernel Makefile
/usr/bin/make -C /lib/modules/2.6.20-15-generic/build SUBDIRS=/usr/src/modules/lirc/drivers/lirc_sir modules \
KBUILD_VERBOSE=1
make[9]: Entering directory `/usr/src/linux-headers-2.6.20-15-generic'
test -e include/linux/autoconf.h -a -e include/config/auto.conf || ( \
echo; \
echo " ERROR: Kernel configuration is invalid."; \
echo " include/linux/autoconf.h or include/config/auto.conf are missing."; \
echo " Run 'make oldconfig && make prepare' on kernel src to fix it."; \
echo; \
/bin/false)
mkdir -p /usr/src/modules/lirc/drivers/lirc_sir/.tmp_versions
rm -f /usr/src/modules/lirc/drivers/lirc_sir/.tmp_versions/*
/usr/bin/make -f scripts/Makefile.build obj=/usr/src/modules/lirc/drivers/lirc_sir
gcc -m32 -Wp,-MD,/usr/src/modules/lirc/drivers/lirc_sir/.lirc_sir.o.d -nostdinc -isystem /usr/lib/gcc/i486-linux-gnu/4.1.2/include -D__KERNEL__ -Iinclude -include include/linux/autoconf.h -Iubuntu/include -Wall -Wundef -Wstrict-prototypes -Wno-trigraphs -fno-strict-aliasing -fno-common -O2 -pipe -msoft-float -mregparm=3 -mpreferred-stack-boundary=2 -march=i586 -mtune=generic -ffreestanding -maccumulate-outgoing-args -DCONFIG_AS_CFI=1 -DCONFIG_AS_CFI_SIGNAL_FRAME=1 -Iinclude/asm-i386/mach-default -fomit-frame-pointer -g -fno-stack-protector -Wdeclaration-after-statement -Wno-pointer-sign -DIRCTL_DEV_MAJOR=61 -DEXPORT_SYMTAB -DHAVE_CONFIG_H -I. -I../.. -DLIRC_PORT=0x2f8 -DLIRC_IRQ=3 -I. -I../.. -I/usr/src/modules/lirc/drivers/lirc_sir/../.. -I/lib/modules/2.6.20-15-generic/build/include/ -I/lib/modules/2.6.20-15-generic/build/drivers/media/video/ -DMODULE -D"KBUILD_STR(s)=#s" -D"KBUILD_BASENAME=KBUILD_STR(lirc_sir)" -D"KBUILD_MODNAME=KBUILD_STR(lirc_sir)" -c -o /usr/src/modules/lirc/drivers/lirc_sir/.tmp_lirc_sir.o /usr/src/modules/lirc/drivers/lirc_sir/lirc_sir.c
/usr/src/modules/lirc/drivers/lirc_sir/lirc_sir.c:52:2: warning: #warning "******************************************"
/usr/src/modules/lirc/drivers/lirc_sir/lirc_sir.c:53:2: warning: #warning " Your serial port driver is compiled into "
/usr/src/modules/lirc/drivers/lirc_sir/lirc_sir.c:54:2: warning: #warning " the kernel. You will have to release the "
/usr/src/modules/lirc/drivers/lirc_sir/lirc_sir.c:55:2: warning: #warning " port you want to use for LIRC with: "
/usr/src/modules/lirc/drivers/lirc_sir/lirc_sir.c:56:2: warning: #warning " setserial /dev/ttySx uart none "
/usr/src/modules/lirc/drivers/lirc_sir/lirc_sir.c:57:2: warning: #warning "******************************************"
/usr/src/modules/lirc/drivers/lirc_sir/lirc_sir.c:517:5: warning: "WE_DONT_USE_LOCAL_OPEN_CLOSE" is not defined
/usr/src/modules/lirc/drivers/lirc_sir/lirc_sir.c:525:5: warning: "WE_DONT_USE_LOCAL_OPEN_CLOSE" is not defined
/usr/src/modules/lirc/drivers/lirc_sir/lirc_sir.c: In function ‘init_port’:
/usr/src/modules/lirc/drivers/lirc_sir/lirc_sir.c:1047: warning: passing argument 2 of ‘request_irq’ from incompatible pointer type
Building modules, stage 2.
/usr/bin/make -f /usr/src/linux-headers-2.6.20-15-generic/scripts/Makefile.modpost
scripts/mod/modpost -m -a -i /usr/src/linux-headers-2.6.20-15-generic/Module.symvers -I /usr/src/modules/lirc/drivers/lirc_sir/Module.symvers -o /usr/src/modules/lirc/drivers/lirc_sir/Module.symvers -w /usr/src/modules/lirc/drivers/lirc_sir/lirc_sir.o
WARNING: "lirc_register_plugin" [/usr/src/modules/lirc/drivers/lirc_sir/lirc_sir.ko] undefined!
WARNING: "lirc_unregister_plugin" [/usr/src/modules/lirc/drivers/lirc_sir/lirc_sir.ko] undefined!
gcc -m32 -Wp,-MD,/usr/src/modules/lirc/drivers/lirc_sir/.lirc_sir.mod.o.d -nostdinc -isystem /usr/lib/gcc/i486-linux-gnu/4.1.2/include -D__KERNEL__ -Iinclude -include include/linux/autoconf.h -Iubuntu/include -Wall -Wundef -Wstrict-prototypes -Wno-trigraphs -fno-strict-aliasing -fno-common -O2 -pipe -msoft-float -mregparm=3 -mpreferred-stack-boundary=2 -march=i586 -mtune=generic -ffreestanding -maccumulate-outgoing-args -DCONFIG_AS_CFI=1 -DCONFIG_AS_CFI_SIGNAL_FRAME=1 -Iinclude/asm-i386/mach-default -fomit-frame-pointer -g -fno-stack-protector -Wdeclaration-after-statement -Wno-pointer-sign -D"KBUILD_STR(s)=#s" -D"KBUILD_BASENAME=KBUILD_STR(lirc_sir.mod)" -D"KBUILD_MODNAME=KBUILD_STR(lirc_sir)" -DMODULE -c -o /usr/src/modules/lirc/drivers/lirc_sir/lirc_sir.mod.o /usr/src/modules/lirc/drivers/lirc_sir/lirc_sir.mod.c
ld -m elf_i386 -m elf_i386 -r -o /usr/src/modules/lirc/drivers/lirc_sir/lirc_sir.ko /usr/src/modules/lirc/drivers/lirc_sir/lirc_sir.o /usr/src/modules/lirc/drivers/lirc_sir/lirc_sir.mod.o
make[9]: Leaving directory `/usr/src/linux-headers-2.6.20-15-generic'
mv Makefile.automake Makefile
make[8]: Leaving directory `/usr/src/modules/lirc/drivers/lirc_sir'
make[8]: Entering directory `/usr/src/modules/lirc/drivers'
make[8]: Nothing to be done for `all-am'.
make[8]: Leaving directory `/usr/src/modules/lirc/drivers'
make[7]: Leaving directory `/usr/src/modules/lirc/drivers'
cp drivers/lirc_sir/lirc_sir.ko modules
/usr/bin/make -C drivers SUBDIRS="lirc_streamzap"
make[7]: Entering directory `/usr/src/modules/lirc/drivers'
Making all in lirc_streamzap
make[8]: Entering directory `/usr/src/modules/lirc/drivers/lirc_streamzap'
mv Makefile Makefile.automake
cp ../Makefile.kernel Makefile
/usr/bin/make -C /lib/modules/2.6.20-15-generic/build SUBDIRS=/usr/src/modules/lirc/drivers/lirc_streamzap modules \
KBUILD_VERBOSE=1
make[9]: Entering directory `/usr/src/linux-headers-2.6.20-15-generic'
test -e include/linux/autoconf.h -a -e include/config/auto.conf || ( \
echo; \
echo " ERROR: Kernel configuration is invalid."; \
echo " include/linux/autoconf.h or include/config/auto.conf are missing."; \
echo " Run 'make oldconfig && make prepare' on kernel src to fix it."; \
echo; \
/bin/false)
mkdir -p /usr/src/modules/lirc/drivers/lirc_streamzap/.tmp_versions
rm -f /usr/src/modules/lirc/drivers/lirc_streamzap/.tmp_versions/*
/usr/bin/make -f scripts/Makefile.build obj=/usr/src/modules/lirc/drivers/lirc_streamzap
gcc -m32 -Wp,-MD,/usr/src/modules/lirc/drivers/lirc_streamzap/.lirc_streamzap.o.d -nostdinc -isystem /usr/lib/gcc/i486-linux-gnu/4.1.2/include -D__KERNEL__ -Iinclude -include include/linux/autoconf.h -Iubuntu/include -Wall -Wundef -Wstrict-prototypes -Wno-trigraphs -fno-strict-aliasing -fno-common -O2 -pipe -msoft-float -mregparm=3 -mpreferred-stack-boundary=2 -march=i586 -mtune=generic -ffreestanding -maccumulate-outgoing-args -DCONFIG_AS_CFI=1 -DCONFIG_AS_CFI_SIGNAL_FRAME=1 -Iinclude/asm-i386/mach-default -fomit-frame-pointer -g -fno-stack-protector -Wdeclaration-after-statement -Wno-pointer-sign -DIRCTL_DEV_MAJOR=61 -DEXPORT_SYMTAB -DHAVE_CONFIG_H -I. -I../.. -I/usr/src/modules/lirc/drivers/lirc_streamzap/../.. -I/lib/modules/2.6.20-15-generic/build/include/ -I/lib/modules/2.6.20-15-generic/build/drivers/media/video/ -DMODULE -D"KBUILD_STR(s)=#s" -D"KBUILD_BASENAME=KBUILD_STR(lirc_streamzap)" -D"KBUILD_MODNAME=KBUILD_STR(lirc_streamzap)" -c -o /usr/src/modules/lirc/drivers/lirc_streamzap/.tmp_lirc_streamzap.o /usr/src/modules/lirc/drivers/lirc_streamzap/lirc_streamzap.c
/usr/src/modules/lirc/drivers/lirc_streamzap/lirc_streamzap.c: In function ‘streamzap_probe’:
/usr/src/modules/lirc/drivers/lirc_streamzap/lirc_streamzap.c:631: warning: passing argument 6 of ‘usb_fill_int_urb’ from incompatible pointer type
Building modules, stage 2.
/usr/bin/make -f /usr/src/linux-headers-2.6.20-15-generic/scripts/Makefile.modpost
scripts/mod/modpost -m -a -i /usr/src/linux-headers-2.6.20-15-generic/Module.symvers -I /usr/src/modules/lirc/drivers/lirc_streamzap/Module.symvers -o /usr/src/modules/lirc/drivers/lirc_streamzap/Module.symvers -w /usr/src/modules/lirc/drivers/lirc_streamzap/lirc_streamzap.o
WARNING: "lirc_register_plugin" [/usr/src/modules/lirc/drivers/lirc_streamzap/lirc_streamzap.ko] undefined!
WARNING: "lirc_unregister_plugin" [/usr/src/modules/lirc/drivers/lirc_streamzap/lirc_streamzap.ko] undefined!
gcc -m32 -Wp,-MD,/usr/src/modules/lirc/drivers/lirc_streamzap/.lirc_streamzap.mod.o.d -nostdinc -isystem /usr/lib/gcc/i486-linux-gnu/4.1.2/include -D__KERNEL__ -Iinclude -include include/linux/autoconf.h -Iubuntu/include -Wall -Wundef -Wstrict-prototypes -Wno-trigraphs -fno-strict-aliasing -fno-common -O2 -pipe -msoft-float -mregparm=3 -mpreferred-stack-boundary=2 -march=i586 -mtune=generic -ffreestanding -maccumulate-outgoing-args -DCONFIG_AS_CFI=1 -DCONFIG_AS_CFI_SIGNAL_FRAME=1 -Iinclude/asm-i386/mach-default -fomit-frame-pointer -g -fno-stack-protector -Wdeclaration-after-statement -Wno-pointer-sign -D"KBUILD_STR(s)=#s" -D"KBUILD_BASENAME=KBUILD_STR(lirc_streamzap.mod)" -D"KBUILD_MODNAME=KBUILD_STR(lirc_streamzap)" -DMODULE -c -o /usr/src/modules/lirc/drivers/lirc_streamzap/lirc_streamzap.mod.o /usr/src/modules/lirc/drivers/lirc_streamzap/lirc_streamzap.mod.c
ld -m elf_i386 -m elf_i386 -r -o /usr/src/modules/lirc/drivers/lirc_streamzap/lirc_streamzap.ko /usr/src/modules/lirc/drivers/lirc_streamzap/lirc_streamzap.o /usr/src/modules/lirc/drivers/lirc_streamzap/lirc_streamzap.mod.o
make[9]: Leaving directory `/usr/src/linux-headers-2.6.20-15-generic'
mv Makefile.automake Makefile
make[8]: Leaving directory `/usr/src/modules/lirc/drivers/lirc_streamzap'
make[8]: Entering directory `/usr/src/modules/lirc/drivers'
make[8]: Nothing to be done for `all-am'.
make[8]: Leaving directory `/usr/src/modules/lirc/drivers'
make[7]: Leaving directory `/usr/src/modules/lirc/drivers'
cp drivers/lirc_streamzap/lirc_streamzap.ko modules
make[6]: Leaving directory `/usr/src/modules/lirc'
#/usr/bin/docbook-to-man debian/lirc-modules.sgml > lirc-modules.1
touch build-stamp
dh_testdir
dh_testroot
dh_clean -k
dh_installdirs
# Add here commands to install the package into debian/lirc-modules.
/usr/bin/make install prefix=/usr/src/modules/lirc/debian/lirc-modules-2.6.20-15-generic
make[6]: Entering directory `/usr/src/modules/lirc'
`modules/lirc_atiusb.ko' -> `/usr/src/modules/lirc/debian/lirc-modules-2.6.20-15-generic/lib/modules/2.6.20-15-generic/misc/lirc_atiusb.ko'
`modules/lirc_bt829.ko' -> `/usr/src/modules/lirc/debian/lirc-modules-2.6.20-15-generic/lib/modules/2.6.20-15-generic/misc/lirc_bt829.ko'
`modules/lirc_cmdir.ko' -> `/usr/src/modules/lirc/debian/lirc-modules-2.6.20-15-generic/lib/modules/2.6.20-15-generic/misc/lirc_cmdir.ko'
`modules/lirc_dev.ko' -> `/usr/src/modules/lirc/debian/lirc-modules-2.6.20-15-generic/lib/modules/2.6.20-15-generic/misc/lirc_dev.ko'
`modules/lirc_gpio.ko' -> `/usr/src/modules/lirc/debian/lirc-modules-2.6.20-15-generic/lib/modules/2.6.20-15-generic/misc/lirc_gpio.ko'
`modules/lirc_i2c.ko' -> `/usr/src/modules/lirc/debian/lirc-modules-2.6.20-15-generic/lib/modules/2.6.20-15-generic/misc/lirc_i2c.ko'
`modules/lirc_igorplugusb.ko' -> `/usr/src/modules/lirc/debian/lirc-modules-2.6.20-15-generic/lib/modules/2.6.20-15-generic/misc/lirc_igorplugusb.ko'
`modules/lirc_imon.ko' -> `/usr/src/modules/lirc/debian/lirc-modules-2.6.20-15-generic/lib/modules/2.6.20-15-generic/misc/lirc_imon.ko'
`modules/lirc_it87.ko' -> `/usr/src/modules/lirc/debian/lirc-modules-2.6.20-15-generic/lib/modules/2.6.20-15-generic/misc/lirc_it87.ko'
`modules/lirc_mceusb2.ko' -> `/usr/src/modules/lirc/debian/lirc-modules-2.6.20-15-generic/lib/modules/2.6.20-15-generic/misc/lirc_mceusb2.ko'
`modules/lirc_mceusb.ko' -> `/usr/src/modules/lirc/debian/lirc-modules-2.6.20-15-generic/lib/modules/2.6.20-15-generic/misc/lirc_mceusb.ko'
`modules/lirc_sasem.ko' -> `/usr/src/modules/lirc/debian/lirc-modules-2.6.20-15-generic/lib/modules/2.6.20-15-generic/misc/lirc_sasem.ko'
`modules/lirc_serial.ko' -> `/usr/src/modules/lirc/debian/lirc-modules-2.6.20-15-generic/lib/modules/2.6.20-15-generic/misc/lirc_serial.ko'
`modules/lirc_sir.ko' -> `/usr/src/modules/lirc/debian/lirc-modules-2.6.20-15-generic/lib/modules/2.6.20-15-generic/misc/lirc_sir.ko'
`modules/lirc_streamzap.ko' -> `/usr/src/modules/lirc/debian/lirc-modules-2.6.20-15-generic/lib/modules/2.6.20-15-generic/misc/lirc_streamzap.ko'
make[6]: Leaving directory `/usr/src/modules/lirc'
dh_testdir
dh_testroot
dh_installdocs
dh_installexamples
dh_installmenu
dh_installmodules
dh_installcron
dh_installman
dh_installinfo
dh_installchangelogs
dh_link
dh_strip
dh_compress
dh_fixperms
dh_installdeb
dh_shlibdeps
dh_gencontrol -- -v0.8.1+cvs20070310-0ubuntu2+2.6.20-15.27
dpkg-gencontrol: warning: unknown substitution variable ${shlibs:Depends}
dpkg-gencontrol: warning: unknown substitution variable ${misc:Depends}
dh_md5sums
dh_builddeb --destdir=/lib/modules/2.6.20-15-generic/build/..
dpkg-deb: building package `lirc-modules-2.6.20-15-generic' in `/lib/modules/2.6.20-15-generic/build/../lirc-modules-2.6.20-15-generic_0.8.1+cvs20070310-0ubuntu2+2.6.20-15.27_i386.deb'.
make[5]: Leaving directory `/usr/src/modules/lirc'
/usr/bin/make -w -f debian/rules clean
make[5]: Entering directory `/usr/src/modules/lirc'
dh_testdir
dh_testroot
rm -f build-stamp configure-stamp
# Add here commands to clean up after the build process.
/usr/bin/make clean
make[6]: Entering directory `/usr/src/modules/lirc'
/usr/bin/make clean -C drivers SUBDIRS="lirc_atiusb lirc_bt829 lirc_cmdir lirc_gpio lirc_i2c lirc_igorplugusb lirc_imon lirc_it87 lirc_mceusb lirc_mceusb2 lirc_parallel lirc_pvr150 lirc_sasem lirc_serial lirc_sir lirc_streamzap"
make[7]: Entering directory `/usr/src/modules/lirc/drivers'
Making clean in lirc_streamzap
make[8]: Entering directory `/usr/src/modules/lirc/drivers/lirc_streamzap'
test -z "lirc_streamzap.o .lirc_streamzap.o.flags lirc_streamzap.mod.c lirc_streamzap.ko *~" || rm -f lirc_streamzap.o .lirc_streamzap.o.flags lirc_streamzap.mod.c lirc_streamzap.ko *~
rm -rf .libs _libs
rm -f *.o
rm -f *.lo
make[8]: Leaving directory `/usr/src/modules/lirc/drivers/lirc_streamzap'
Making clean in lirc_sir
make[8]: Entering directory `/usr/src/modules/lirc/drivers/lirc_sir'
test -z "lirc_sir.o .lirc_sir.o.flags lirc_sir.mod.c lirc_sir.ko *~" || rm -f lirc_sir.o .lirc_sir.o.flags lirc_sir.mod.c lirc_sir.ko *~
rm -rf .libs _libs
rm -f *.o
rm -f *.lo
make[8]: Leaving directory `/usr/src/modules/lirc/drivers/lirc_sir'
Making clean in lirc_serial
make[8]: Entering directory `/usr/src/modules/lirc/drivers/lirc_serial'
test -z "lirc_serial.o .lirc_serial.o.flags lirc_serial.mod.c lirc_serial.ko *~" || rm -f lirc_serial.o .lirc_serial.o.flags lirc_serial.mod.c lirc_serial.ko *~
rm -rf .libs _libs
rm -f *.o
rm -f *.lo
make[8]: Leaving directory `/usr/src/modules/lirc/drivers/lirc_serial'
Making clean in lirc_sasem
make[8]: Entering directory `/usr/src/modules/lirc/drivers/lirc_sasem'
test -z "lirc_sasem.o .lirc_sasem.o.flags lirc_sasem.mod.c lirc_sasem.ko *~" || rm -f lirc_sasem.o .lirc_sasem.o.flags lirc_sasem.mod.c lirc_sasem.ko *~
rm -rf .libs _libs
rm -f *.o
rm -f *.lo
make[8]: Leaving directory `/usr/src/modules/lirc/drivers/lirc_sasem'
Making clean in lirc_pvr150
make[8]: Entering directory `/usr/src/modules/lirc/drivers/lirc_pvr150'
test -z "lirc_pvr150.o .lirc_pvr150.o.flags lirc_pvr150.mod.c lirc_pvr150.ko *~" || rm -f lirc_pvr150.o .lirc_pvr150.o.flags lirc_pvr150.mod.c lirc_pvr150.ko *~
rm -rf .libs _libs
rm -f *.o
rm -f *.lo
make[8]: Leaving directory `/usr/src/modules/lirc/drivers/lirc_pvr150'
Making clean in lirc_parallel
make[8]: Entering directory `/usr/src/modules/lirc/drivers/lirc_parallel'
test -z "lirc_parallel.o .lirc_parallel.o.flags lirc_parallel.mod.c lirc_parallel.ko *~" || rm -f lirc_parallel.o .lirc_parallel.o.flags lirc_parallel.mod.c lirc_parallel.ko *~
rm -rf .libs _libs
rm -f *.o
rm -f *.lo
make[8]: Leaving directory `/usr/src/modules/lirc/drivers/lirc_parallel'
Making clean in lirc_mceusb2
make[8]: Entering directory `/usr/src/modules/lirc/drivers/lirc_mceusb2'
test -z "lirc_mceusb2.o .lirc_mceusb2.o.flags lirc_mceusb2.mod.c lirc_mceusb2.ko *~" || rm -f lirc_mceusb2.o .lirc_mceusb2.o.flags lirc_mceusb2.mod.c lirc_mceusb2.ko *~
rm -rf .libs _libs
rm -f *.o
rm -f *.lo
make[8]: Leaving directory `/usr/src/modules/lirc/drivers/lirc_mceusb2'
Making clean in lirc_mceusb
make[8]: Entering directory `/usr/src/modules/lirc/drivers/lirc_mceusb'
test -z "lirc_mceusb.o .lirc_mceusb.o.flags lirc_mceusb.mod.c lirc_mceusb.ko *~" || rm -f lirc_mceusb.o .lirc_mceusb.o.flags lirc_mceusb.mod.c lirc_mceusb.ko *~
rm -rf .libs _libs
rm -f *.o
rm -f *.lo
make[8]: Leaving directory `/usr/src/modules/lirc/drivers/lirc_mceusb'
Making clean in lirc_it87
make[8]: Entering directory `/usr/src/modules/lirc/drivers/lirc_it87'
test -z "lirc_it87.o .lirc_it87.o.flags lirc_it87.mod.c lirc_it87.ko *~" || rm -f lirc_it87.o .lirc_it87.o.flags lirc_it87.mod.c lirc_it87.ko *~
rm -rf .libs _libs
rm -f *.o
rm -f *.lo
make[8]: Leaving directory `/usr/src/modules/lirc/drivers/lirc_it87'
Making clean in lirc_imon
make[8]: Entering directory `/usr/src/modules/lirc/drivers/lirc_imon'
test -z "lirc_imon.o .lirc_imon.o.flags lirc_imon.mod.c lirc_imon.ko *~" || rm -f lirc_imon.o .lirc_imon.o.flags lirc_imon.mod.c lirc_imon.ko *~
rm -rf .libs _libs
rm -f *.o
rm -f *.lo
make[8]: Leaving directory `/usr/src/modules/lirc/drivers/lirc_imon'
Making clean in lirc_igorplugusb
make[8]: Entering directory `/usr/src/modules/lirc/drivers/lirc_igorplugusb'
test -z "lirc_igorplugusb.o .lirc_igorplugusb.o.flags lirc_igorplugusb.mod.c lirc_igorplugusb.ko *~" || rm -f lirc_igorplugusb.o .lirc_igorplugusb.o.flags lirc_igorplugusb.mod.c lirc_igorplugusb.ko *~
rm -rf .libs _libs
rm -f *.o
rm -f *.lo
make[8]: Leaving directory `/usr/src/modules/lirc/drivers/lirc_igorplugusb'
Making clean in lirc_i2c
make[8]: Entering directory `/usr/src/modules/lirc/drivers/lirc_i2c'
test -z "lirc_i2c.o .lirc_i2c.o.flags lirc_i2c.mod.c lirc_i2c.ko *~" || rm -f lirc_i2c.o .lirc_i2c.o.flags lirc_i2c.mod.c lirc_i2c.ko *~
rm -rf .libs _libs
rm -f *.o
rm -f *.lo
make[8]: Leaving directory `/usr/src/modules/lirc/drivers/lirc_i2c'
Making clean in lirc_gpio
make[8]: Entering directory `/usr/src/modules/lirc/drivers/lirc_gpio'
test -z "lirc_gpio.o .lirc_gpio.o.flags lirc_gpio.mod.c lirc_gpio.ko *~" || rm -f lirc_gpio.o .lirc_gpio.o.flags lirc_gpio.mod.c lirc_gpio.ko *~
rm -rf .libs _libs
rm -f *.o
rm -f *.lo
make[8]: Leaving directory `/usr/src/modules/lirc/drivers/lirc_gpio'
Making clean in lirc_cmdir
make[8]: Entering directory `/usr/src/modules/lirc/drivers/lirc_cmdir'
test -z "lirc_cmdir.o .lirc_cmdir.o.flags lirc_cmdir.mod.c lirc_cmdir.ko *~" || rm -f lirc_cmdir.o .lirc_cmdir.o.flags lirc_cmdir.mod.c lirc_cmdir.ko *~
rm -rf .libs _libs
rm -f *.o
rm -f *.lo
make[8]: Leaving directory `/usr/src/modules/lirc/drivers/lirc_cmdir'
Making clean in lirc_bt829
make[8]: Entering directory `/usr/src/modules/lirc/drivers/lirc_bt829'
test -z "lirc_bt829.o .lirc_bt829.o.flags lirc_bt829.mod.c lirc_bt829.ko *~" || rm -f lirc_bt829.o .lirc_bt829.o.flags lirc_bt829.mod.c lirc_bt829.ko *~
rm -rf .libs _libs
rm -f *.o
rm -f *.lo
make[8]: Leaving directory `/usr/src/modules/lirc/drivers/lirc_bt829'
Making clean in lirc_atiusb
make[8]: Entering directory `/usr/src/modules/lirc/drivers/lirc_atiusb'
test -z "lirc_atiusb.o .lirc_atiusb.o.flags lirc_atiusb.mod.c lirc_atiusb.ko *~" || rm -f lirc_atiusb.o .lirc_atiusb.o.flags lirc_atiusb.mod.c lirc_atiusb.ko *~
rm -rf .libs _libs
rm -f *.o
rm -f *.lo
make[8]: Leaving directory `/usr/src/modules/lirc/drivers/lirc_atiusb'
Making clean in .
make[8]: Entering directory `/usr/src/modules/lirc/drivers'
test -z "*~" || rm -f *~
rm -rf .libs _libs
rm -f *.lo
make[8]: Leaving directory `/usr/src/modules/lirc/drivers'
make[7]: Leaving directory `/usr/src/modules/lirc/drivers'
rm -rf modules
make[6]: Leaving directory `/usr/src/modules/lirc'
dh_clean
rm -f debian/control
make[5]: Leaving directory `/usr/src/modules/lirc'
make[4]: Leaving directory `/usr/src/modules/lirc'
make[3]: Leaving directory `/home/src/charon-merge'
make tee-pluto xine-lib mplayer lirc_app ivtv_firmware lshwd mtx mce-launcher mce-installer linux-dummy-image
make[3]: Entering directory `/home/src/charon-merge'
Package: ivtv-firmware
Package: linux-image-dummy
dpkg-deb: failed to open package info file `./DEBIAN/control' for reading: No such file or directory
make[3]: Leaving directory `/home/src/charon-merge'
cd /home/src/charon-merge/src/pluto_main ; make -f Makefile.no-wrapper ; cd /home/src/charon-merge
make[3]: Entering directory `/home/src/charon-merge/src/pluto_main'
g++ -c -I.. -I../.. -I../DCE -D_FILE_OFFSET_BITS=64 -D_LARGEFILE_SOURCE -DMULTI_THREADED -DNO_SQL_THREAD_LOG -I/usr/include/mysql -pipe -Wall -O2 -D_GNU_SOURCE -fPIC -g -ggdb3 Database_pluto_main.cpp -o Database_pluto_main.o
In file included from ../db_wrapper/db_wrapper.h:112,
from ../PlutoUtils/DBHelper.h:23,
from Database_pluto_main.h:3,
from Database_pluto_main.cpp:13:
../db_wrapper/db_wrapper_mysql.h:7:25: error: mysql/mysql.h: No such file or directory
../PlutoUtils/DBHelper.h:36: error: ISO C++ forbids declaration of ‘MYSQL_RES’ with no type
../PlutoUtils/DBHelper.h:36: error: expected ‘;’ before ‘*’ token
../PlutoUtils/DBHelper.h: In constructor ‘PlutoSqlResult::PlutoSqlResult()’:
../PlutoUtils/DBHelper.h:37: error: class ‘PlutoSqlResult’ does not have any field named ‘r’
../PlutoUtils/DBHelper.h: In member function ‘void PlutoSqlResult::ClearResults()’:
../PlutoUtils/DBHelper.h:44: error: ‘r’ was not declared in this scope
../PlutoUtils/DBHelper.h:46: error: ‘mysql_free_result’ was not declared in this scope
../PlutoUtils/DBHelper.h: At global scope:
../PlutoUtils/DBHelper.h:64: error: ISO C++ forbids declaration of ‘MYSQL’ with no type
../PlutoUtils/DBHelper.h:64: error: expected ‘;’ before ‘*’ token
../PlutoUtils/DBHelper.h:164: error: ‘MYSQL’ has not been declared
../PlutoUtils/DBHelper.h:180: error: ISO C++ forbids declaration of ‘MYSQL_RES’ with no type
../PlutoUtils/DBHelper.h:180: error: expected ‘;’ before ‘*’ token
../PlutoUtils/DBHelper.h:225: error: expected `;' before ‘int’
../PlutoUtils/DBHelper.h: In constructor ‘DBHelper::DBHelper()’:
../PlutoUtils/DBHelper.h:74: error: ‘m_pDB’ was not declared in this scope
../PlutoUtils/DBHelper.h: In constructor ‘DBHelper::DBHelper(std::string, std::string, std::string, std::string, int)’:
../PlutoUtils/DBHelper.h:97: error: ‘m_pDB’ was not declared in this scope
../PlutoUtils/DBHelper.h: In destructor ‘virtual DBHelper::~DBHelper()’:
../PlutoUtils/DBHelper.h:111: error: ‘m_pDB’ was not declared in this scope
../PlutoUtils/DBHelper.h:112: error: ‘mysql_close’ was not declared in this scope
../PlutoUtils/DBHelper.h:113: error: ‘m_pDB’ was not declared in this scope
../PlutoUtils/DBHelper.h: In member function ‘bool DBHelper::DBConnect(bool)’:
../PlutoUtils/DBHelper.h:133: error: ‘m_pDB’ was not declared in this scope
../PlutoUtils/DBHelper.h:137: error: ‘mysql_close’ was not declared in this scope
../PlutoUtils/DBHelper.h:140: error: ‘m_pDB’ was not declared in this scope
../PlutoUtils/DBHelper.h:142: error: ‘mysql_init’ was not declared in this scope
../PlutoUtils/DBHelper.h:151: error: ‘m_pDB’ was not declared in this scope
../PlutoUtils/DBHelper.h:151: error: ‘mysql_real_connect’ was not declared in this scope
../PlutoUtils/DBHelper.h:154: error: ‘mysql_error’ was not declared in this scope
../PlutoUtils/DBHelper.h: In member function ‘void DBHelper::SetConnection(int*)’:
../PlutoUtils/DBHelper.h:166: error: ‘m_pDB’ was not declared in this scope
../PlutoUtils/DBHelper.h: In member function ‘std::string DBHelper::md5(std::string)’:
../PlutoUtils/DBHelper.h:173: error: ‘MYSQL_ROW’ was not declared in this scope
../PlutoUtils/DBHelper.h:173: error: expected `;' before ‘row’
../PlutoUtils/DBHelper.h:174: error: ‘class PlutoSqlResult’ has no member named ‘r’
../PlutoUtils/DBHelper.h:174: error: ‘db_wrapper_query_result’ was not declared in this scope
../PlutoUtils/DBHelper.h:174: error: ‘row’ was not declared in this scope
../PlutoUtils/DBHelper.h:174: error: ‘class PlutoSqlResult’ has no member named ‘r’
../PlutoUtils/DBHelper.h:174: error: ‘mysql_fetch_row’ was not declared in this scope
../PlutoUtils/DBHelper.h:177: error: ‘row’ was not declared in this scope
../PlutoUtils/DBHelper.h: In member function ‘int DBHelper::threaded_db_wrapper_query(std::string, bool, bool)’:
../PlutoUtils/DBHelper.h:232: error: ‘m_pDB’ was not declared in this scope
../PlutoUtils/DBHelper.h:232: error: ‘mysql_query’ was not declared in this scope
../PlutoUtils/DBHelper.h:237: error: ‘mysql_error’ was not declared in this scope
../PlutoUtils/DBHelper.h:263: error: ‘m_pDB’ was not declared in this scope
../PlutoUtils/DBHelper.h:263: error: ‘mysql_affected_rows’ was not declared in this scope
../PlutoUtils/DBHelper.h: In member function ‘int DBHelper::threaded_db_wrapper_query_withID(std::string, bool)’:
../PlutoUtils/DBHelper.h:273: error: ‘m_pDB’ was not declared in this scope
../PlutoUtils/DBHelper.h:273: error: ‘mysql_query’ was not declared in this scope
../PlutoUtils/DBHelper.h:276: error: ‘mysql_error’ was not declared in this scope
../PlutoUtils/DBHelper.h:302: error: ‘m_pDB’ was not declared in this scope
../PlutoUtils/DBHelper.h:302: error: ‘mysql_insert_id’ was not declared in this scope
make[3]: *** [Database_pluto_main.o] Error 1
make[3]: Leaving directory `/home/src/charon-merge/src/pluto_main'
cd /home/src/charon-merge/src/PlutoUtils ; make -f Makefile.no-wrapper ; cd /home/src/charon-merge
make[3]: Entering directory `/home/src/charon-merge/src/PlutoUtils'
g++ -c -I./ -I../../ -I../ -I../DCE/ -I../../DCE -I../VIPShared/ -I../../VIPShared -D_FILE_OFFSET_BITS=64 -D_LARGEFILE_SOURCE -DUSE_LZO_DATAGRID -I/usr/include/mysql -fPIC -Wall -g -ggdb3 -D_GNU_SOURCE DatabaseUtils.cpp -o DatabaseUtils.o
In file included from ../db_wrapper/db_wrapper.h:112,
from DBHelper.h:23,
from DatabaseUtils.h:27,
from DatabaseUtils.cpp:18:
../db_wrapper/db_wrapper_mysql.h:7:25: error: mysql/mysql.h: No such file or directory
DBHelper.h:36: error: ISO C++ forbids declaration of ‘MYSQL_RES’ with no type
DBHelper.h:36: error: expected ‘;’ before ‘*’ token
DBHelper.h: In constructor ‘PlutoSqlResult::PlutoSqlResult()’:
DBHelper.h:37: error: class ‘PlutoSqlResult’ does not have any field named ‘r’
DBHelper.h: In member function ‘void PlutoSqlResult::ClearResults()’:
DBHelper.h:44: error: ‘r’ was not declared in this scope
DBHelper.h:46: error: ‘mysql_free_result’ was not declared in this scope
DBHelper.h: At global scope:
DBHelper.h:64: error: ISO C++ forbids declaration of ‘MYSQL’ with no type
DBHelper.h:64: error: expected ‘;’ before ‘*’ token
DBHelper.h:164: error: ‘MYSQL’ has not been declared
DBHelper.h:180: error: ISO C++ forbids declaration of ‘MYSQL_RES’ with no type
DBHelper.h:180: error: expected ‘;’ before ‘*’ token
DBHelper.h:225: error: expected `;' before ‘int’
DBHelper.h: In constructor ‘DBHelper::DBHelper()’:
DBHelper.h:74: error: ‘m_pDB’ was not declared in this scope
DBHelper.h: In constructor ‘DBHelper::DBHelper(std::string, std::string, std::string, std::string, int)’:
DBHelper.h:97: error: ‘m_pDB’ was not declared in this scope
DBHelper.h: In destructor ‘virtual DBHelper::~DBHelper()’:
DBHelper.h:111: error: ‘m_pDB’ was not declared in this scope
DBHelper.h:112: error: ‘mysql_close’ was not declared in this scope
DBHelper.h:113: error: ‘m_pDB’ was not declared in this scope
DBHelper.h: In member function ‘bool DBHelper::DBConnect(bool)’:
DBHelper.h:133: error: ‘m_pDB’ was not declared in this scope
DBHelper.h:137: error: ‘mysql_close’ was not declared in this scope
DBHelper.h:140: error: ‘m_pDB’ was not declared in this scope
DBHelper.h:142: error: ‘mysql_init’ was not declared in this scope
DBHelper.h:151: error: ‘m_pDB’ was not declared in this scope
DBHelper.h:151: error: ‘mysql_real_connect’ was not declared in this scope
DBHelper.h:154: error: ‘mysql_error’ was not declared in this scope
DBHelper.h: In member function ‘void DBHelper::SetConnection(int*)’:
DBHelper.h:166: error: ‘m_pDB’ was not declared in this scope
DBHelper.h: In member function ‘std::string DBHelper::md5(std::string)’:
DBHelper.h:173: error: ‘MYSQL_ROW’ was not declared in this scope
DBHelper.h:173: error: expected `;' before ‘row’
DBHelper.h:174: error: ‘class PlutoSqlResult’ has no member named ‘r’
DBHelper.h:174: error: ‘db_wrapper_query_result’ was not declared in this scope
DBHelper.h:174: error: ‘row’ was not declared in this scope
DBHelper.h:174: error: ‘class PlutoSqlResult’ has no member named ‘r’
DBHelper.h:174: error: ‘mysql_fetch_row’ was not declared in this scope
DBHelper.h:177: error: ‘row’ was not declared in this scope
DBHelper.h: In member function ‘int DBHelper::threaded_db_wrapper_query(std::string, bool, bool)’:
DBHelper.h:232: error: ‘m_pDB’ was not declared in this scope
DBHelper.h:232: error: ‘mysql_query’ was not declared in this scope
DBHelper.h:237: error: ‘mysql_error’ was not declared in this scope
DBHelper.h:263: error: ‘m_pDB’ was not declared in this scope
DBHelper.h:263: error: ‘mysql_affected_rows’ was not declared in this scope
DBHelper.h: In member function ‘int DBHelper::threaded_db_wrapper_query_withID(std::string, bool)’:
DBHelper.h:273: error: ‘m_pDB’ was not declared in this scope
DBHelper.h:273: error: ‘mysql_query’ was not declared in this scope
DBHelper.h:276: error: ‘mysql_error’ was not declared in this scope
DBHelper.h:302: error: ‘m_pDB’ was not declared in this scope
DBHelper.h:302: error: ‘mysql_insert_id’ was not declared in this scope
DatabaseUtils.cpp: In function ‘int DatabaseUtils::GetTopMostDevice(DBHelper*, int)’:
DatabaseUtils.cpp:53: error: ‘MYSQL_ROW’ was not declared in this scope
DatabaseUtils.cpp:53: error: expected `;' before ‘row’
DatabaseUtils.cpp:54: error: ‘class PlutoSqlResult’ has no member named ‘r’
DatabaseUtils.cpp:54: error: ‘class DBHelper’ has no member named ‘db_wrapper_query_result’
DatabaseUtils.cpp:54: error: ‘row’ was not declared in this scope
DatabaseUtils.cpp:54: error: ‘class PlutoSqlResult’ has no member named ‘r’
DatabaseUtils.cpp:54: error: ‘mysql_fetch_row’ was not declared in this scope
DatabaseUtils.cpp: In function ‘std::string DatabaseUtils::GetIpOfDevice(DBHelper*, int)’:
DatabaseUtils.cpp:64: error: ‘MYSQL_ROW’ was not declared in this scope
DatabaseUtils.cpp:64: error: expected `;' before ‘row’
DatabaseUtils.cpp:65: error: ‘class PlutoSqlResult’ has no member named ‘r’
DatabaseUtils.cpp:65: error: ‘class DBHelper’ has no member named ‘db_wrapper_query_result’
DatabaseUtils.cpp:65: error: ‘row’ was not declared in this scope
DatabaseUtils.cpp:65: error: ‘class PlutoSqlResult’ has no member named ‘r’
DatabaseUtils.cpp:65: error: ‘mysql_fetch_row’ was not declared in this scope
DatabaseUtils.cpp: In function ‘int DatabaseUtils::GetNumberOfChildDevices(DBHelper*, int)’:
DatabaseUtils.cpp:75: error: ‘MYSQL_ROW’ was not declared in this scope
DatabaseUtils.cpp:75: error: expected `;' before ‘row’
DatabaseUtils.cpp:76: error: ‘class PlutoSqlResult’ has no member named ‘r’
DatabaseUtils.cpp:76: error: ‘class DBHelper’ has no member named ‘db_wrapper_query_result’
DatabaseUtils.cpp:76: error: ‘row’ was not declared in this scope
DatabaseUtils.cpp:76: error: ‘class PlutoSqlResult’ has no member named ‘r’
DatabaseUtils.cpp:76: error: ‘mysql_fetch_row’ was not declared in this scope
DatabaseUtils.cpp: In function ‘int DatabaseUtils::GetDeviceTemplateForDevice(DBHelper*, int)’:
DatabaseUtils.cpp:86: error: ‘MYSQL_ROW’ was not declared in this scope
DatabaseUtils.cpp:86: error: expected `;' before ‘row’
DatabaseUtils.cpp:87: error: ‘class PlutoSqlResult’ has no member named ‘r’
DatabaseUtils.cpp:87: error: ‘class DBHelper’ has no member named ‘db_wrapper_query_result’
DatabaseUtils.cpp:87: error: ‘row’ was not declared in this scope
DatabaseUtils.cpp:87: error: ‘class PlutoSqlResult’ has no member named ‘r’
DatabaseUtils.cpp:87: error: ‘mysql_fetch_row’ was not declared in this scope
DatabaseUtils.cpp: In function ‘void DatabaseUtils::GetUnusedPortsOnAllPCs(DBHelper*, std::vector<std::pair<int, std::basic_string<char, std::char_traits<char>, std::allocator<char> > >, std::allocator<std::pair<int, std::basic_string<char, std::char_traits<char>, std::allocator<char> > > > >&, long int)’:
DatabaseUtils.cpp:107: error: ‘MYSQL_ROW’ was not declared in this scope
DatabaseUtils.cpp:107: error: expected `;' before ‘row’
DatabaseUtils.cpp:108: error: ‘class PlutoSqlResult’ has no member named ‘r’
DatabaseUtils.cpp:108: error: ‘class DBHelper’ has no member named ‘db_wrapper_query_result’
DatabaseUtils.cpp:110: error: ‘row’ was not declared in this scope
DatabaseUtils.cpp:110: error: ‘class PlutoSqlResult’ has no member named ‘r’
DatabaseUtils.cpp:110: error: ‘mysql_fetch_row’ was not declared in this scope
DatabaseUtils.cpp: In function ‘void DatabaseUtils::GetUnusedPortsOnPC(DBHelper*, int, std::vector<std::basic_string<char, std::char_traits<char>, std::allocator<char> >, std::allocator<std::basic_string<char, std::char_traits<char>, std::allocator<char> > > >&)’:
DatabaseUtils.cpp:136: error: ‘MYSQL_ROW’ was not declared in this scope
DatabaseUtils.cpp:136: error: expected `;' before ‘row’
DatabaseUtils.cpp:137: error: ‘class PlutoSqlResult’ has no member named ‘r’
DatabaseUtils.cpp:137: error: ‘class DBHelper’ has no member named ‘db_wrapper_query_result’
DatabaseUtils.cpp:139: error: ‘row’ was not declared in this scope
DatabaseUtils.cpp:139: error: ‘class PlutoSqlResult’ has no member named ‘r’
DatabaseUtils.cpp:139: error: ‘mysql_fetch_row’ was not declared in this scope
DatabaseUtils.cpp:155: error: ‘MYSQL_ROW’ was not declared in this scope
DatabaseUtils.cpp:155: error: expected `;' before ‘row’
DatabaseUtils.cpp:156: error: ‘class PlutoSqlResult’ has no member named ‘r’
DatabaseUtils.cpp:156: error: ‘class DBHelper’ has no member named ‘db_wrapper_query_result’
DatabaseUtils.cpp:158: error: ‘row’ was not declared in this scope
DatabaseUtils.cpp:158: error: ‘class PlutoSqlResult’ has no member named ‘r’
DatabaseUtils.cpp:158: error: ‘mysql_fetch_row’ was not declared in this scope
DatabaseUtils.cpp: In function ‘void DatabaseUtils::SetDeviceData(DBHelper*, int, int, std::string)’:
DatabaseUtils.cpp:179: error: ‘class PlutoSqlResult’ has no member named ‘r’
DatabaseUtils.cpp:179: error: ‘class DBHelper’ has no member named ‘db_wrapper_query_result’
DatabaseUtils.cpp:179: error: ‘class PlutoSqlResult’ has no member named ‘r’
DatabaseUtils.cpp: In function ‘std::string DatabaseUtils::GetDeviceData(DBHelper*, int, int)’:
DatabaseUtils.cpp:196: error: ‘MYSQL_ROW’ was not declared in this scope
DatabaseUtils.cpp:196: error: expected `;' before ‘row’
DatabaseUtils.cpp:197: error: ‘class PlutoSqlResult’ has no member named ‘r’
DatabaseUtils.cpp:197: error: ‘class DBHelper’ has no member named ‘db_wrapper_query_result’
DatabaseUtils.cpp:197: error: ‘row’ was not declared in this scope
DatabaseUtils.cpp:197: error: ‘class PlutoSqlResult’ has no member named ‘r’
DatabaseUtils.cpp:197: error: ‘mysql_fetch_row’ was not declared in this scope
DatabaseUtils.cpp: In function ‘void DatabaseUtils::GetAllDevicesInTree(DBHelper*, int, std::map<int, std::pair<int, int>, std::less<int>, std::allocator<std::pair<const int, std::pair<int, int> > > >&, bool, int, int)’:
DatabaseUtils.cpp:209: error: ‘MYSQL_ROW’ was not declared in this scope
DatabaseUtils.cpp:209: error: expected `;' before ‘row’
DatabaseUtils.cpp:210: error: ‘class PlutoSqlResult’ has no member named ‘r’
DatabaseUtils.cpp:210: error: ‘class DBHelper’ has no member named ‘db_wrapper_query_result’
DatabaseUtils.cpp:210: error: ‘row’ was not declared in this scope
DatabaseUtils.cpp:210: error: ‘class PlutoSqlResult’ has no member named ‘r’
DatabaseUtils.cpp:210: error: ‘mysql_fetch_row’ was not declared in this scope
DatabaseUtils.cpp:217: error: ‘MYSQL_ROW’ was not declared in this scope
DatabaseUtils.cpp:217: error: expected `;' before ‘row’
DatabaseUtils.cpp:218: error: ‘class PlutoSqlResult’ has no member named ‘r’
DatabaseUtils.cpp:218: error: ‘class DBHelper’ has no member named ‘db_wrapper_query_result’
DatabaseUtils.cpp:218: error: ‘row’ was not declared in this scope
DatabaseUtils.cpp:218: error: ‘class PlutoSqlResult’ has no member named ‘r’
DatabaseUtils.cpp:218: error: ‘mysql_fetch_row’ was not declared in this scope
DatabaseUtils.cpp:224: error: ‘MYSQL_ROW’ was not declared in this scope
DatabaseUtils.cpp:224: error: expected `;' before ‘row’
DatabaseUtils.cpp:225: error: ‘class PlutoSqlResult’ has no member named ‘r’
DatabaseUtils.cpp:225: error: ‘class DBHelper’ has no member named ‘db_wrapper_query_result’
DatabaseUtils.cpp:227: error: ‘row’ was not declared in this scope
DatabaseUtils.cpp:227: error: ‘class PlutoSqlResult’ has no member named ‘r’
DatabaseUtils.cpp:227: error: ‘mysql_fetch_row’ was not declared in this scope
DatabaseUtils.cpp: In function ‘std::string DatabaseUtils::GetDescriptionForDevice(DBHelper*, int)’:
DatabaseUtils.cpp:243: error: ‘MYSQL_ROW’ was not declared in this scope
DatabaseUtils.cpp:243: error: expected `;' before ‘row’
DatabaseUtils.cpp:244: error: ‘class PlutoSqlResult’ has no member named ‘r’
DatabaseUtils.cpp:244: error: ‘class DBHelper’ has no member named ‘db_wrapper_query_result’
DatabaseUtils.cpp:244: error: ‘row’ was not declared in this scope
DatabaseUtils.cpp:244: error: ‘class PlutoSqlResult’ has no member named ‘r’
DatabaseUtils.cpp:244: error: ‘mysql_fetch_row’ was not declared in this scope
DatabaseUtils.cpp: In function ‘std::string DatabaseUtils::GetDescriptionFromTable(DBHelper*, std::string, int)’:
DatabaseUtils.cpp:253: error: ‘MYSQL_ROW’ was not declared in this scope
DatabaseUtils.cpp:253: error: expected `;' before ‘row’
DatabaseUtils.cpp:254: error: ‘class PlutoSqlResult’ has no member named ‘r’
DatabaseUtils.cpp:254: error: ‘class DBHelper’ has no member named ‘db_wrapper_query_result’
DatabaseUtils.cpp:254: error: ‘row’ was not declared in this scope
DatabaseUtils.cpp:254: error: ‘class PlutoSqlResult’ has no member named ‘r’
DatabaseUtils.cpp:254: error: ‘mysql_fetch_row’ was not declared in this scope
DatabaseUtils.cpp: In function ‘bool DatabaseUtils::SetDeviceInRoom(DBHelper*, int, int)’:
DatabaseUtils.cpp:269: error: ‘class PlutoSqlResult’ has no member named ‘r’
DatabaseUtils.cpp:269: error: ‘class DBHelper’ has no member named ‘db_wrapper_query_result’
DatabaseUtils.cpp:269: error: ‘class PlutoSqlResult’ has no member named ‘r’
DatabaseUtils.cpp: In function ‘bool DatabaseUtils::AddDeviceToEntertainArea(DBHelper*, int, int)’:
DatabaseUtils.cpp:282: error: ‘class PlutoSqlResult’ has no member named ‘r’
DatabaseUtils.cpp:282: error: ‘class DBHelper’ has no member named ‘db_wrapper_query_result’
DatabaseUtils.cpp:282: error: ‘class PlutoSqlResult’ has no member named ‘r’
DatabaseUtils.cpp: In function ‘bool DatabaseUtils::SetDeviceControlledVia(DBHelper*, int, int)’:
DatabaseUtils.cpp:295: error: ‘class PlutoSqlResult’ has no member named ‘r’
DatabaseUtils.cpp:295: error: ‘class DBHelper’ has no member named ‘db_wrapper_query_result’
DatabaseUtils.cpp:295: error: ‘class PlutoSqlResult’ has no member named ‘r’
DatabaseUtils.cpp: In function ‘int DatabaseUtils::GetCommMethodForDeviceTemplate(DBHelper*, int)’:
DatabaseUtils.cpp:307: error: ‘MYSQL_ROW’ was not declared in this scope
DatabaseUtils.cpp:307: error: expected `;' before ‘row’
DatabaseUtils.cpp:308: error: ‘class PlutoSqlResult’ has no member named ‘r’
DatabaseUtils.cpp:308: error: ‘class DBHelper’ has no member named ‘db_wrapper_query_result’
DatabaseUtils.cpp:308: error: ‘row’ was not declared in this scope
DatabaseUtils.cpp:308: error: ‘class PlutoSqlResult’ has no member named ‘r’
DatabaseUtils.cpp:308: error: ‘mysql_fetch_row’ was not declared in this scope
DatabaseUtils.cpp: In function ‘int DatabaseUtils::FindControlledViaCandidate(DBHelper*, int, int, int, int)’:
DatabaseUtils.cpp:317: error: ‘class PlutoSqlResult’ has no member named ‘r’
DatabaseUtils.cpp:317: error: ‘class DBHelper’ has no member named ‘db_wrapper_query_result’
DatabaseUtils.cpp:317: error: ‘class PlutoSqlResult’ has no member named ‘r’
DatabaseUtils.cpp:331: error: ‘class PlutoSqlResult’ has no member named ‘r’
DatabaseUtils.cpp:331: error: ‘class DBHelper’ has no member named ‘db_wrapper_query_result’
DatabaseUtils.cpp:331: error: ‘class PlutoSqlResult’ has no member named ‘r’
DatabaseUtils.cpp:333: error: ‘MYSQL_ROW’ was not declared in this scope
DatabaseUtils.cpp:333: error: expected `;' before ‘row’
DatabaseUtils.cpp:334: error: ‘row’ was not declared in this scope
DatabaseUtils.cpp:334: error: ‘class PlutoSqlResult’ has no member named ‘r’
DatabaseUtils.cpp:334: error: ‘mysql_fetch_row’ was not declared in this scope
DatabaseUtils.cpp:349: error: ‘class PlutoSqlResult’ has no member named ‘r’
DatabaseUtils.cpp:349: error: ‘class DBHelper’ has no member named ‘db_wrapper_query_result’
DatabaseUtils.cpp:349: error: ‘class PlutoSqlResult’ has no member named ‘r’
DatabaseUtils.cpp: In function ‘int DatabaseUtils::FindControlledViaCandidate(DBHelper*, int, int, int, PlutoSqlResult&)’:
DatabaseUtils.cpp:357: error: ‘MYSQL_ROW’ was not declared in this scope
DatabaseUtils.cpp:357: error: expected `;' before ‘row’
DatabaseUtils.cpp:367: error: ‘row’ was not declared in this scope
DatabaseUtils.cpp:367: error: ‘class PlutoSqlResult’ has no member named ‘r’
DatabaseUtils.cpp:367: error: ‘mysql_fetch_row’ was not declared in this scope
DatabaseUtils.cpp: In function ‘int DatabaseUtils::ViolatesDuplicateRules(DBHelper*, int, int)’:
DatabaseUtils.cpp:396: error: ‘MYSQL_ROW’ was not declared in this scope
DatabaseUtils.cpp:396: error: expected `;' before ‘row’
DatabaseUtils.cpp:397: error: ‘class PlutoSqlResult’ has no member named ‘r’
DatabaseUtils.cpp:397: error: ‘class DBHelper’ has no member named ‘db_wrapper_query_result’
DatabaseUtils.cpp:397: error: ‘row’ was not declared in this scope
DatabaseUtils.cpp:397: error: ‘class PlutoSqlResult’ has no member named ‘r’
DatabaseUtils.cpp:397: error: ‘mysql_fetch_row’ was not declared in this scope
DatabaseUtils.cpp:402: error: ‘class PlutoSqlResult’ has no member named ‘r’
DatabaseUtils.cpp:402: error: ‘class DBHelper’ has no member named ‘db_wrapper_query_result’
DatabaseUtils.cpp:404: error: expected `;' before ‘row’
DatabaseUtils.cpp:405: error: ‘row’ was not declared in this scope
DatabaseUtils.cpp:405: error: ‘class PlutoSqlResult’ has no member named ‘r’
DatabaseUtils.cpp:405: error: ‘mysql_fetch_row’ was not declared in this scope
DatabaseUtils.cpp: In function ‘std::string DatabaseUtils::GetNameForRoom(DBHelper*, int)’:
DatabaseUtils.cpp:421: error: ‘MYSQL_ROW’ was not declared in this scope
DatabaseUtils.cpp:421: error: expected `;' before ‘row’
DatabaseUtils.cpp:422: error: ‘class PlutoSqlResult’ has no member named ‘r’
DatabaseUtils.cpp:422: error: ‘class DBHelper’ has no member named ‘db_wrapper_query_result’
DatabaseUtils.cpp:422: error: ‘row’ was not declared in this scope
DatabaseUtils.cpp:422: error: ‘class PlutoSqlResult’ has no member named ‘r’
DatabaseUtils.cpp:422: error: ‘mysql_fetch_row’ was not declared in this scope
DatabaseUtils.cpp: In function ‘bool DatabaseUtils::AlreadyHasUsers(DBHelper*, int)’:
DatabaseUtils.cpp:434: error: ‘class PlutoSqlResult’ has no member named ‘r’
DatabaseUtils.cpp:434: error: ‘class DBHelper’ has no member named ‘db_wrapper_query_result’
DatabaseUtils.cpp:434: error: ‘class PlutoSqlResult’ has no member named ‘r’
DatabaseUtils.cpp: In function ‘bool DatabaseUtils::AlreadyHasRooms(DBHelper*, int)’:
DatabaseUtils.cpp:445: error: ‘class PlutoSqlResult’ has no member named ‘r’
DatabaseUtils.cpp:445: error: ‘class DBHelper’ has no member named ‘db_wrapper_query_result’
DatabaseUtils.cpp:445: error: ‘class PlutoSqlResult’ has no member named ‘r’
DatabaseUtils.cpp: In function ‘long int DatabaseUtils::GetRoomForDevice(DBHelper*, int)’:
DatabaseUtils.cpp:457: error: ‘MYSQL_ROW’ was not declared in this scope
DatabaseUtils.cpp:457: error: expected `;' before ‘row’
DatabaseUtils.cpp:458: error: ‘class PlutoSqlResult’ has no member named ‘r’
DatabaseUtils.cpp:458: error: ‘class DBHelper’ has no member named ‘db_wrapper_query_result’
DatabaseUtils.cpp:458: error: ‘row’ was not declared in this scope
DatabaseUtils.cpp:458: error: ‘class PlutoSqlResult’ has no member named ‘r’
DatabaseUtils.cpp:458: error: ‘mysql_fetch_row’ was not declared in this scope
DatabaseUtils.cpp: In function ‘long int DatabaseUtils::GetRoomByName(DBHelper*, std::string, int)’:
DatabaseUtils.cpp:471: error: ‘MYSQL_ROW’ was not declared in this scope
DatabaseUtils.cpp:471: error: expected `;' before ‘row’
DatabaseUtils.cpp:472: error: ‘class PlutoSqlResult’ has no member named ‘r’
DatabaseUtils.cpp:472: error: ‘class DBHelper’ has no member named ‘db_wrapper_query_result’
DatabaseUtils.cpp:472: error: ‘row’ was not declared in this scope
DatabaseUtils.cpp:472: error: ‘class PlutoSqlResult’ has no member named ‘r’
DatabaseUtils.cpp:472: error: ‘mysql_fetch_row’ was not declared in this scope
DatabaseUtils.cpp: In function ‘std::string DatabaseUtils::GetDeviceCategoryForDeviceTemplate(DBHelper*, int, bool)’:
DatabaseUtils.cpp:486: error: ‘MYSQL_ROW’ was not declared in this scope
DatabaseUtils.cpp:486: error: expected `;' before ‘row’
DatabaseUtils.cpp:487: error: ‘class PlutoSqlResult’ has no member named ‘r’
DatabaseUtils.cpp:487: error: ‘class DBHelper’ has no member named ‘db_wrapper_query_result’
DatabaseUtils.cpp:487: error: ‘row’ was not declared in this scope
DatabaseUtils.cpp:487: error: ‘class PlutoSqlResult’ has no member named ‘r’
DatabaseUtils.cpp:487: error: ‘mysql_fetch_row’ was not declared in this scope
DatabaseUtils.cpp:497: error: expected `;' before ‘row’
DatabaseUtils.cpp:498: error: ‘class PlutoSqlResult’ has no member named ‘r’
DatabaseUtils.cpp:498: error: ‘class DBHelper’ has no member named ‘db_wrapper_query_result’
DatabaseUtils.cpp:498: error: ‘class PlutoSqlResult’ has no member named ‘r’
DatabaseUtils.cpp: In function ‘bool DatabaseUtils::IsValidControlledVia(DBHelper*, int, int)’:
DatabaseUtils.cpp:519: error: ‘class PlutoSqlResult’ has no member named ‘r’
DatabaseUtils.cpp:519: error: ‘class DBHelper’ has no member named ‘db_wrapper_query_result’
DatabaseUtils.cpp:520: error: ‘class PlutoSqlResult’ has no member named ‘r’
DatabaseUtils.cpp:520: error: ‘class PlutoSqlResult’ has no member named ‘r’
DatabaseUtils.cpp:527: error: ‘class PlutoSqlResult’ has no member named ‘r’
DatabaseUtils.cpp:527: error: ‘class DBHelper’ has no member named ‘db_wrapper_query_result’
DatabaseUtils.cpp:528: error: ‘class PlutoSqlResult’ has no member named ‘r’
DatabaseUtils.cpp:528: error: ‘class PlutoSqlResult’ has no member named ‘r’
DatabaseUtils.cpp: In function ‘bool DatabaseUtils::DeviceIsWithinCategory(DBHelper*, int, int)’:
DatabaseUtils.cpp:539: error: ‘MYSQL_ROW’ was not declared in this scope
DatabaseUtils.cpp:539: error: expected `;' before ‘row’
DatabaseUtils.cpp:540: error: ‘class PlutoSqlResult’ has no member named ‘r’
DatabaseUtils.cpp:540: error: ‘class DBHelper’ has no member named ‘db_wrapper_query_result’
DatabaseUtils.cpp:540: error: ‘row’ was not declared in this scope
DatabaseUtils.cpp:540: error: ‘class PlutoSqlResult’ has no member named ‘r’
DatabaseUtils.cpp:540: error: ‘mysql_fetch_row’ was not declared in this scope
DatabaseUtils.cpp:544: error: ‘row’ was not declared in this scope
DatabaseUtils.cpp:552: error: expected `;' before ‘row’
DatabaseUtils.cpp:553: error: ‘class PlutoSqlResult’ has no member named ‘r’
DatabaseUtils.cpp:553: error: ‘class DBHelper’ has no member named ‘db_wrapper_query_result’
DatabaseUtils.cpp:553: error: ‘class PlutoSqlResult’ has no member named ‘r’
DatabaseUtils.cpp:553: error: ‘mysql_fetch_row’ was not declared in this scope
make[3]: *** [DatabaseUtils.o] Error 1
make[3]: Leaving directory `/home/src/charon-merge/src/PlutoUtils'
cd /home/src/charon-merge/src/SerializeClass ; make -f Makefile.nosnr ; cd /home/src/charon-merge
make[3]: Entering directory `/home/src/charon-merge/src/SerializeClass'
cp libSerializeClass.so ../lib
for dir in ; do cd $dir; make all; cd ..; done
make[3]: Leaving directory `/home/src/charon-merge/src/SerializeClass'
cd /home/src/charon-merge/src/DCE ; make -f Makefile.no-wrapper ; cd /home/src/charon-merge
make[3]: Entering directory `/home/src/charon-merge/src/DCE'
g++ -c -I./ -I../ -I../DCE/ -I../VIPShared/ -D_FILE_OFFSET_BITS=64 -D_LARGEFILE_SOURCE -DUSE_LZO_DATAGRID -D_GNU_SOURCE -DLINK_TO_ROUTER -I/usr/include/mysql -fPIC -Wall -ggdb3 Command_Impl.cpp -o Command_Impl.o
In file included from ../db_wrapper/db_wrapper.h:112,
from ../PlutoUtils/DBHelper.h:23,
from ../pluto_main/Database_pluto_main.h:3,
from ../pluto_main/Table_Device.h:21,
from DeviceData_Router.h:25,
from DCERouter.h:28,
from Command_Impl.cpp:22:
../db_wrapper/db_wrapper_mysql.h:7:25: error: mysql/mysql.h: No such file or directory
../PlutoUtils/DBHelper.h:36: error: ISO C++ forbids declaration of ‘MYSQL_RES’ with no type
../PlutoUtils/DBHelper.h:36: error: expected ‘;’ before ‘*’ token
../PlutoUtils/DBHelper.h: In constructor ‘PlutoSqlResult::PlutoSqlResult()’:
../PlutoUtils/DBHelper.h:37: error: class ‘PlutoSqlResult’ does not have any field named ‘r’
../PlutoUtils/DBHelper.h: In member function ‘void PlutoSqlResult::ClearResults()’:
../PlutoUtils/DBHelper.h:44: error: ‘r’ was not declared in this scope
../PlutoUtils/DBHelper.h:46: error: ‘mysql_free_result’ was not declared in this scope
../PlutoUtils/DBHelper.h: At global scope:
../PlutoUtils/DBHelper.h:64: error: ISO C++ forbids declaration of ‘MYSQL’ with no type
../PlutoUtils/DBHelper.h:64: error: expected ‘;’ before ‘*’ token
../PlutoUtils/DBHelper.h:164: error: ‘MYSQL’ has not been declared
../PlutoUtils/DBHelper.h:180: error: ISO C++ forbids declaration of ‘MYSQL_RES’ with no type
../PlutoUtils/DBHelper.h:180: error: expected ‘;’ before ‘*’ token
../PlutoUtils/DBHelper.h:225: error: expected `;' before ‘int’
../PlutoUtils/DBHelper.h: In constructor ‘DBHelper::DBHelper()’:
../PlutoUtils/DBHelper.h:74: error: ‘m_pDB’ was not declared in this scope
../PlutoUtils/DBHelper.h: In constructor ‘DBHelper::DBHelper(std::string, std::string, std::string, std::string, int)’:
../PlutoUtils/DBHelper.h:97: error: ‘m_pDB’ was not declared in this scope
../PlutoUtils/DBHelper.h: In destructor ‘virtual DBHelper::~DBHelper()’:
../PlutoUtils/DBHelper.h:111: error: ‘m_pDB’ was not declared in this scope
../PlutoUtils/DBHelper.h:112: error: ‘mysql_close’ was not declared in this scope
../PlutoUtils/DBHelper.h:113: error: ‘m_pDB’ was not declared in this scope
../PlutoUtils/DBHelper.h: In member function ‘bool DBHelper::DBConnect(bool)’:
../PlutoUtils/DBHelper.h:133: error: ‘m_pDB’ was not declared in this scope
../PlutoUtils/DBHelper.h:137: error: ‘mysql_close’ was not declared in this scope
../PlutoUtils/DBHelper.h:140: error: ‘m_pDB’ was not declared in this scope
../PlutoUtils/DBHelper.h:142: error: ‘mysql_init’ was not declared in this scope
../PlutoUtils/DBHelper.h:151: error: ‘m_pDB’ was not declared in this scope
../PlutoUtils/DBHelper.h:151: error: ‘mysql_real_connect’ was not declared in this scope
../PlutoUtils/DBHelper.h:154: error: ‘mysql_error’ was not declared in this scope
../PlutoUtils/DBHelper.h: In member function ‘void DBHelper::SetConnection(int*)’:
../PlutoUtils/DBHelper.h:166: error: ‘m_pDB’ was not declared in this scope
../PlutoUtils/DBHelper.h: In member function ‘std::string DBHelper::md5(std::string)’:
../PlutoUtils/DBHelper.h:173: error: ‘MYSQL_ROW’ was not declared in this scope
../PlutoUtils/DBHelper.h:173: error: expected `;' before ‘row’
../PlutoUtils/DBHelper.h:174: error: ‘class PlutoSqlResult’ has no member named ‘r’
../PlutoUtils/DBHelper.h:174: error: ‘db_wrapper_query_result’ was not declared in this scope
../PlutoUtils/DBHelper.h:174: error: ‘row’ was not declared in this scope
../PlutoUtils/DBHelper.h:174: error: ‘class PlutoSqlResult’ has no member named ‘r’
../PlutoUtils/DBHelper.h:174: error: ‘mysql_fetch_row’ was not declared in this scope
../PlutoUtils/DBHelper.h:177: error: ‘row’ was not declared in this scope
../PlutoUtils/DBHelper.h: In member function ‘int DBHelper::threaded_db_wrapper_query(std::string, bool, bool)’:
../PlutoUtils/DBHelper.h:232: error: ‘m_pDB’ was not declared in this scope
../PlutoUtils/DBHelper.h:232: error: ‘mysql_query’ was not declared in this scope
../PlutoUtils/DBHelper.h:237: error: ‘mysql_error’ was not declared in this scope
../PlutoUtils/DBHelper.h:263: error: ‘m_pDB’ was not declared in this scope
../PlutoUtils/DBHelper.h:263: error: ‘mysql_affected_rows’ was not declared in this scope
../PlutoUtils/DBHelper.h: In member function ‘int DBHelper::threaded_db_wrapper_query_withID(std::string, bool)’:
../PlutoUtils/DBHelper.h:273: error: ‘m_pDB’ was not declared in this scope
../PlutoUtils/DBHelper.h:273: error: ‘mysql_query’ was not declared in this scope
../PlutoUtils/DBHelper.h:276: error: ‘mysql_error’ was not declared in this scope
../PlutoUtils/DBHelper.h:302: error: ‘m_pDB’ was not declared in this scope
../PlutoUtils/DBHelper.h:302: error: ‘mysql_insert_id’ was not declared in this scope
make[3]: *** [Command_Impl.o] Error 1
make[3]: Leaving directory `/home/src/charon-merge/src/DCE'
cd /home/src/charon-merge/src/MakeRelease ; make -f Makefile.no-wrapper ; cd /home/src/charon-merge
make[3]: Entering directory `/home/src/charon-merge/src/MakeRelease'
g++ -c -I/usr/local/include -I../DCE -I.. -I. -I/usr/include/mysql -I/usr/include/mysql -pipe -Wall -ggdb3 MakeRelease.cpp -o MakeRelease.o
In file included from ../db_wrapper/db_wrapper.h:112,
from ../PlutoUtils/DBHelper.h:23,
from ../pluto_main/Database_pluto_main.h:3,
from MakeRelease.cpp:25:
../db_wrapper/db_wrapper_mysql.h:7:25: error: mysql/mysql.h: No such file or directory
MakeRelease.cpp:438: warning: ignoring #pragma warning
../PlutoUtils/DBHelper.h:36: error: ISO C++ forbids declaration of ‘MYSQL_RES’ with no type
../PlutoUtils/DBHelper.h:36: error: expected ‘;’ before ‘*’ token
../PlutoUtils/DBHelper.h: In constructor ‘PlutoSqlResult::PlutoSqlResult()’:
../PlutoUtils/DBHelper.h:37: error: class ‘PlutoSqlResult’ does not have any field named ‘r’
../PlutoUtils/DBHelper.h: In member function ‘void PlutoSqlResult::ClearResults()’:
../PlutoUtils/DBHelper.h:44: error: ‘r’ was not declared in this scope
../PlutoUtils/DBHelper.h:46: error: ‘mysql_free_result’ was not declared in this scope
../PlutoUtils/DBHelper.h: At global scope:
../PlutoUtils/DBHelper.h:64: error: ISO C++ forbids declaration of ‘MYSQL’ with no type
../PlutoUtils/DBHelper.h:64: error: expected ‘;’ before ‘*’ token
../PlutoUtils/DBHelper.h:164: error: ‘MYSQL’ has not been declared
../PlutoUtils/DBHelper.h:180: error: ISO C++ forbids declaration of ‘MYSQL_RES’ with no type
../PlutoUtils/DBHelper.h:180: error: expected ‘;’ before ‘*’ token
../PlutoUtils/DBHelper.h:225: error: expected `;' before ‘int’
../PlutoUtils/DBHelper.h: In constructor ‘DBHelper::DBHelper()’:
../PlutoUtils/DBHelper.h:74: error: ‘m_pDB’ was not declared in this scope
../PlutoUtils/DBHelper.h: In constructor ‘DBHelper::DBHelper(std::string, std::string, std::string, std::string, int)’:
../PlutoUtils/DBHelper.h:97: error: ‘m_pDB’ was not declared in this scope
../PlutoUtils/DBHelper.h: In destructor ‘virtual DBHelper::~DBHelper()’:
../PlutoUtils/DBHelper.h:111: error: ‘m_pDB’ was not declared in this scope
../PlutoUtils/DBHelper.h:112: error: ‘mysql_close’ was not declared in this scope
../PlutoUtils/DBHelper.h:113: error: ‘m_pDB’ was not declared in this scope
../PlutoUtils/DBHelper.h: In member function ‘bool DBHelper::DBConnect(bool)’:
../PlutoUtils/DBHelper.h:133: error: ‘m_pDB’ was not declared in this scope
../PlutoUtils/DBHelper.h:137: error: ‘mysql_close’ was not declared in this scope
../PlutoUtils/DBHelper.h:140: error: ‘m_pDB’ was not declared in this scope
../PlutoUtils/DBHelper.h:142: error: ‘mysql_init’ was not declared in this scope
../PlutoUtils/DBHelper.h:151: error: ‘m_pDB’ was not declared in this scope
../PlutoUtils/DBHelper.h:151: error: ‘mysql_real_connect’ was not declared in this scope
../PlutoUtils/DBHelper.h:154: error: ‘mysql_error’ was not declared in this scope
../PlutoUtils/DBHelper.h: In member function ‘void DBHelper::SetConnection(int*)’:
../PlutoUtils/DBHelper.h:166: error: ‘m_pDB’ was not declared in this scope
../PlutoUtils/DBHelper.h: In member function ‘std::string DBHelper::md5(std::string)’:
../PlutoUtils/DBHelper.h:173: error: ‘MYSQL_ROW’ was not declared in this scope
../PlutoUtils/DBHelper.h:173: error: expected `;' before ‘row’
../PlutoUtils/DBHelper.h:174: error: ‘class PlutoSqlResult’ has no member named ‘r’
../PlutoUtils/DBHelper.h:174: error: ‘db_wrapper_query_result’ was not declared in this scope
../PlutoUtils/DBHelper.h:174: error: ‘row’ was not declared in this scope
../PlutoUtils/DBHelper.h:174: error: ‘class PlutoSqlResult’ has no member named ‘r’
../PlutoUtils/DBHelper.h:174: error: ‘mysql_fetch_row’ was not declared in this scope
../PlutoUtils/DBHelper.h:177: error: ‘row’ was not declared in this scope
../PlutoUtils/DBHelper.h: In member function ‘int DBHelper::threaded_db_wrapper_query(std::string, bool, bool)’:
../PlutoUtils/DBHelper.h:232: error: ‘m_pDB’ was not declared in this scope
../PlutoUtils/DBHelper.h:232: error: ‘mysql_query’ was not declared in this scope
../PlutoUtils/DBHelper.h:237: error: ‘mysql_error’ was not declared in this scope
../PlutoUtils/DBHelper.h:263: error: ‘m_pDB’ was not declared in this scope
../PlutoUtils/DBHelper.h:263: error: ‘mysql_affected_rows’ was not declared in this scope
../PlutoUtils/DBHelper.h: In member function ‘int DBHelper::threaded_db_wrapper_query_withID(std::string, bool)’:
../PlutoUtils/DBHelper.h:273: error: ‘m_pDB’ was not declared in this scope
../PlutoUtils/DBHelper.h:273: error: ‘mysql_query’ was not declared in this scope
../PlutoUtils/DBHelper.h:276: error: ‘mysql_error’ was not declared in this scope
../PlutoUtils/DBHelper.h:302: error: ‘m_pDB’ was not declared in this scope
../PlutoUtils/DBHelper.h:302: error: ‘mysql_insert_id’ was not declared in this scope
../DCE/DCEConfig.h: At global scope:
../DCE/DCEConfig.h:59: warning: inline function ‘std::string DCEConfig::ReadString(std::string, std::string)’ used but never defined
make[3]: *** [MakeRelease.o] Error 1
make[3]: Leaving directory `/home/src/charon-merge/src/MakeRelease'
cd /home/src/charon-merge/src/mysql_wrapper ; make ; cd /home/src/charon-merge
make[3]: Entering directory `/home/src/charon-merge/src/mysql_wrapper'
g++ -c -I.. -I. -I/usr/include/mysql -Wall -ggdb3 Main.cpp -o Main.o
Main.cpp:5:25: error: mysql/mysql.h: No such file or directory
Main.cpp: In function ‘int main(int, char**)’:
Main.cpp:84: error: ‘MYSQL’ was not declared in this scope
Main.cpp:84: error: expected `;' before ‘mysql’
Main.cpp:85: error: ‘mysql’ was not declared in this scope
Main.cpp:85: error: ‘mysql_init’ was not declared in this scope
Main.cpp:88: error: ‘MYSQL_RES’ was not declared in this scope
Main.cpp:88: error: template argument 2 is invalid
Main.cpp:88: error: template argument 4 is invalid
Main.cpp:88: error: invalid type in declaration before ‘;’ token
Main.cpp:108: error: ‘mysql_real_connect’ was not declared in this scope
Main.cpp:111: error: ‘mysql_error’ was not declared in this scope
Main.cpp:149: error: ‘mysql_real_query’ was not declared in this scope
Main.cpp:154: error: ‘mysql_error’ was not declared in this scope
Main.cpp:177: error: ‘mysql_query’ was not declared in this scope
Main.cpp:182: error: ‘mysql_error’ was not declared in this scope
Main.cpp:202: error: ‘mysql_real_escape_string’ was not declared in this scope
Main.cpp:220: error: ‘mysql_affected_rows’ was not declared in this scope
Main.cpp:232: error: ‘mysql_field_count’ was not declared in this scope
Main.cpp:244: error: ‘mysql_insert_id’ was not declared in this scope
Main.cpp:256: error: ‘mysql_error’ was not declared in this scope
Main.cpp:268: error: ‘my_result’ was not declared in this scope
Main.cpp:268: error: ‘mysql_store_result’ was not declared in this scope
Main.cpp:277: error: invalid types ‘int[long unsigned int]’ for array subscript
Main.cpp:307: error: ‘MYSQL_RES’ cannot appear in a constant-expression
Main.cpp:307: error: template argument 2 is invalid
Main.cpp:307: error: template argument 4 is invalid
Main.cpp:307: error: expected initializer before ‘i’
Main.cpp:308: error: request for member ‘end’ in ‘my_results’, which is of non-class type ‘int’
Main.cpp:316: error: ‘to_free’ was not declared in this scope
Main.cpp:316: error: base operand of ‘->’ is not a pointer
Main.cpp:317: error: request for member ‘erase’ in ‘my_results’, which is of non-class type ‘int’
Main.cpp:318: error: ‘mysql_free_result’ was not declared in this scope
Main.cpp:350: error: ‘MYSQL_RES’ cannot appear in a constant-expression
Main.cpp:350: error: template argument 2 is invalid
Main.cpp:350: error: template argument 4 is invalid
Main.cpp:350: error: expected initializer before ‘i’
Main.cpp:351: error: request for member ‘end’ in ‘my_results’, which is of non-class type ‘int’
Main.cpp:359: error: ‘MYSQL_ROW’ was not declared in this scope
Main.cpp:359: error: expected `;' before ‘row’
Main.cpp:361: error: ‘row’ was not declared in this scope
Main.cpp:363: error: base operand of ‘->’ is not a pointer
Main.cpp:363: error: ‘mysql_num_fields’ was not declared in this scope
Main.cpp:364: error: base operand of ‘->’ is not a pointer
Main.cpp:364: error: ‘mysql_fetch_lengths’ was not declared in this scope
Main.cpp:436: error: ‘MYSQL_RES’ cannot appear in a constant-expression
Main.cpp:436: error: template argument 2 is invalid
Main.cpp:436: error: template argument 4 is invalid
Main.cpp:436: error: expected initializer before ‘i’
Main.cpp:437: error: request for member ‘end’ in ‘my_results’, which is of non-class type ‘int’
Main.cpp:445: error: base operand of ‘->’ is not a pointer
Main.cpp:445: error: ‘mysql_num_fields’ was not declared in this scope
Main.cpp:446: error: base operand of ‘->’ is not a pointer
Main.cpp:446: error: ‘mysql_fetch_lengths’ was not declared in this scope
Main.cpp:505: error: ‘mysql_close’ was not declared in this scope
make[3]: *** [Main.o] Error 1
make[3]: Leaving directory `/home/src/charon-merge/src/mysql_wrapper'
cp: cannot stat `/home/src/charon-merge/src/lib/libpluto_main.so': No such file or directory
make[2]: *** [/home/src/charon-merge/build/bin/MakeRelease/libpluto_main.so] Error 1
make[2]: Leaving directory `/home/src/charon-merge'
make[1]: *** [create_cdrom] Error 2
make[1]: Leaving directory `/home/src/charon-merge'
make: *** [all] Error 2