make[3]: Leaving directory `/export/home/doof/packages/BUILD/kdesupport'
[ 23%] Built target test_runner
[ 23%] Building CXX object soprano/soprano/CMakeFiles/soprano.dir/sopranopluginfile.o
[ 23%] Building CXX object soprano/soprano/CMakeFiles/soprano.dir/util/extreadwritelock.o
[ 24%] Building CXX object soprano/soprano/CMakeFiles/soprano.dir/util/mutexmodel.o
[ 24%] Building CXX object soprano/soprano/CMakeFiles/soprano.dir/util/mutexstatementiteratorbackend.o
make[3]: Entering directory `/export/home/doof/packages/BUILD/kdesupport'
[ 24%] Building CXX object strigi/src/streams/CMakeFiles/streams.dir/archivereader.o
[ 24%] Building CXX object soprano/soprano/CMakeFiles/soprano.dir/util/mutexnodeiteratorbackend.o
"/opt/foss/include/rw/_pair.h", line 55: Error: In this declaration "second" is of an incomplete type "ArchiveEntryCache::SubEntry".
"/opt/foss/include/rw/_tree.h", line 86: Where: While specializing "std::pair<const std::string, ArchiveEntryCache::SubEntry>".
"/opt/foss/include/rw/_tree.h", line 86: Where: Specialized in __rw::__rw_rb_tree_node<std::allocator<std::pair<const std::string, ArchiveEntryCache::SubEntry>>, std::pair<const std::string, ArchiveEntryCache::SubEntry>, std::string, __rw::__select1st<std::pair<const std::string, ArchiveEntryCache::SubEntry>, std::string>>.
"/opt/foss/include/rw/_tree.h", line 259: Where: Specialized in __rw::__rb_tree<std::string, std::pair<const std::string, ArchiveEntryCache::SubEntry>, __rw::__select1st<std::pair<const std::string, ArchiveEntryCache::SubEntry>, std::string>, std::less<std::string>, std::allocator<std::pair<const std::string, ArchiveEntryCache::SubEntry>>>.
"/opt/foss/include/map", line 86: Where: Specialized in std::map<std::string,ArchiveEntryCache::SubEntry>.
"/export/home/doof/packages/KDE/kdesupport/strigi/src/streams/archivereader.cpp", line 68: Where: Specialized in non-template code.
"/export/home/doof/packages/KDE/kdesupport/strigi/src/streams/archivereader.cpp", line 140: Error: const int is not a structure type.
"/export/home/doof/packages/KDE/kdesupport/strigi/src/streams/archivereader.cpp", line 140: Error: const int is not a structure type.
"/export/home/doof/packages/KDE/kdesupport/strigi/src/streams/archivereader.cpp", line 140: Error: const int is not a structure type.
"/export/home/doof/packages/KDE/kdesupport/strigi/src/streams/archivereader.cpp", line 150: Error: const int is not a structure type.
"/export/home/doof/packages/KDE/kdesupport/strigi/src/streams/archivereader.cpp", line 197: Error: Cannot assign const int* to const ArchiveEntryCache::SubEntry*.
"/export/home/doof/packages/KDE/kdesupport/strigi/src/streams/archivereader.cpp", line 283: Error: Cannot assign int* to ArchiveEntryCache::SubEntry*.
"/export/home/doof/packages/KDE/kdesupport/strigi/src/streams/archivereader.cpp", line 607: Error: const int is not a structure type.
"/export/home/doof/packages/KDE/kdesupport/strigi/src/streams/archivereader.cpp", line 607: Error: Formal argument __x of type const Strigi::EntryInfo& in call to std::vector<Strigi::EntryInfo>::push_back(const Strigi::EntryInfo&) is being passed int.
9 Error(s) detected.
make[3]: *** [strigi/src/streams/CMakeFiles/streams.dir/archivereader.o] Error 9
make[3]: Leaving directory `/export/home/doof/packages/BUILD/kdesupport'
make[2]: *** [strigi/src/streams/CMakeFiles/streams.dir/all] Error 2
make[2]: *** Waiting for unfinished jobs....
[ 24%] Building CXX object soprano/soprano/CMakeFiles/soprano.dir/util/mutexqueryresultiteratorbackend.o
[ 24%] Building CXX object soprano/soprano/CMakeFiles/soprano.dir/util/simplestatementiterator.o
[ 24%] Building CXX object soprano/soprano/CMakeFiles/soprano.dir/util/simplenodeiterator.o
[ 25%] Building CXX object soprano/soprano/CMakeFiles/soprano.dir/util/dummymodel.o
[ 25%] Building CXX object soprano/soprano/CMakeFiles/soprano.dir/util/signalcachemodel.o
[ 25%] Building CXX object soprano/soprano/CMakeFiles/soprano.dir/util/readonlymodel.o
[ 25%] Building CXX object soprano/soprano/CMakeFiles/soprano.dir/util/asyncmodel.o
[ 25%] Building CXX object soprano/soprano/CMakeFiles/soprano.dir/util/asynccommand.o
[ 25%] Building CXX object soprano/soprano/CMakeFiles/soprano.dir/util/asynciteratorbackend.o
Linking CXX shared library libsoprano.so
make[3]: Leaving directory `/export/home/doof/packages/BUILD/kdesupport'
[ 25%] Built target soprano
make[2]: Leaving directory `/export/home/doof/packages/BUILD/kdesupport'
make[1]: *** [all] Error 2
make[1]: Leaving directory `/export/home/doof/packages/BUILD/kdesupport'
gmake: *** [build] Error 2
-bash-3.2$ more ~/kbe/update_svn.sh