/Applications/boson/code/bogl/bogl.cpp: In function 'QStringList boglGetOpenGLExtensions()':
/Applications/boson/code/bogl/bogl.cpp:61: error: 'GL_EXTENSIONS' was not declared in this scope
/Applications/boson/code/bogl/bogl.cpp:61: error: 'bo_glGetString' was not declared in this scope
/Applications/boson/code/bogl/bogl.cpp: In function 'QStringList boglGetGLUExtensions()':
/Applications/boson/code/bogl/bogl.cpp:67: error: 'GLU_EXTENSIONS' was not declared in this scope
/Applications/boson/code/bogl/bogl.cpp:67: error: 'bo_gluGetString' was not declared in this scope
/Applications/boson/code/bogl/bogl.cpp: In function 'unsigned int boglGetOpenGLVersion()':
/Applications/boson/code/bogl/bogl.cpp:74: error: 'GL_VERSION' was not declared in this scope
/Applications/boson/code/bogl/bogl.cpp:74: error: 'bo_glGetString' was not declared in this scope
/Applications/boson/code/bogl/bogl.cpp: In function 'QString boglGetOpenGLVersionString()':
/Applications/boson/code/bogl/bogl.cpp:98: error: 'GL_VERSION' was not declared in this scope
/Applications/boson/code/bogl/bogl.cpp:98: error: 'bo_glGetString' was not declared in this scope
/Applications/boson/code/bogl/bogl.cpp: In function 'QString boglGetOpenGLVendorString()':
/Applications/boson/code/bogl/bogl.cpp:103: error: 'GL_VENDOR' was not declared in this scope
/Applications/boson/code/bogl/bogl.cpp:103: error: 'bo_glGetString' was not declared in this scope
/Applications/boson/code/bogl/bogl.cpp: In function 'QString boglGetOpenGLRendererString()':
/Applications/boson/code/bogl/bogl.cpp:108: error: 'GL_RENDERER' was not declared in this scope
/Applications/boson/code/bogl/bogl.cpp:108: error: 'bo_glGetString' was not declared in this scope
/Applications/boson/code/bogl/bogl.cpp: In function 'QString boglGetGLUVersionString()':
/Applications/boson/code/bogl/bogl.cpp:113: error: 'GLU_VERSION' was not declared in this scope
/Applications/boson/code/bogl/bogl.cpp:113: error: 'bo_gluGetString' was not declared in this scope
make[2]: *** [bogl/CMakeFiles/bogl.dir/bogl.o] Error 1
make[1]: *** [bogl/CMakeFiles/bogl.dir/all] Error 2
make: *** [all] Error 2