rendered paste bodycd build_unix && make all
make[3]: Entering directory `/var/tmp/portage/dev-db/mysql-5.0.56/work/mysql/bdb/build_unix'
/bin/sh ./libtool --mode=compile i686-pc-linux-gnu-gcc -c -I. -I../../././bdb/dist/.. -I../../././bdb/dist/../dbinc -D_GNU_SOURCE -D_REENTRANT -DDBUG_OFF -march=prescott -O3 -pipe -fomit-frame-pointer -DHAVE_ERRNO_AS_DEFINE=1 ../../././bdb/dist/../mutex/mut_pthread.c
/bin/sh ./libtool --mode=compile i686-pc-linux-gnu-gcc -c -I. -I../../././bdb/dist/.. -I../../././bdb/dist/../dbinc -D_GNU_SOURCE -D_REENTRANT -DDBUG_OFF -march=prescott -O3 -pipe -fomit-frame-pointer -DHAVE_ERRNO_AS_DEFINE=1 ../../././bdb/dist/../btree/bt_compare.c
i686-pc-linux-gnu-gcc -c -I. -I../../././bdb/dist/.. -I../../././bdb/dist/../dbinc -D_GNU_SOURCE -D_REENTRANT -DDBUG_OFF -march=prescott -O3 -pipe -fomit-frame-pointer -DHAVE_ERRNO_AS_DEFINE=1 ../../././bdb/dist/../mutex/mut_pthread.c -o mut_pthread.o
../../././bdb/dist/../mutex/mut_pthread.c:8:23: error: db_config.h: No such file or directory
../../././bdb/dist/../mutex/mut_pthread.c:21:20: error: db_int.h: No such file or directory
../../././bdb/dist/../mutex/mut_pthread.c: In function '__db_pthread_mutex_init':
../../././bdb/dist/../mutex/mut_pthread.c:66: error: expected declaration specifiers before 'DB_ENV'
../../././bdb/dist/../mutex/mut_pthread.c:67: error: expected declaration specifiers before 'DB_MUTEX'
../../././bdb/dist/../mutex/mut_pthread.c:82: error: 'MUTEX_MPOOL' undeclared (first use in this function)
../../././bdb/dist/../mutex/mut_pthread.c:82: error: (Each undeclared identifier is reported only once
../../././bdb/dist/../mutex/mut_pthread.c:82: error: for each function it appears in.)
../../././bdb/dist/../mutex/mut_pthread.c:83: error: invalid type argument of 'unary *'
../../././bdb/dist/../mutex/mut_pthread.c:83: warning: passing argument 1 of 'memset' makes pointer from integer without a cast
../../././bdb/dist/../mutex/mut_pthread.c:94: error: 'MUTEX_THREAD' undeclared (first use in this function)
../../././bdb/dist/../mutex/mut_pthread.c:94: error: 'DB_ENV_PRIVATE' undeclared (first use in this function)
../../././bdb/dist/../mutex/mut_pthread.c:95: error: 'DB_ENV_THREAD' undeclared (first use in this function)
../../././bdb/dist/../mutex/mut_pthread.c:96: error: 'MUTEX_IGNORE' undeclared (first use in this function)
../../././bdb/dist/../mutex/mut_pthread.c:187: error: invalid type argument of '->'
../../././bdb/dist/../mutex/mut_pthread.c:192: error: 'MUTEX_INITED' undeclared (first use in this function)
../../././bdb/dist/../mutex/mut_pthread.c: In function '__db_pthread_mutex_lock':
../../././bdb/dist/../mutex/mut_pthread.c:208: error: expected declaration specifiers before 'DB_ENV'
../../././bdb/dist/../mutex/mut_pthread.c:209: error: expected declaration specifiers before 'DB_MUTEX'
../../././bdb/dist/../mutex/mut_pthread.c:214: error: 'DB_ENV_NOLOCKING' undeclared (first use in this function)
../../././bdb/dist/../mutex/mut_pthread.c:214: error: 'MUTEX_IGNORE' undeclared (first use in this function)
../../././bdb/dist/../mutex/mut_pthread.c:218: error: invalid type argument of '->'
../../././bdb/dist/../mutex/mut_pthread.c:219: error: invalid type argument of '->'
../../././bdb/dist/../mutex/mut_pthread.c:222: error: invalid type argument of '->'
../../././bdb/dist/../mutex/mut_pthread.c:225: error: 'MUTEX_SELF_BLOCK' undeclared (first use in this function)
../../././bdb/dist/../mutex/mut_pthread.c:226: error: invalid type argument of '->'
../../././bdb/dist/../mutex/mut_pthread.c:227: error: invalid type argument of '->'
../../././bdb/dist/../mutex/mut_pthread.c:227: error: invalid type argument of '->'
../../././bdb/dist/../mutex/mut_pthread.c:238: error: 'EINTR' undeclared (first use in this function)
../../././bdb/dist/../mutex/mut_pthread.c:242: error: 'ETIMEDOUT' undeclared (first use in this function)
../../././bdb/dist/../mutex/mut_pthread.c:243: error: invalid type argument of '->'
../../././bdb/dist/../mutex/mut_pthread.c:249: error: invalid type argument of '->'
../../././bdb/dist/../mutex/mut_pthread.c:251: error: invalid type argument of '->'
../../././bdb/dist/../mutex/mut_pthread.c:256: error: invalid type argument of '->'
../../././bdb/dist/../mutex/mut_pthread.c:269: error: invalid type argument of '->'
../../././bdb/dist/../mutex/mut_pthread.c:270: error: 'EFAULT' undeclared (first use in this function)
../../././bdb/dist/../mutex/mut_pthread.c:274: error: invalid type argument of '->'
../../././bdb/dist/../mutex/mut_pthread.c:275: error: invalid type argument of '->'
../../././bdb/dist/../mutex/mut_pthread.c:277: error: invalid type argument of '->'
../../././bdb/dist/../mutex/mut_pthread.c:278: error: invalid type argument of '->'
../../././bdb/dist/../mutex/mut_pthread.c:278: error: invalid type argument of '->'
../../././bdb/dist/../mutex/mut_pthread.c:280: error: invalid type argument of '->'
../../././bdb/dist/../mutex/mut_pthread.c:290: error: invalid type argument of '->'
../../././bdb/dist/../mutex/mut_pthread.c: In function '__db_pthread_mutex_unlock':
../../././bdb/dist/../mutex/mut_pthread.c:307: error: expected declaration specifiers before 'DB_ENV'
../../././bdb/dist/../mutex/mut_pthread.c:308: error: expected declaration specifiers before 'DB_MUTEX'
../../././bdb/dist/../mutex/mut_pthread.c:312: error: 'DB_ENV_NOLOCKING' undeclared (first use in this function)
../../././bdb/dist/../mutex/mut_pthread.c:312: error: 'MUTEX_IGNORE' undeclared (first use in this function)
../../././bdb/dist/../mutex/mut_pthread.c:320: error: 'MUTEX_SELF_BLOCK' undeclared (first use in this function)
../../././bdb/dist/../mutex/mut_pthread.c:321: error: invalid type argument of '->'
../../././bdb/dist/../mutex/mut_pthread.c:324: error: invalid type argument of '->'
../../././bdb/dist/../mutex/mut_pthread.c:326: error: invalid type argument of '->'
../../././bdb/dist/../mutex/mut_pthread.c:330: error: invalid type argument of '->'
../../././bdb/dist/../mutex/mut_pthread.c:335: error: invalid type argument of '->'
../../././bdb/dist/../mutex/mut_pthread.c:336: error: 'EFAULT' undeclared (first use in this function)
../../././bdb/dist/../mutex/mut_pthread.c: In function '__db_pthread_mutex_destroy':
../../././bdb/dist/../mutex/mut_pthread.c:351: error: expected declaration specifiers before 'DB_MUTEX'
../../././bdb/dist/../mutex/mut_pthread.c:355: error: 'MUTEX_IGNORE' undeclared (first use in this function)
../../././bdb/dist/../mutex/mut_pthread.c:358: error: invalid type argument of '->'
make[3]: *** [mut_pthread.o] Error 1
make[3]: *** Waiting for unfinished jobs....
i686-pc-linux-gnu-gcc -c -I. -I../../././bdb/dist/.. -I../../././bdb/dist/../dbinc -D_GNU_SOURCE -D_REENTRANT -DDBUG_OFF -march=prescott -O3 -pipe -fomit-frame-pointer -DHAVE_ERRNO_AS_DEFINE=1 ../../././bdb/dist/../btree/bt_compare.c -o bt_compare.o
../../././bdb/dist/../btree/bt_compare.c:43:23: error: db_config.h: No such file or directory
../../././bdb/dist/../btree/bt_compare.c:53:20: error: db_int.h: No such file or directory
In file included from ../../././bdb/dist/../btree/bt_compare.c:54:
../../././bdb/dist/../dbinc/db_page.h:69: error: expected specifier-qualifier-list before 'DB_LSN'
../../././bdb/dist/../dbinc/db_page.h:111: error: 'DB_IV_BYTES' undeclared here (not in a function)
../../././bdb/dist/../dbinc/db_page.h:112: error: 'DB_MAC_KEY' undeclared here (not in a function)
../../././bdb/dist/../dbinc/db_page.h:225: error: expected specifier-qualifier-list before 'DB_LSN'
../../././bdb/dist/../dbinc/db_page.h:291: error: expected specifier-qualifier-list before 'DB_LSN'
../../././bdb/dist/../dbinc/db_page.h:478: error: expected specifier-qualifier-list before 'db_pgno_t'
../../././bdb/dist/../dbinc/db_page.h:498: error: expected specifier-qualifier-list before 'db_pgno_t'
../../././bdb/dist/../dbinc/db_page.h:539: error: expected specifier-qualifier-list before 'db_indx_t'
../../././bdb/dist/../dbinc/db_page.h:562: error: expected specifier-qualifier-list before 'db_indx_t'
../../././bdb/dist/../dbinc/db_page.h:601: error: expected specifier-qualifier-list before 'db_indx_t'
../../././bdb/dist/../dbinc/db_page.h:630: error: expected specifier-qualifier-list before 'db_pgno_t'
In file included from ../../././bdb/dist/../btree/bt_compare.c:55:
../../././bdb/dist/../dbinc/btree.h:132: error: expected specifier-qualifier-list before 'db_indx_t'
../../././bdb/dist/../dbinc/btree.h:190: error: expected specifier-qualifier-list before '__DBC_INTERNAL'
../../././bdb/dist/../dbinc/btree.h:259: error: expected specifier-qualifier-list before 'db_pgno_t'
In file included from ../../././bdb/dist/../dbinc/btree.h:317,
from ../../././bdb/dist/../btree/bt_compare.c:55:
../../././bdb/dist/../dbinc_auto/btree_auto.h:8: error: expected specifier-qualifier-list before 'DB_TXN'
../../././bdb/dist/../dbinc_auto/btree_auto.h:26: error: expected specifier-qualifier-list before 'DB_TXN'
../../././bdb/dist/../dbinc_auto/btree_auto.h:40: error: expected specifier-qualifier-list before 'DB_TXN'
../../././bdb/dist/../dbinc_auto/btree_auto.h:53: error: expected specifier-qualifier-list before 'DB_TXN'
../../././bdb/dist/../dbinc_auto/btree_auto.h:66: error: expected specifier-qualifier-list before 'DB_TXN'
../../././bdb/dist/../dbinc_auto/btree_auto.h:77: error: expected specifier-qualifier-list before 'DB_TXN'
../../././bdb/dist/../dbinc_auto/btree_auto.h:93: error: expected specifier-qualifier-list before 'DB_TXN'
../../././bdb/dist/../dbinc_auto/btree_auto.h:104: error: expected specifier-qualifier-list before 'DB_TXN'
../../././bdb/dist/../dbinc_auto/btree_auto.h:119: error: expected specifier-qualifier-list before 'DB_TXN'
In file included from ../../././bdb/dist/../dbinc/btree.h:318,
from ../../././bdb/dist/../btree/bt_compare.c:55:
../../././bdb/dist/../dbinc_auto/btree_ext.h:9: error: expected ')' before '*' token
../../././bdb/dist/../dbinc_auto/btree_ext.h:10: error: expected ')' before '*' token
../../././bdb/dist/../dbinc_auto/btree_ext.h:11: error: expected ')' before '*' token
../../././bdb/dist/../dbinc_auto/btree_ext.h:12: error: expected ')' before '*' token
../../././bdb/dist/../dbinc_auto/btree_ext.h:13: error: expected ')' before '*' token
../../././bdb/dist/../dbinc_auto/btree_ext.h:15: error: expected ')' before '*' token
../../././bdb/dist/../dbinc_auto/btree_ext.h:16: error: expected ')' before '*' token
../../././bdb/dist/../dbinc_auto/btree_ext.h:17: error: expected ')' before '*' token
../../././bdb/dist/../dbinc_auto/btree_ext.h:18: error: expected ')' before '*' token
../../././bdb/dist/../dbinc_auto/btree_ext.h:19: error: expected ')' before '*' token
../../././bdb/dist/../dbinc_auto/btree_ext.h:20: error: expected ')' before '*' token
../../././bdb/dist/../dbinc_auto/btree_ext.h:21: error: expected ')' before '*' token
../../././bdb/dist/../dbinc_auto/btree_ext.h:22: error: expected ')' before '*' token
../../././bdb/dist/../dbinc_auto/btree_ext.h:23: error: expected ')' before '*' token
../../././bdb/dist/../dbinc_auto/btree_ext.h:24: error: expected ')' before '*' token
../../././bdb/dist/../dbinc_auto/btree_ext.h:25: error: expected ')' before '*' token
../../././bdb/dist/../dbinc_auto/btree_ext.h:26: error: expected ')' before '*' token
../../././bdb/dist/../dbinc_auto/btree_ext.h:27: error: expected ')' before '*' token
../../././bdb/dist/../dbinc_auto/btree_ext.h:28: error: expected ')' before '*' token
../../././bdb/dist/../dbinc_auto/btree_ext.h:29: error: expected ')' before '*' token
../../././bdb/dist/../dbinc_auto/btree_ext.h:30: error: expected ')' before '*' token
../../././bdb/dist/../dbinc_auto/btree_ext.h:31: error: expected ')' before '*' token
../../././bdb/dist/../dbinc_auto/btree_ext.h:32: error: expected ')' before '*' token
../../././bdb/dist/../dbinc_auto/btree_ext.h:33: error: expected ')' before '*' token
../../././bdb/dist/../dbinc_auto/btree_ext.h:34: error: expected ')' before '*' token
../../././bdb/dist/../dbinc_auto/btree_ext.h:35: error: expected ')' before '*' token
../../././bdb/dist/../dbinc_auto/btree_ext.h:36: error: expected ')' before '*' token
../../././bdb/dist/../dbinc_auto/btree_ext.h:37: error: expected ')' before '*' token
../../././bdb/dist/../dbinc_auto/btree_ext.h:38: error: expected ')' before '*' token
../../././bdb/dist/../dbinc_auto/btree_ext.h:39: error: expected ')' before '*' token
../../././bdb/dist/../dbinc_auto/btree_ext.h:40: error: expected ')' before '*' token
../../././bdb/dist/../dbinc_auto/btree_ext.h:41: error: expected ')' before '*' token
../../././bdb/dist/../dbinc_auto/btree_ext.h:42: error: expected ')' before '*' token
../../././bdb/dist/../dbinc_auto/btree_ext.h:43: error: expected ')' before '*' token
../../././bdb/dist/../dbinc_auto/btree_ext.h:44: error: expected ')' before '*' token
../../././bdb/dist/../dbinc_auto/btree_ext.h:45: error: expected ')' before '*' token
../../././bdb/dist/../dbinc_auto/btree_ext.h:46: error: expected ')' before '*' token
../../././bdb/dist/../dbinc_auto/btree_ext.h:47: error: expected ')' before '*' token
../../././bdb/dist/../dbinc_auto/btree_ext.h:48: error: expected ')' before '*' token
../../././bdb/dist/../dbinc_auto/btree_ext.h:49: error: expected ')' before '*' token
../../././bdb/dist/../dbinc_auto/btree_ext.h:50: error: expected ')' before '*' token
../../././bdb/dist/../dbinc_auto/btree_ext.h:51: error: expected ')' before '*' token
../../././bdb/dist/../dbinc_auto/btree_ext.h:52: error: expected ')' before '*' token
../../././bdb/dist/../dbinc_auto/btree_ext.h:53: error: expected ')' before '*' token
../../././bdb/dist/../dbinc_auto/btree_ext.h:54: error: expected ')' before '*' token
../../././bdb/dist/../dbinc_auto/btree_ext.h:55: error: expected ')' before '*' token
../../././bdb/dist/../dbinc_auto/btree_ext.h:56: error: expected ')' before '*' token
../../././bdb/dist/../dbinc_auto/btree_ext.h:57: error: expected ')' before '*' token
../../././bdb/dist/../dbinc_auto/btree_ext.h:58: error: expected ')' before '*' token
../../././bdb/dist/../dbinc_auto/btree_ext.h:59: error: expected ')' before '*' token
../../././bdb/dist/../dbinc_auto/btree_ext.h:60: error: expected ')' before '*' token
../../././bdb/dist/../dbinc_auto/btree_ext.h:61: error: expected ')' before '*' token
../../././bdb/dist/../dbinc_auto/btree_ext.h:62: error: expected ')' before '*' token
../../././bdb/dist/../dbinc_auto/btree_ext.h:63: error: expected ')' before '*' token
../../././bdb/dist/../dbinc_auto/btree_ext.h:64: error: expected ')' before '*' token
../../././bdb/dist/../dbinc_auto/btree_ext.h:65: error: expected ')' before '*' token
../../././bdb/dist/../dbinc_auto/btree_ext.h:66: error: expected ')' before '*' token
../../././bdb/dist/../dbinc_auto/btree_ext.h:67: error: expected '=', ',', ';', 'asm' or '__attribute__' before '__bam_total'
../../././bdb/dist/../dbinc_auto/btree_ext.h:68: error: expected ')' before '*' token
../../././bdb/dist/../dbinc_auto/btree_ext.h:69: error: expected ')' before '*' token
../../././bdb/dist/../dbinc_auto/btree_ext.h:70: error: expected ')' before '*' token
../../././bdb/dist/../dbinc_auto/btree_ext.h:71: error: expected ')' before '*' token
../../././bdb/dist/../dbinc_auto/btree_ext.h:72: error: expected ')' before '*' token
../../././bdb/dist/../dbinc_auto/btree_ext.h:73: error: expected ')' before '*' token
../../././bdb/dist/../dbinc_auto/btree_ext.h:74: error: expected ')' before '*' token
../../././bdb/dist/../dbinc_auto/btree_ext.h:75: error: expected ')' before '*' token
../../././bdb/dist/../dbinc_auto/btree_ext.h:76: error: expected ')' before '*' token
../../././bdb/dist/../dbinc_auto/btree_ext.h:77: error: expected ')' before '*' token
../../././bdb/dist/../dbinc_auto/btree_ext.h:78: error: expected ')' before '*' token
../../././bdb/dist/../dbinc_auto/btree_ext.h:79: error: expected ')' before '*' token
../../././bdb/dist/../dbinc_auto/btree_ext.h:80: error: expected ')' before '*' token
../../././bdb/dist/../dbinc_auto/btree_ext.h:81: error: expected ')' before '*' token
../../././bdb/dist/../dbinc_auto/btree_ext.h:82: error: expected ')' before '*' token
../../././bdb/dist/../dbinc_auto/btree_ext.h:83: error: expected ')' before '*' token
../../././bdb/dist/../dbinc_auto/btree_ext.h:84: error: expected ')' before '*' token
../../././bdb/dist/../dbinc_auto/btree_ext.h:85: error: expected ')' before '*' token
../../././bdb/dist/../dbinc_auto/btree_ext.h:86: error: expected ')' before '*' token
../../././bdb/dist/../dbinc_auto/btree_ext.h:87: error: expected ')' before '*' token
../../././bdb/dist/../dbinc_auto/btree_ext.h:88: error: expected ')' before '*' token
../../././bdb/dist/../dbinc_auto/btree_ext.h:89: error: expected ')' before '*' token
../../././bdb/dist/../dbinc_auto/btree_ext.h:90: error: expected ')' before '*' token
../../././bdb/dist/../dbinc_auto/btree_ext.h:91: error: expected ')' before '*' token
../../././bdb/dist/../dbinc_auto/btree_ext.h:92: error: expected ')' before '*' token
../../././bdb/dist/../dbinc_auto/btree_ext.h:93: error: expected ')' before '*' token
../../././bdb/dist/../dbinc_auto/btree_ext.h:94: error: expected ')' before '*' token
../../././bdb/dist/../dbinc_auto/btree_ext.h:95: error: expected ')' before '*' token
../../././bdb/dist/../dbinc_auto/btree_ext.h:96: error: expected ')' before '*' token
../../././bdb/dist/../dbinc_auto/btree_ext.h:97: error: expected ')' before '*' token
../../././bdb/dist/../dbinc_auto/btree_ext.h:98: error: expected ')' before '*' token
../../././bdb/dist/../dbinc_auto/btree_ext.h:99: error: expected ')' before '*' token
../../././bdb/dist/../dbinc_auto/btree_ext.h:100: error: expected ')' before '*' token
../../././bdb/dist/../dbinc_auto/btree_ext.h:101: error: expected ')' before '*' token
../../././bdb/dist/../dbinc_auto/btree_ext.h:102: error: expected ')' before '*' token
../../././bdb/dist/../dbinc_auto/btree_ext.h:103: error: expected ')' before '*' token
../../././bdb/dist/../dbinc_auto/btree_ext.h:104: error: expected ')' before '*' token
../../././bdb/dist/../dbinc_auto/btree_ext.h:105: error: expected ')' before '*' token
../../././bdb/dist/../dbinc_auto/btree_ext.h:106: error: expected ')' before '*' token
../../././bdb/dist/../dbinc_auto/btree_ext.h:107: error: expected ')' before '*' token
../../././bdb/dist/../dbinc_auto/btree_ext.h:108: error: expected ')' before '*' token
../../././bdb/dist/../dbinc_auto/btree_ext.h:109: error: expected ')' before '*' token
../../././bdb/dist/../dbinc_auto/btree_ext.h:110: error: expected ')' before '*' token
../../././bdb/dist/../dbinc_auto/btree_ext.h:111: error: expected ')' before '*' token
../../././bdb/dist/../dbinc_auto/btree_ext.h:112: error: expected ')' before '*' token
../../././bdb/dist/../dbinc_auto/btree_ext.h:113: error: expected ')' before '*' token
../../././bdb/dist/../dbinc_auto/btree_ext.h:114: error: expected ')' before '*' token
../../././bdb/dist/../dbinc_auto/btree_ext.h:115: error: expected ')' before '*' token
../../././bdb/dist/../dbinc_auto/btree_ext.h:116: error: expected ')' before '*' token
../../././bdb/dist/../dbinc_auto/btree_ext.h:117: error: expected ')' before '*' token
../../././bdb/dist/../dbinc_auto/btree_ext.h:118: error: expected ')' before '*' token
../../././bdb/dist/../dbinc_auto/btree_ext.h:119: error: expected ')' before '*' token
../../././bdb/dist/../dbinc_auto/btree_ext.h:120: error: expected ')' before '*' token
../../././bdb/dist/../dbinc_auto/btree_ext.h:121: error: expected ')' before '*' token
../../././bdb/dist/../dbinc_auto/btree_ext.h:122: error: expected ')' before '*' token
../../././bdb/dist/../dbinc_auto/btree_ext.h:123: error: expected ')' before '*' token
../../././bdb/dist/../dbinc_auto/btree_ext.h:124: error: expected ')' before '*' token
../../././bdb/dist/../dbinc_auto/btree_ext.h:125: error: expected ')' before '*' token
../../././bdb/dist/../dbinc_auto/btree_ext.h:126: error: expected ')' before '*' token
../../././bdb/dist/../dbinc_auto/btree_ext.h:127: error: expected ')' before '*' token
In file included from ../../././bdb/dist/../dbinc/btree.h:319,
from ../../././bdb/dist/../btree/bt_compare.c:55:
../../././bdb/dist/../dbinc/db_am.h:119: error: expected specifier-qualifier-list before 'DBC'
In file included from ../../././bdb/dist/../dbinc/db_am.h:123,
from ../../././bdb/dist/../dbinc/btree.h:319,
from ../../././bdb/dist/../btree/bt_compare.c:55:
../../././bdb/dist/../dbinc/db_dispatch.h:56: error: expected specifier-qualifier-list before 'DB_LSN'
../../././bdb/dist/../dbinc/db_dispatch.h:73: error: expected specifier-qualifier-list before 'LIST_ENTRY'
In file included from ../../././bdb/dist/../dbinc/db_am.h:124,
from ../../././bdb/dist/../dbinc/btree.h:319,
from ../../././bdb/dist/../btree/bt_compare.c:55:
../../././bdb/dist/../dbinc_auto/db_auto.h:8: error: expected specifier-qualifier-list before 'DB_TXN'
../../././bdb/dist/../dbinc_auto/db_auto.h:23: error: expected specifier-qualifier-list before 'DB_TXN'
../../././bdb/dist/../dbinc_auto/db_auto.h:39: error: expected specifier-qualifier-list before 'DB_TXN'
../../././bdb/dist/../dbinc_auto/db_auto.h:50: error: expected specifier-qualifier-list before 'DB_TXN'
../../././bdb/dist/../dbinc_auto/db_auto.h:65: error: expected specifier-qualifier-list before 'DB_TXN'
../../././bdb/dist/../dbinc_auto/db_auto.h:77: error: expected specifier-qualifier-list before 'DB_TXN'
../../././bdb/dist/../dbinc_auto/db_auto.h:87: error: expected specifier-qualifier-list before 'DB_TXN'
../../././bdb/dist/../dbinc_auto/db_auto.h:101: error: expected specifier-qualifier-list before 'DB_TXN'
../../././bdb/dist/../dbinc_auto/db_auto.h:114: error: expected specifier-qualifier-list before 'DB_TXN'
In file included from ../../././bdb/dist/../dbinc/db_am.h:125,
from ../../././bdb/dist/../dbinc/btree.h:319,
from ../../././bdb/dist/../btree/bt_compare.c:55:
../../././bdb/dist/../dbinc_auto/crdel_auto.h:8: error: expected specifier-qualifier-list before 'DB_TXN'
In file included from ../../././bdb/dist/../dbinc/db_am.h:126,
from ../../././bdb/dist/../dbinc/btree.h:319,
from ../../././bdb/dist/../btree/bt_compare.c:55:
../../././bdb/dist/../dbinc_auto/db_ext.h:9: error: expected ')' before '*' token
../../././bdb/dist/../dbinc_auto/db_ext.h:10: error: expected ')' before '*' token
../../././bdb/dist/../dbinc_auto/db_ext.h:11: error: expected ')' before '*' token
../../././bdb/dist/../dbinc_auto/db_ext.h:12: error: expected ')' before '*' token
../../././bdb/dist/../dbinc_auto/db_ext.h:13: error: expected ')' before '*' token
../../././bdb/dist/../dbinc_auto/db_ext.h:14: error: expected ')' before '*' token
../../././bdb/dist/../dbinc_auto/db_ext.h:15: error: expected ')' before '*' token
../../././bdb/dist/../dbinc_auto/db_ext.h:16: error: expected ')' before '*' token
../../././bdb/dist/../dbinc_auto/db_ext.h:17: error: expected ')' before '*' token
../../././bdb/dist/../dbinc_auto/db_ext.h:18: error: expected ')' before '*' token
../../././bdb/dist/../dbinc_auto/db_ext.h:19: error: expected ')' before '*' token
../../././bdb/dist/../dbinc_auto/db_ext.h:20: error: expected ')' before '*' token
../../././bdb/dist/../dbinc_auto/db_ext.h:21: error: expected ')' before '*' token
../../././bdb/dist/../dbinc_auto/db_ext.h:22: error: expected ')' before '*' token
../../././bdb/dist/../dbinc_auto/db_ext.h:23: error: expected ')' before '*' token
../../././bdb/dist/../dbinc_auto/db_ext.h:24: error: expected ')' before '*' token
../../././bdb/dist/../dbinc_auto/db_ext.h:25: error: expected '=', ',', ';', 'asm' or '__attribute__' before '*' token
../../././bdb/dist/../dbinc_auto/db_ext.h:29: error: expected ')' before '*' token
../../././bdb/dist/../dbinc_auto/db_ext.h:30: error: expected ')' before '*' token
../../././bdb/dist/../dbinc_auto/db_ext.h:31: error: expected ')' before '*' token
../../././bdb/dist/../dbinc_auto/db_ext.h:32: error: expected ')' before '*' token
../../././bdb/dist/../dbinc_auto/db_ext.h:33: error: expected ')' before '*' token
../../././bdb/dist/../dbinc_auto/db_ext.h:34: error: expected ')' before '*' token
../../././bdb/dist/../dbinc_auto/db_ext.h:35: error: expected ')' before '*' token
../../././bdb/dist/../dbinc_auto/db_ext.h:36: error: expected ')' before '*' token
../../././bdb/dist/../dbinc_auto/db_ext.h:37: error: expected ')' before '*' token
../../././bdb/dist/../dbinc_auto/db_ext.h:38: error: expected ')' before '*' token
../../././bdb/dist/../dbinc_auto/db_ext.h:39: error: expected ')' before '*' token
../../././bdb/dist/../dbinc_auto/db_ext.h:40: error: expected ')' before '*' token
../../././bdb/dist/../dbinc_auto/db_ext.h:41: error: expected ')' before '*' token
../../././bdb/dist/../dbinc_auto/db_ext.h:42: error: expected ')' before '*' token
../../././bdb/dist/../dbinc_auto/db_ext.h:43: error: expected ')' before '*' token
../../././bdb/dist/../dbinc_auto/db_ext.h:44: error: expected ')' before '*' token
../../././bdb/dist/../dbinc_auto/db_ext.h:45: error: expected ')' before '*' token
../../././bdb/dist/../dbinc_auto/db_ext.h:46: error: expected ')' before '*' token
../../././bdb/dist/../dbinc_auto/db_ext.h:47: error: expected ')' before '*' token
../../././bdb/dist/../dbinc_auto/db_ext.h:48: error: expected ')' before '*' token
../../././bdb/dist/../dbinc_auto/db_ext.h:49: error: expected ')' before '*' token
../../././bdb/dist/../dbinc_auto/db_ext.h:50: error: expected ')' before '*' token
../../././bdb/dist/../dbinc_auto/db_ext.h:51: error: expected ')' before '*' token
../../././bdb/dist/../dbinc_auto/db_ext.h:52: error: expected ')' before '*' token
../../././bdb/dist/../dbinc_auto/db_ext.h:53: error: expected ')' before '*' token
../../././bdb/dist/../dbinc_auto/db_ext.h:54: error: expected ')' before '*' token
../../././bdb/dist/../dbinc_auto/db_ext.h:55: error: expected ')' before '*' token
../../././bdb/dist/../dbinc_auto/db_ext.h:56: error: expected ')' before '*' token
../../././bdb/dist/../dbinc_auto/db_ext.h:57: error: expected ')' before '*' token
../../././bdb/dist/../dbinc_auto/db_ext.h:58: error: expected ')' before '*' token
../../././bdb/dist/../dbinc_auto/db_ext.h:59: error: expected ')' before '*' token
../../././bdb/dist/../dbinc_auto/db_ext.h:60: error: expected ')' before '*' token
../../././bdb/dist/../dbinc_auto/db_ext.h:61: error: expected ')' before '*' token
../../././bdb/dist/../dbinc_auto/db_ext.h:62: error: expected ')' before '*' token
../../././bdb/dist/../dbinc_auto/db_ext.h:63: error: expected ')' before '*' token
../../././bdb/dist/../dbinc_auto/db_ext.h:64: error: expected ')' before '*' token
../../././bdb/dist/../dbinc_auto/db_ext.h:65: error: expected ')' before '*' token
../../././bdb/dist/../dbinc_auto/db_ext.h:66: error: expected ')' before '*' token
../../././bdb/dist/../dbinc_auto/db_ext.h:67: error: expected ')' before '*' token
../../././bdb/dist/../dbinc_auto/db_ext.h:68: error: expected ')' before '*' token
../../././bdb/dist/../dbinc_auto/db_ext.h:69: error: expected ')' before '*' token
../../././bdb/dist/../dbinc_auto/db_ext.h:70: error: expected ')' before '*' token
../../././bdb/dist/../dbinc_auto/db_ext.h:71: error: expected ')' before '*' token
../../././bdb/dist/../dbinc_auto/db_ext.h:72: error: expected ')' before '*' token
../../././bdb/dist/../dbinc_auto/db_ext.h:73: error: expected ')' before '*' token
../../././bdb/dist/../dbinc_auto/db_ext.h:74: error: expected ')' before '*' token
../../././bdb/dist/../dbinc_auto/db_ext.h:75: error: expected ')' before '*' token
../../././bdb/dist/../dbinc_auto/db_ext.h:76: error: expected ')' before '*' token
../../././bdb/dist/../dbinc_auto/db_ext.h:77: error: expected ')' before '*' token
../../././bdb/dist/../dbinc_auto/db_ext.h:78: error: expected ')' before '*' token
../../././bdb/dist/../dbinc_auto/db_ext.h:79: error: expected ')' before '*' token
../../././bdb/dist/../dbinc_auto/db_ext.h:80: error: expected ')' before '*' token
../../././bdb/dist/../dbinc_auto/db_ext.h:81: error: expected ')' before '*' token
../../././bdb/dist/../dbinc_auto/db_ext.h:82: error: expected ')' before '*' token
../../././bdb/dist/../dbinc_auto/db_ext.h:83: error: expected ')' before '*' token
../../././bdb/dist/../dbinc_auto/db_ext.h:84: error: expected ')' before '*' token
../../././bdb/dist/../dbinc_auto/db_ext.h:85: error: expected ')' before '*' token
../../././bdb/dist/../dbinc_auto/db_ext.h:86: error: expected ')' before '*' token
../../././bdb/dist/../dbinc_auto/db_ext.h:87: error: expected ')' before '*' token
../../././bdb/dist/../dbinc_auto/db_ext.h:88: error: expected ')' before '*' token
../../././bdb/dist/../dbinc_auto/db_ext.h:89: error: expected ')' before '*' token
../../././bdb/dist/../dbinc_auto/db_ext.h:90: error: expected ')' before '*' token
../../././bdb/dist/../dbinc_auto/db_ext.h:91: error: expected '=', ',', ';', 'asm' or '__attribute__' before '*' token
../../././bdb/dist/../dbinc_auto/db_ext.h:92: error: expected ')' before '*' token
../../././bdb/dist/../dbinc_auto/db_ext.h:93: error: expected ')' before '*' token
../../././bdb/dist/../dbinc_auto/db_ext.h:94: error: expected declaration specifiers or '...' before 'DBT'
../../././bdb/dist/../dbinc_auto/db_ext.h:95: error: expected ')' before '*' token
../../././bdb/dist/../dbinc_auto/db_ext.h:96: error: expected ')' before '*' token
../../././bdb/dist/../dbinc_auto/db_ext.h:98: error: expected ')' before '*' token
../../././bdb/dist/../dbinc_auto/db_ext.h:99: error: expected ')' before '*' token
../../././bdb/dist/../dbinc_auto/db_ext.h:100: error: expected ')' before '*' token
../../././bdb/dist/../dbinc_auto/db_ext.h:101: error: expected ')' before '*' token
../../././bdb/dist/../dbinc_auto/db_ext.h:102: error: expected ')' before '*' token
../../././bdb/dist/../dbinc_auto/db_ext.h:103: error: expected ')' before '*' token
../../././bdb/dist/../dbinc_auto/db_ext.h:104: error: expected ')' before '*' token
../../././bdb/dist/../dbinc_auto/db_ext.h:105: error: expected ')' before '*' token
../../././bdb/dist/../dbinc_auto/db_ext.h:106: error: expected ')' before '*' token
../../././bdb/dist/../dbinc_auto/db_ext.h:107: error: expected ')' before '*' token
../../././bdb/dist/../dbinc_auto/db_ext.h:108: error: expected ')' before '*' token
../../././bdb/dist/../dbinc_auto/db_ext.h:109: error: expected ')' before '*' token
../../././bdb/dist/../dbinc_auto/db_ext.h:110: error: expected ')' before '*' token
../../././bdb/dist/../dbinc_auto/db_ext.h:111: error: expected ')' before '*' token
../../././bdb/dist/../dbinc_auto/db_ext.h:112: error: expected ')' before '*' token
../../././bdb/dist/../dbinc_auto/db_ext.h:114: error: expected ')' before '*' token
../../././bdb/dist/../dbinc_auto/db_ext.h:115: error: expected ')' before '*' token
../../././bdb/dist/../dbinc_auto/db_ext.h:116: error: expected ')' before '*' token
../../././bdb/dist/../dbinc_auto/db_ext.h:117: error: expected ';', ',' or ')' before '*' token
../../././bdb/dist/../dbinc_auto/db_ext.h:118: error: expected ';', ',' or ')' before '*' token
../../././bdb/dist/../dbinc_auto/db_ext.h:119: error: expected ';', ',' or ')' before '*' token
../../././bdb/dist/../dbinc_auto/db_ext.h:120: error: expected ';', ',' or ')' before '*' token
../../././bdb/dist/../dbinc_auto/db_ext.h:121: error: expected ';', ',' or ')' before '*' token
../../././bdb/dist/../dbinc_auto/db_ext.h:122: error: expected ';', ',' or ')' before '*' token
../../././bdb/dist/../dbinc_auto/db_ext.h:123: error: expected ';', ',' or ')' before '*' token
../../././bdb/dist/../dbinc_auto/db_ext.h:124: error: expected ';', ',' or ')' before '*' token
../../././bdb/dist/../dbinc_auto/db_ext.h:125: error: expected ';', ',' or ')' before '*' token
../../././bdb/dist/../dbinc_auto/db_ext.h:126: error: expected ';', ',' or ')' before '*' token
../../././bdb/dist/../dbinc_auto/db_ext.h:127: error: expected ';', ',' or ')' before '*' token
../../././bdb/dist/../dbinc_auto/db_ext.h:128: error: expected ';', ',' or ')' before '*' token
../../././bdb/dist/../dbinc_auto/db_ext.h:129: error: expected ';', ',' or ')' before '*' token
../../././bdb/dist/../dbinc_auto/db_ext.h:130: error: expected ';', ',' or ')' before '*' token
../../././bdb/dist/../dbinc_auto/db_ext.h:131: error: expected ')' before '*' token
../../././bdb/dist/../dbinc_auto/db_ext.h:132: error: expected ')' before '*' token
../../././bdb/dist/../dbinc_auto/db_ext.h:133: error: expected ')' before '*' token
../../././bdb/dist/../dbinc_auto/db_ext.h:134: error: expected ')' before '*' token
../../././bdb/dist/../dbinc_auto/db_ext.h:135: error: expected ')' before '*' token
../../././bdb/dist/../dbinc_auto/db_ext.h:136: error: expected ')' before '*' token
../../././bdb/dist/../dbinc_auto/db_ext.h:137: error: expected ')' before '*' token
../../././bdb/dist/../dbinc_auto/db_ext.h:138: error: expected ')' before '*' token
../../././bdb/dist/../dbinc_auto/db_ext.h:139: error: expected ')' before '*' token
../../././bdb/dist/../dbinc_auto/db_ext.h:140: error: expected ')' before '*' token
../../././bdb/dist/../dbinc_auto/db_ext.h:141: error: expected ')' before '*' token
../../././bdb/dist/../dbinc_auto/db_ext.h:142: error: expected ')' before '*' token
../../././bdb/dist/../dbinc_auto/db_ext.h:143: error: expected ')' before '*' token
../../././bdb/dist/../dbinc_auto/db_ext.h:144: error: expected ')' before '*' token
../../././bdb/dist/../dbinc_auto/db_ext.h:145: error: expected ')' before '*' token
../../././bdb/dist/../dbinc_auto/db_ext.h:146: error: expected ')' before '*' token
../../././bdb/dist/../dbinc_auto/db_ext.h:147: error: expected ')' before '*' token
../../././bdb/dist/../dbinc_auto/db_ext.h:148: error: expected ')' before '*' token
../../././bdb/dist/../dbinc_auto/db_ext.h:149: error: expected ')' before '*' token
../../././bdb/dist/../dbinc_auto/db_ext.h:150: error: expected ')' before '*' token
../../././bdb/dist/../dbinc_auto/db_ext.h:151: error: expected ')' before '*' token
../../././bdb/dist/../dbinc_auto/db_ext.h:152: error: expected ')' before '*' token
../../././bdb/dist/../dbinc_auto/db_ext.h:153: error: expected ')' before '*' token
../../././bdb/dist/../dbinc_auto/db_ext.h:154: error: expected ')' before '*' token
../../././bdb/dist/../dbinc_auto/db_ext.h:155: error: expected ')' before '*' token
../../././bdb/dist/../dbinc_auto/db_ext.h:157: error: expected ')' before '*' token
../../././bdb/dist/../dbinc_auto/db_ext.h:158: error: expected ';', ',' or ')' before '*' token
../../././bdb/dist/../dbinc_auto/db_ext.h:159: error: expected ')' before '*' token
../../././bdb/dist/../dbinc_auto/db_ext.h:160: error: expected ')' before '*' token
../../././bdb/dist/../dbinc_auto/db_ext.h:161: error: expected declaration specifiers or '...' before 'FILE'
../../././bdb/dist/../dbinc_auto/db_ext.h:162: error: expected ')' before '*' token
../../././bdb/dist/../dbinc_auto/db_ext.h:163: error: expected ';', ',' or ')' before '*' token
../../././bdb/dist/../dbinc_auto/db_ext.h:164: warning: parameter names (without types) in function declaration
../../././bdb/dist/../dbinc_auto/db_ext.h:165: error: expected ')' before '*' token
../../././bdb/dist/../dbinc_auto/db_ext.h:167: error: expected ')' before '*' token
../../././bdb/dist/../dbinc_auto/db_ext.h:168: error: expected ')' before '*' token
../../././bdb/dist/../dbinc_auto/db_ext.h:169: error: expected ')' before '*' token
../../././bdb/dist/../dbinc_auto/db_ext.h:170: error: expected ')' before '*' token
../../././bdb/dist/../dbinc_auto/db_ext.h:171: error: expected ')' before '*' token
../../././bdb/dist/../dbinc_auto/db_ext.h:172: error: expected ')' before '*' token
../../././bdb/dist/../dbinc_auto/db_ext.h:173: error: expected ')' before '*' token
../../././bdb/dist/../dbinc_auto/db_ext.h:174: error: expected ')' before '*' token
../../././bdb/dist/../dbinc_auto/db_ext.h:175: error: expected ')' before '*' token
../../././bdb/dist/../dbinc_auto/db_ext.h:176: error: expected ')' before '*' token
../../././bdb/dist/../dbinc_auto/db_ext.h:177: error: expected ')' before '*' token
../../././bdb/dist/../dbinc_auto/db_ext.h:178: error: expected ')' before '*' token
../../././bdb/dist/../dbinc_auto/db_ext.h:179: error: expected ')' before '*' token
../../././bdb/dist/../dbinc_auto/db_ext.h:180: error: expected ')' before '*' token
../../././bdb/dist/../dbinc_auto/db_ext.h:181: error: expected ')' before '*' token
../../././bdb/dist/../dbinc_auto/db_ext.h:182: error: expected ')' before '*' token
../../././bdb/dist/../dbinc_auto/db_ext.h:183: error: expected ')' before '*' token
../../././bdb/dist/../dbinc_auto/db_ext.h:184: error: expected ')' before '*' token
../../././bdb/dist/../dbinc_auto/db_ext.h:185: error: expected ')' before '*' token
../../././bdb/dist/../dbinc_auto/db_ext.h:186: error: expected ')' before '*' token
../../././bdb/dist/../dbinc_auto/db_ext.h:187: error: expected ')' before '*' token
../../././bdb/dist/../dbinc_auto/db_ext.h:188: error: expected ')' before '*' token
../../././bdb/dist/../dbinc_auto/db_ext.h:189: error: expected ')' before '*' token
../../././bdb/dist/../dbinc_auto/db_ext.h:190: error: expected ')' before '*' token
../../././bdb/dist/../dbinc_auto/db_ext.h:191: error: expected ')' before '*' token
../../././bdb/dist/../dbinc_auto/db_ext.h:193: error: expected ')' before '*' token
../../././bdb/dist/../dbinc_auto/db_ext.h:194: error: expected ')' before '*' token
../../././bdb/dist/../dbinc_auto/db_ext.h:195: error: expected ')' before '*' token
../../././bdb/dist/../dbinc_auto/db_ext.h:196: error: expected ')' before '*' token
../../././bdb/dist/../dbinc_auto/db_ext.h:197: error: expected ')' before '*' token
../../././bdb/dist/../dbinc_auto/db_ext.h:198: error: expected ')' before '*' token
../../././bdb/dist/../dbinc_auto/db_ext.h:199: error: expected ')' before '*' token
../../././bdb/dist/../dbinc_auto/db_ext.h:200: error: expected ')' before '*' token
../../././bdb/dist/../dbinc_auto/db_ext.h:201: error: expected ')' before '*' token
../../././bdb/dist/../dbinc_auto/db_ext.h:202: error: expected ')' before '*' token
../../././bdb/dist/../dbinc_auto/db_ext.h:203: error: expected ')' before '*' token
../../././bdb/dist/../dbinc_auto/db_ext.h:204: error: expected ')' before '*' token
../../././bdb/dist/../dbinc_auto/db_ext.h:205: error: expected ')' before '*' token
../../././bdb/dist/../dbinc_auto/db_ext.h:206: error: expected ')' before '*' token
../../././bdb/dist/../dbinc_auto/db_ext.h:207: error: expected ')' before '*' token
../../././bdb/dist/../dbinc_auto/db_ext.h:208: error: expected ')' before '*' token
../../././bdb/dist/../dbinc_auto/db_ext.h:209: error: expected ')' before '*' token
../../././bdb/dist/../dbinc_auto/db_ext.h:210: error: expected ')' before '*' token
../../././bdb/dist/../dbinc_auto/db_ext.h:211: error: expected ')' before '*' token
../../././bdb/dist/../dbinc_auto/db_ext.h:212: error: expected ')' before '*' token
../../././bdb/dist/../dbinc_auto/db_ext.h:213: error: expected ')' before '*' token
../../././bdb/dist/../dbinc_auto/db_ext.h:214: error: expected ')' before '*' token
../../././bdb/dist/../dbinc_auto/db_ext.h:215: error: expected ')' before '*' token
../../././bdb/dist/../dbinc_auto/db_ext.h:216: error: expected ')' before '*' token
../../././bdb/dist/../dbinc_auto/db_ext.h:217: error: expected ')' before '*' token
../../././bdb/dist/../dbinc_auto/db_ext.h:218: error: expected ')' before '*' token
../../././bdb/dist/../dbinc_auto/db_ext.h:219: error: expected ')' before '*' token
../../././bdb/dist/../btree/bt_compare.c: In function '__bam_cmp':
../../././bdb/dist/../btree/bt_compare.c:66: error: expected declaration specifiers before 'DB'
../../././bdb/dist/../btree/bt_compare.c:67: error: expected '=', ',', ';', 'asm' or '__attribute__' before '*' token
../../././bdb/dist/../btree/bt_compare.c:70: error: expected ')' before '*' token
../../././bdb/dist/../btree/bt_compare.c:76: error: 'DBT' undeclared (first use in this function)
../../././bdb/dist/../btree/bt_compare.c:76: error: (Each undeclared identifier is reported only once
../../././bdb/dist/../btree/bt_compare.c:76: error: for each function it appears in.)
../../././bdb/dist/../btree/bt_compare.c:76: error: expected ';' before 'pg_dbt'
../../././bdb/dist/../btree/bt_compare.c:91: error: 'PAGE' has no member named 'type'
../../././bdb/dist/../btree/bt_compare.c:95: error: 'db_indx_t' undeclared (first use in this function)
../../././bdb/dist/../btree/bt_compare.c:95: error: expected expression before ')' token
../../././bdb/dist/../btree/bt_compare.c:96: error: 'BKEYDATA' has no member named 'type'
../../././bdb/dist/../btree/bt_compare.c:99: error: 'pg_dbt' undeclared (first use in this function)
../../././bdb/dist/../btree/bt_compare.c:99: error: 'BKEYDATA' has no member named 'data'
../../././bdb/dist/../btree/bt_compare.c:100: error: 'BKEYDATA' has no member named 'len'
../../././bdb/dist/../btree/bt_compare.c:101: error: called object 'func' is not a function
../../././bdb/dist/../btree/bt_compare.c:128: error: expected expression before ')' token
../../././bdb/dist/../btree/bt_compare.c:129: error: 'BINTERNAL' has no member named 'type'
../../././bdb/dist/../btree/bt_compare.c:130: error: 'BINTERNAL' has no member named 'data'
../../././bdb/dist/../btree/bt_compare.c:132: error: 'BINTERNAL' has no member named 'data'
../../././bdb/dist/../btree/bt_compare.c:133: error: 'BINTERNAL' has no member named 'len'
../../././bdb/dist/../btree/bt_compare.c:134: error: called object 'func' is not a function
../../././bdb/dist/../btree/bt_compare.c:139: error: invalid type argument of '->'
../../././bdb/dist/../btree/bt_compare.c:139: error: 'PAGE' has no member named 'pgno'
../../././bdb/dist/../btree/bt_compare.c:146: error: 'BOVERFLOW' has no member named 'pgno'
../../././bdb/dist/../btree/bt_compare.c:146: error: 'BOVERFLOW' has no member named 'tlen'
../../././bdb/dist/../btree/bt_compare.c:146: error: '__bam_defcmp' undeclared (first use in this function)
../../././bdb/dist/../btree/bt_compare.c:146: error: 'NULL' undeclared (first use in this function)
../../././bdb/dist/../btree/bt_compare.c: In function '__bam_defcmp':
../../././bdb/dist/../btree/bt_compare.c:157: error: expected declaration specifiers before 'DB'
../../././bdb/dist/../btree/bt_compare.c:158: error: expected '=', ',', ';', 'asm' or '__attribute__' before '*' token
../../././bdb/dist/../btree/bt_compare.c:163: error: 'NULL' undeclared (first use in this function)
../../././bdb/dist/../btree/bt_compare.c:177: error: invalid type argument of '->'
../../././bdb/dist/../btree/bt_compare.c:177: error: invalid type argument of '->'
../../././bdb/dist/../btree/bt_compare.c:177: error: invalid type argument of '->'
../../././bdb/dist/../btree/bt_compare.c:177: error: invalid type argument of '->'
../../././bdb/dist/../btree/bt_compare.c:178: error: invalid type argument of '->'
../../././bdb/dist/../btree/bt_compare.c:178: error: invalid type argument of '->'
../../././bdb/dist/../btree/bt_compare.c:181: error: invalid type argument of '->'
../../././bdb/dist/../btree/bt_compare.c:181: error: invalid type argument of '->'
../../././bdb/dist/../btree/bt_compare.c: In function '__bam_defpfx':
../../././bdb/dist/../btree/bt_compare.c:192: error: expected declaration specifiers before 'DB'
../../././bdb/dist/../btree/bt_compare.c:193: error: expected '=', ',', ';', 'asm' or '__attribute__' before '*' token
../../././bdb/dist/../btree/bt_compare.c:198: error: 'NULL' undeclared (first use in this function)
../../././bdb/dist/../btree/bt_compare.c:201: error: invalid type argument of '->'
../../././bdb/dist/../btree/bt_compare.c:201: error: invalid type argument of '->'
../../././bdb/dist/../btree/bt_compare.c:201: error: invalid type argument of '->'
../../././bdb/dist/../btree/bt_compare.c:201: error: invalid type argument of '->'
../../././bdb/dist/../btree/bt_compare.c:202: error: invalid type argument of '->'
../../././bdb/dist/../btree/bt_compare.c:202: error: invalid type argument of '->'
../../././bdb/dist/../btree/bt_compare.c:210: error: invalid type argument of '->'
../../././bdb/dist/../btree/bt_compare.c:210: error: invalid type argument of '->'
../../././bdb/dist/../btree/bt_compare.c:210: error: invalid type argument of '->'
../../././bdb/dist/../btree/bt_compare.c:210: error: invalid type argument of '->'
make[3]: *** [bt_compare.o] Error 1
make[3]: Leaving directory `/var/tmp/portage/dev-db/mysql-5.0.56/work/mysql/bdb/build_unix'
make[2]: *** [all] Error 2
make[2]: Leaving directory `/var/tmp/portage/dev-db/mysql-5.0.56/work/mysql/bdb'
make[1]: *** [all-recursive] Error 1
make[1]: Leaving directory `/var/tmp/portage/dev-db/mysql-5.0.56/work/mysql'
make: *** [all] Error 2
*
* ERROR: dev-db/mysql-5.0.56 failed.
* Call stack:
* ebuild.sh, line 49: Called src_compile
* environment, line 3524: Called mysql_src_compile
* environment, line 3128: Called die
* The specific snippet of code:
* emake || die "emake failed";
* The die message:
* emake failed
*
* If you need support, post the topmost build error, and the call stack if relevant.
* A complete build log is located at '/var/tmp/portage/dev-db/mysql-5.0.56/temp/build.log'.
* The ebuild environment file is located at '/var/tmp/portage/dev-db/mysql-5.0.56/temp/environment'.
*