rendered paste bodymake[3]: Leaving directory `/home/raven301/e17_cvs/e17/libs/esmart/src/bin'
make[3]: Entering directory `/home/raven301/e17_cvs/e17/libs/esmart/src'
make[3]: Leaving directory `/home/raven301/e17_cvs/e17/libs/esmart/src'
make[2]: Leaving directory `/home/raven301/e17_cvs/e17/libs/esmart/src'
make[1]: Leaving directory `/home/raven301/e17_cvs/e17/libs/esmart/src'
Making all in data
make[1]: Entering directory `/home/raven301/e17_cvs/e17/libs/esmart/data'
Making all in images
make[2]: Entering directory `/home/raven301/e17_cvs/e17/libs/esmart/data/images'
make[2]: Nothing to be done for `all'.
make[2]: Leaving directory `/home/raven301/e17_cvs/e17/libs/esmart/data/images'
make[2]: Entering directory `/home/raven301/e17_cvs/e17/libs/esmart/data'
/usr/local/bin/edje_cc -v -id ../data/images -fd ../data/fonts \
../data/esmart_text_entry_test.edc \
../data/esmart_text_entry_test.edj
/usr/local/bin/edje_cc: Error. unable to load image for image "text_view_bg.png" part entry to ../data/esmart_text_entry_test.edj. Missing PNG or JPEG loader modules for Evas or file does not exist, or is not readable.
/usr/local/bin/edje_cc: Opening "/tmp/edje_cc.edc-tmp-wmNVQ5" for input
/usr/local/bin/edje_cc: Parsing input file
/usr/local/bin/edje_cc: Parsing done
/usr/local/bin/edje_cc: Wrote 124 bytes ( 0Kb) for "edje_file" header
make[2]: *** [esmart_text_entry_test.edj] Error 255
make[2]: Leaving directory `/home/raven301/e17_cvs/e17/libs/esmart/data'
make[1]: *** [all-recursive] Error 1
make[1]: Leaving directory `/home/raven301/e17_cvs/e17/libs/esmart/data'
make: *** [all-recursive] Error 1
--------------------------------------------------------------------------------