All pastes #981370 Raw Edit

Mine

public text v1 · immutable
·published 2008-04-11 19:05 UTC
rendered paste body
      then mv -f ".deps/library.Tpo" ".deps/library.Plo"; else rm -f ".deps/library.Tpo"; exit 1; fi
 i686-pc-linux-gnu-gcc -DHAVE_CONFIG_H -I. -I. -I../.. -I../.. -I../../libgphoto2_port/libgphoto2_port -I../../libgphoto2_port -I../../libgphoto2 -I../../libgphoto2 -DLOCALEDIR=\"/usr/share/locale\" -DCAMLIBS=\"/usr/lib/libgphoto2/2.2.1\" -Wall -Wmissing-declarations -Wmissing-prototypes -g -march=athlon -O2 -pipe -fomit-frame-pointer -MT library.lo -MD -MP -MF .deps/library.Tpo -c library.c  -fPIC -DPIC -o .libs/library.o
library.c: In function 'stv0680_cmd':
library.c:93: warning: pointer targets in passing argument 2 of 'gp_port_write' differ in signedness
library.c:98: warning: pointer targets in passing argument 2 of 'gp_port_read' differ in signedness
library.c:103: warning: pointer targets in passing argument 2 of 'gp_port_read' differ in signedness
library.c: In function 'stv0680_try_cmd':
library.c:129: warning: pointer targets in passing argument 5 of 'gp_port_usb_msg_read' differ in signedness
library.c:131: warning: pointer targets in passing argument 5 of 'gp_port_usb_msg_write' differ in signedness
library.c: In function 'stv0680_get_image_raw':
library.c:215: warning: pointer targets in passing argument 2 of 'gp_port_read' differ in signedness
library.c:223: warning: pointer targets in passing argument 2 of 'gp_file_append' differ in signedness
library.c: In function 'stv0680_get_image':
library.c:260: warning: pointer targets in passing argument 2 of 'gp_port_read' differ in signedness
library.c:277: warning: pointer targets in passing argument 2 of 'gp_file_append' differ in signedness
library.c: In function 'stv0680_get_image_preview':
library.c:317: warning: pointer targets in passing argument 2 of 'gp_port_read' differ in signedness
library.c:334: warning: pointer targets in passing argument 2 of 'gp_file_append' differ in signedness
library.c: In function 'stv0680_capture_preview':
library.c:480: warning: pointer targets in passing argument 2 of 'gp_port_read' differ in signedness
library.c:497: warning: pointer targets in passing argument 4 of 'demosaic_sharpen' differ in signedness
 i686-pc-linux-gnu-gcc -DHAVE_CONFIG_H -I. -I. -I../.. -I../.. -I../../libgphoto2_port/libgphoto2_port -I../../libgphoto2_port -I../../libgphoto2 -I../../libgphoto2 -DLOCALEDIR=\"/usr/share/locale\" -DCAMLIBS=\"/usr/lib/libgphoto2/2.2.1\" -Wall -Wmissing-declarations -Wmissing-prototypes -g -march=athlon -O2 -pipe -fomit-frame-pointer -MT library.lo -MD -MP -MF .deps/library.Tpo -c library.c -o library.o >/dev/null 2>&1
if /bin/sh ../../libtool --tag=CC --mode=compile i686-pc-linux-gnu-gcc -DHAVE_CONFIG_H -I. -I. -I../..  -I../.. -I../../libgphoto2_port/libgphoto2_port -I../../libgphoto2_port -I../../libgphoto2 -I../../libgphoto2 -DLOCALEDIR=\"/usr/share/locale\" -DCAMLIBS=\"/usr/lib/libgphoto2/2.2.1\" -Wall -Wmissing-declarations -Wmissing-prototypes -g   -march=athlon -O2 -pipe -fomit-frame-pointer -MT bayer.lo -MD -MP -MF ".deps/bayer.Tpo" -c -o bayer.lo bayer.c; \
        then mv -f ".deps/bayer.Tpo" ".deps/bayer.Plo"; else rm -f ".deps/bayer.Tpo"; exit 1; fi
 i686-pc-linux-gnu-gcc -DHAVE_CONFIG_H -I. -I. -I../.. -I../.. -I../../libgphoto2_port/libgphoto2_port -I../../libgphoto2_port -I../../libgphoto2 -I../../libgphoto2 -DLOCALEDIR=\"/usr/share/locale\" -DCAMLIBS=\"/usr/lib/libgphoto2/2.2.1\" -Wall -Wmissing-declarations -Wmissing-prototypes -g -march=athlon -O2 -pipe -fomit-frame-pointer -MT bayer.lo -MD -MP -MF .deps/bayer.Tpo -c bayer.c  -fPIC -DPIC -o .libs/bayer.o
 i686-pc-linux-gnu-gcc -DHAVE_CONFIG_H -I. -I. -I../.. -I../.. -I../../libgphoto2_port/libgphoto2_port -I../../libgphoto2_port -I../../libgphoto2 -I../../libgphoto2 -DLOCALEDIR=\"/usr/share/locale\" -DCAMLIBS=\"/usr/lib/libgphoto2/2.2.1\" -Wall -Wmissing-declarations -Wmissing-prototypes -g -march=athlon -O2 -pipe -fomit-frame-pointer -MT bayer.lo -MD -MP -MF .deps/bayer.Tpo -c bayer.c -o bayer.o >/dev/null 2>&1
if /bin/sh ../../libtool --tag=CC --mode=compile i686-pc-linux-gnu-gcc -DHAVE_CONFIG_H -I. -I. -I../..  -I../.. -I../../libgphoto2_port/libgphoto2_port -I../../libgphoto2_port -I../../libgphoto2 -I../../libgphoto2 -DLOCALEDIR=\"/usr/share/locale\" -DCAMLIBS=\"/usr/lib/libgphoto2/2.2.1\" -Wall -Wmissing-declarations -Wmissing-prototypes -g   -march=athlon -O2 -pipe -fomit-frame-pointer -MT sharpen.lo -MD -MP -MF ".deps/sharpen.Tpo" -c -o sharpen.lo sharpen.c; \
        then mv -f ".deps/sharpen.Tpo" ".deps/sharpen.Plo"; else rm -f ".deps/sharpen.Tpo"; exit 1; fi
 i686-pc-linux-gnu-gcc -DHAVE_CONFIG_H -I. -I. -I../.. -I../.. -I../../libgphoto2_port/libgphoto2_port -I../../libgphoto2_port -I../../libgphoto2 -I../../libgphoto2 -DLOCALEDIR=\"/usr/share/locale\" -DCAMLIBS=\"/usr/lib/libgphoto2/2.2.1\" -Wall -Wmissing-declarations -Wmissing-prototypes -g -march=athlon -O2 -pipe -fomit-frame-pointer -MT sharpen.lo -MD -MP -MF .deps/sharpen.Tpo -c sharpen.c  -fPIC -DPIC -o .libs/sharpen.o
 i686-pc-linux-gnu-gcc -DHAVE_CONFIG_H -I. -I. -I../.. -I../.. -I../../libgphoto2_port/libgphoto2_port -I../../libgphoto2_port -I../../libgphoto2 -I../../libgphoto2 -DLOCALEDIR=\"/usr/share/locale\" -DCAMLIBS=\"/usr/lib/libgphoto2/2.2.1\" -Wall -Wmissing-declarations -Wmissing-prototypes -g -march=athlon -O2 -pipe -fomit-frame-pointer -MT sharpen.lo -MD -MP -MF .deps/sharpen.Tpo -c sharpen.c -o sharpen.o >/dev/null 2>&1
if /bin/sh ../../libtool --tag=CC --mode=compile i686-pc-linux-gnu-gcc -DHAVE_CONFIG_H -I. -I. -I../..  -I../.. -I../../libgphoto2_port/libgphoto2_port -I../../libgphoto2_port -I../../libgphoto2 -I../../libgphoto2 -DLOCALEDIR=\"/usr/share/locale\" -DCAMLIBS=\"/usr/lib/libgphoto2/2.2.1\" -Wall -Wmissing-declarations -Wmissing-prototypes -g   -march=athlon -O2 -pipe -fomit-frame-pointer -MT saturate.lo -MD -MP -MF ".deps/saturate.Tpo" -c -o saturate.lo saturate.c; \
        then mv -f ".deps/saturate.Tpo" ".deps/saturate.Plo"; else rm -f ".deps/saturate.Tpo"; exit 1; fi
 i686-pc-linux-gnu-gcc -DHAVE_CONFIG_H -I. -I. -I../.. -I../.. -I../../libgphoto2_port/libgphoto2_port -I../../libgphoto2_port -I../../libgphoto2 -I../../libgphoto2 -DLOCALEDIR=\"/usr/share/locale\" -DCAMLIBS=\"/usr/lib/libgphoto2/2.2.1\" -Wall -Wmissing-declarations -Wmissing-prototypes -g -march=athlon -O2 -pipe -fomit-frame-pointer -MT saturate.lo -MD -MP -MF .deps/saturate.Tpo -c saturate.c  -fPIC -DPIC -o .libs/saturate.o
 i686-pc-linux-gnu-gcc -DHAVE_CONFIG_H -I. -I. -I../.. -I../.. -I../../libgphoto2_port/libgphoto2_port -I../../libgphoto2_port -I../../libgphoto2 -I../../libgphoto2 -DLOCALEDIR=\"/usr/share/locale\" -DCAMLIBS=\"/usr/lib/libgphoto2/2.2.1\" -Wall -Wmissing-declarations -Wmissing-prototypes -g -march=athlon -O2 -pipe -fomit-frame-pointer -MT saturate.lo -MD -MP -MF .deps/saturate.Tpo -c saturate.c -o saturate.o >/dev/null 2>&1
if /bin/sh ../../libtool --tag=CC --mode=compile i686-pc-linux-gnu-gcc -DHAVE_CONFIG_H -I. -I. -I../..  -I../.. -I../../libgphoto2_port/libgphoto2_port -I../../libgphoto2_port -I../../libgphoto2 -I../../libgphoto2 -DLOCALEDIR=\"/usr/share/locale\" -DCAMLIBS=\"/usr/lib/libgphoto2/2.2.1\" -Wall -Wmissing-declarations -Wmissing-prototypes -g   -march=athlon -O2 -pipe -fomit-frame-pointer -MT demosaic_sharpen.lo -MD -MP -MF ".deps/demosaic_sharpen.Tpo" -c -o demosaic_sharpen.lo demosaic_sharpen.c; \
        then mv -f ".deps/demosaic_sharpen.Tpo" ".deps/demosaic_sharpen.Plo"; else rm -f ".deps/demosaic_sharpen.Tpo"; exit 1; fi
 i686-pc-linux-gnu-gcc -DHAVE_CONFIG_H -I. -I. -I../.. -I../.. -I../../libgphoto2_port/libgphoto2_port -I../../libgphoto2_port -I../../libgphoto2 -I../../libgphoto2 -DLOCALEDIR=\"/usr/share/locale\" -DCAMLIBS=\"/usr/lib/libgphoto2/2.2.1\" -Wall -Wmissing-declarations -Wmissing-prototypes -g -march=athlon -O2 -pipe -fomit-frame-pointer -MT demosaic_sharpen.lo -MD -MP -MF .deps/demosaic_sharpen.Tpo -c demosaic_sharpen.c  -fPIC -DPIC -o .libs/demosaic_sharpen.o
 i686-pc-linux-gnu-gcc -DHAVE_CONFIG_H -I. -I. -I../.. -I../.. -I../../libgphoto2_port/libgphoto2_port -I../../libgphoto2_port -I../../libgphoto2 -I../../libgphoto2 -DLOCALEDIR=\"/usr/share/locale\" -DCAMLIBS=\"/usr/lib/libgphoto2/2.2.1\" -Wall -Wmissing-declarations -Wmissing-prototypes -g -march=athlon -O2 -pipe -fomit-frame-pointer -MT demosaic_sharpen.lo -MD -MP -MF .deps/demosaic_sharpen.Tpo -c demosaic_sharpen.c -o demosaic_sharpen.o >/dev/null 2>&1
/bin/sh ../../libtool --tag=CC --mode=link i686-pc-linux-gnu-gcc  -march=athlon -O2 -pipe -fomit-frame-pointer -Wall -g  -o stv0680.la -rpath /usr/lib/libgphoto2/2.2.1 -module -no-undefined -avoid-version -export-dynamic -export-symbols ../../camlibs/camlib.sym stv0680.lo library.lo bayer.lo sharpen.lo saturate.lo demosaic_sharpen.lo ../../libgphoto2/libgphoto2.la
echo "{ global:" > .libs/stv0680.ver
 cat ../../camlibs/camlib.sym | sed -e "s/\(.*\)/\1;/" >> .libs/stv0680.ver
 echo "local: *; };" >> .libs/stv0680.ver
 i686-pc-linux-gnu-gcc -shared  .libs/stv0680.o .libs/library.o .libs/bayer.o .libs/sharpen.o .libs/saturate.o .libs/demosaic_sharpen.o  -Wl,--rpath -Wl,/var/tmp/portage/media-libs/libgphoto2-2.2.1-r1/work/libgphoto2-2.2.1/libgphoto2/.libs ../../libgphoto2/.libs/libgphoto2.so  -march=athlon -Wl,-soname -Wl,stv0680.so -Wl,-version-script -Wl,.libs/stv0680.ver -o .libs/stv0680.so
i686-pc-linux-gnu-ar cru .libs/stv0680.a  stv0680.o library.o bayer.o sharpen.o saturate.o demosaic_sharpen.o
i686-pc-linux-gnu-ranlib .libs/stv0680.a
creating stv0680.la
(cd .libs && rm -f stv0680.la && ln -s ../stv0680.la stv0680.la)
make[3]: Leaving directory `/var/tmp/portage/media-libs/libgphoto2-2.2.1-r1/work/libgphoto2-2.2.1/camlibs/stv0680'
Making all in sx330z
make[3]: Entering directory `/var/tmp/portage/media-libs/libgphoto2-2.2.1-r1/work/libgphoto2-2.2.1/camlibs/sx330z'
if /bin/sh ../../libtool --tag=CC --mode=compile i686-pc-linux-gnu-gcc -DHAVE_CONFIG_H -I. -I. -I../..  -I../.. -I../../libgphoto2_port/libgphoto2_port -I../../libgphoto2_port -I../../libgphoto2 -I../../libgphoto2 -DLOCALEDIR=\"/usr/share/locale\" -DCAMLIBS=\"/usr/lib/libgphoto2/2.2.1\" -Wall -Wmissing-declarations -Wmissing-prototypes -g   -march=athlon -O2 -pipe -fomit-frame-pointer -MT library.lo -MD -MP -MF ".deps/library.Tpo" -c -o library.lo library.c; \
        then mv -f ".deps/library.Tpo" ".deps/library.Plo"; else rm -f ".deps/library.Tpo"; exit 1; fi
mkdir .libs
 i686-pc-linux-gnu-gcc -DHAVE_CONFIG_H -I. -I. -I../.. -I../.. -I../../libgphoto2_port/libgphoto2_port -I../../libgphoto2_port -I../../libgphoto2 -I../../libgphoto2 -DLOCALEDIR=\"/usr/share/locale\" -DCAMLIBS=\"/usr/lib/libgphoto2/2.2.1\" -Wall -Wmissing-declarations -Wmissing-prototypes -g -march=athlon -O2 -pipe -fomit-frame-pointer -MT library.lo -MD -MP -MF .deps/library.Tpo -c library.c  -fPIC -DPIC -o .libs/library.o
library.c: In function 'file_list_func':
library.c:137: warning: pointer targets in passing argument 3 of 'sx330z_get_toc_num_pages' differ in signedness
 i686-pc-linux-gnu-gcc -DHAVE_CONFIG_H -I. -I. -I../.. -I../.. -I../../libgphoto2_port/libgphoto2_port -I../../libgphoto2_port -I../../libgphoto2 -I../../libgphoto2 -DLOCALEDIR=\"/usr/share/locale\" -DCAMLIBS=\"/usr/lib/libgphoto2/2.2.1\" -Wall -Wmissing-declarations -Wmissing-prototypes -g -march=athlon -O2 -pipe -fomit-frame-pointer -MT library.lo -MD -MP -MF .deps/library.Tpo -c library.c -o library.o >/dev/null 2>&1
if /bin/sh ../../libtool --tag=CC --mode=compile i686-pc-linux-gnu-gcc -DHAVE_CONFIG_H -I. -I. -I../..  -I../.. -I../../libgphoto2_port/libgphoto2_port -I../../libgphoto2_port -I../../libgphoto2 -I../../libgphoto2 -DLOCALEDIR=\"/usr/share/locale\" -DCAMLIBS=\"/usr/lib/libgphoto2/2.2.1\" -Wall -Wmissing-declarations -Wmissing-prototypes -g   -march=athlon -O2 -pipe -fomit-frame-pointer -MT sx330z.lo -MD -MP -MF ".deps/sx330z.Tpo" -c -o sx330z.lo sx330z.c; \
        then mv -f ".deps/sx330z.Tpo" ".deps/sx330z.Plo"; else rm -f ".deps/sx330z.Tpo"; exit 1; fi
 i686-pc-linux-gnu-gcc -DHAVE_CONFIG_H -I. -I. -I../.. -I../.. -I../../libgphoto2_port/libgphoto2_port -I../../libgphoto2_port -I../../libgphoto2 -I../../libgphoto2 -DLOCALEDIR=\"/usr/share/locale\" -DCAMLIBS=\"/usr/lib/libgphoto2/2.2.1\" -Wall -Wmissing-declarations -Wmissing-prototypes -g -march=athlon -O2 -pipe -fomit-frame-pointer -MT sx330z.lo -MD -MP -MF .deps/sx330z.Tpo -c sx330z.c  -fPIC -DPIC -o .libs/sx330z.o
sx330z.c: In function 'sx330z_init':
sx330z.c:87: warning: pointer targets in passing argument 5 of 'gp_port_usb_msg_read' differ in signedness
sx330z.c: In function 'sx330z_read_block':
sx330z.c:102: warning: pointer targets in passing argument 1 of 'sx330z_fill_req' differ in signedness
sx330z.c:104: warning: pointer targets in passing argument 5 of 'gp_port_usb_msg_write' differ in signedness
sx330z.c:110: warning: pointer targets in passing argument 2 of 'gp_port_read' differ in signedness
sx330z.c: In function 'sx330z_get_toc_num_pages':
sx330z.c:128: warning: pointer targets in passing argument 5 of 'gp_port_usb_msg_read' differ in signedness
sx330z.c:131: warning: pointer targets in passing argument 1 of 'sx330z_fill_ack' differ in signedness
sx330z.c: In function 'sx330z_get_toc_page':
sx330z.c:166: warning: pointer targets in passing argument 1 of 'sx330z_fill_toc_page' differ in signedness
sx330z.c: In function 'sx330z_delete_file':
sx330z.c:268: warning: pointer targets in passing argument 1 of 'sx330z_fill_req' differ in signedness
 i686-pc-linux-gnu-gcc -DHAVE_CONFIG_H -I. -I. -I../.. -I../.. -I../../libgphoto2_port/libgphoto2_port -I../../libgphoto2_port -I../../libgphoto2 -I../../libgphoto2 -DLOCALEDIR=\"/usr/share/locale\" -DCAMLIBS=\"/usr/lib/libgphoto2/2.2.1\" -Wall -Wmissing-declarations -Wmissing-prototypes -g -march=athlon -O2 -pipe -fomit-frame-pointer -MT sx330z.lo -MD -MP -MF .deps/sx330z.Tpo -c sx330z.c -o sx330z.o >/dev/null 2>&1
/bin/sh ../../libtool --tag=CC --mode=link i686-pc-linux-gnu-gcc  -march=athlon -O2 -pipe -fomit-frame-pointer -Wall -g  -o sx330z.la -rpath /usr/lib/libgphoto2/2.2.1 -module -no-undefined -avoid-version -export-dynamic -export-symbols ../../camlibs/camlib.sym library.lo sx330z.lo ../../libgphoto2/libgphoto2.la
echo "{ global:" > .libs/sx330z.ver
 cat ../../camlibs/camlib.sym | sed -e "s/\(.*\)/\1;/" >> .libs/sx330z.ver
 echo "local: *; };" >> .libs/sx330z.ver
 i686-pc-linux-gnu-gcc -shared  .libs/library.o .libs/sx330z.o  -Wl,--rpath -Wl,/var/tmp/portage/media-libs/libgphoto2-2.2.1-r1/work/libgphoto2-2.2.1/libgphoto2/.libs ../../libgphoto2/.libs/libgphoto2.so  -march=athlon -Wl,-soname -Wl,sx330z.so -Wl,-version-script -Wl,.libs/sx330z.ver -o .libs/sx330z.so
i686-pc-linux-gnu-ar cru .libs/sx330z.a  library.o sx330z.o
i686-pc-linux-gnu-ranlib .libs/sx330z.a
creating sx330z.la
(cd .libs && rm -f sx330z.la && ln -s ../sx330z.la sx330z.la)
make[3]: Leaving directory `/var/tmp/portage/media-libs/libgphoto2-2.2.1-r1/work/libgphoto2-2.2.1/camlibs/sx330z'
Making all in template
make[3]: Entering directory `/var/tmp/portage/media-libs/libgphoto2-2.2.1-r1/work/libgphoto2-2.2.1/camlibs/template'
if /bin/sh ../../libtool --tag=CC --mode=compile i686-pc-linux-gnu-gcc -DHAVE_CONFIG_H -I. -I. -I../..  -I../.. -I../../libgphoto2_port/libgphoto2_port -I../../libgphoto2_port -I../../libgphoto2 -I../../libgphoto2 -DLOCALEDIR=\"/usr/share/locale\" -DCAMLIBS=\"/usr/lib/libgphoto2/2.2.1\" -Wall -Wmissing-declarations -Wmissing-prototypes -g   -march=athlon -O2 -pipe -fomit-frame-pointer -MT template.lo -MD -MP -MF ".deps/template.Tpo" -c -o template.lo template.c; \
        then mv -f ".deps/template.Tpo" ".deps/template.Plo"; else rm -f ".deps/template.Tpo"; exit 1; fi
mkdir .libs
 i686-pc-linux-gnu-gcc -DHAVE_CONFIG_H -I. -I. -I../.. -I../.. -I../../libgphoto2_port/libgphoto2_port -I../../libgphoto2_port -I../../libgphoto2 -I../../libgphoto2 -DLOCALEDIR=\"/usr/share/locale\" -DCAMLIBS=\"/usr/lib/libgphoto2/2.2.1\" -Wall -Wmissing-declarations -Wmissing-prototypes -g -march=athlon -O2 -pipe -fomit-frame-pointer -MT template.lo -MD -MP -MF .deps/template.Tpo -c template.c  -fPIC -DPIC -o .libs/template.o
template.c: In function 'get_file_func':
template.c:227: warning: unused variable 'camera'
template.c: In function 'put_file_func':
template.c:247: warning: unused variable 'camera'
template.c: In function 'delete_file_func':
template.c:267: warning: unused variable 'camera'
template.c: In function 'delete_all_func':
template.c:284: warning: unused variable 'camera'
template.c: In function 'get_info_func':
template.c:304: warning: unused variable 'camera'
template.c: In function 'set_info_func':
template.c:319: warning: unused variable 'camera'
template.c: In function 'folder_list_func':
template.c:336: warning: unused variable 'camera'
template.c: In function 'file_list_func':
template.c:353: warning: unused variable 'camera'
 i686-pc-linux-gnu-gcc -DHAVE_CONFIG_H -I. -I. -I../.. -I../.. -I../../libgphoto2_port/libgphoto2_port -I../../libgphoto2_port -I../../libgphoto2 -I../../libgphoto2 -DLOCALEDIR=\"/usr/share/locale\" -DCAMLIBS=\"/usr/lib/libgphoto2/2.2.1\" -Wall -Wmissing-declarations -Wmissing-prototypes -g -march=athlon -O2 -pipe -fomit-frame-pointer -MT template.lo -MD -MP -MF .deps/template.Tpo -c template.c -o template.o >/dev/null 2>&1
/bin/sh ../../libtool --tag=CC --mode=link i686-pc-linux-gnu-gcc  -march=athlon -O2 -pipe -fomit-frame-pointer -Wall -g  -o template.la  -module -no-undefined -avoid-version -export-dynamic -export-symbols ../../camlibs/camlib.sym template.lo ../../libgphoto2/libgphoto2.la
i686-pc-linux-gnu-ar cru .libs/template.a .libs/template.o
i686-pc-linux-gnu-ranlib .libs/template.a
creating template.la
(cd .libs && rm -f template.la && ln -s ../template.la template.la)
make[3]: Leaving directory `/var/tmp/portage/media-libs/libgphoto2-2.2.1-r1/work/libgphoto2-2.2.1/camlibs/template'
Making all in toshiba
make[3]: Entering directory `/var/tmp/portage/media-libs/libgphoto2-2.2.1-r1/work/libgphoto2-2.2.1/camlibs/toshiba'
Making all in pdrm11
make[4]: Entering directory `/var/tmp/portage/media-libs/libgphoto2-2.2.1-r1/work/libgphoto2-2.2.1/camlibs/toshiba/pdrm11'
if /bin/sh ../../../libtool --tag=CC --mode=compile i686-pc-linux-gnu-gcc -DHAVE_CONFIG_H -I. -I. -I../../..  -I../../.. -I../../../libgphoto2_port/libgphoto2_port -I../../../libgphoto2_port -I../../../libgphoto2 -I../../../libgphoto2 -DLOCALEDIR=\"/usr/share/locale\" -DCAMLIBS=\"/usr/lib/libgphoto2/2.2.1\" -Wall -Wmissing-declarations -Wmissing-prototypes -g   -march=athlon -O2 -pipe -fomit-frame-pointer -MT library.lo -MD -MP -MF ".deps/library.Tpo" -c -o library.lo library.c; \
        then mv -f ".deps/library.Tpo" ".deps/library.Plo"; else rm -f ".deps/library.Tpo"; exit 1; fi
mkdir .libs
 i686-pc-linux-gnu-gcc -DHAVE_CONFIG_H -I. -I. -I../../.. -I../../.. -I../../../libgphoto2_port/libgphoto2_port -I../../../libgphoto2_port -I../../../libgphoto2 -I../../../libgphoto2 -DLOCALEDIR=\"/usr/share/locale\" -DCAMLIBS=\"/usr/lib/libgphoto2/2.2.1\" -Wall -Wmissing-declarations -Wmissing-prototypes -g -march=athlon -O2 -pipe -fomit-frame-pointer -MT library.lo -MD -MP -MF .deps/library.Tpo -c library.c  -fPIC -DPIC -o .libs/library.o
library.c: In function 'camera_init':
library.c:145: warning: unused variable 'ret'
 i686-pc-linux-gnu-gcc -DHAVE_CONFIG_H -I. -I. -I../../.. -I../../.. -I../../../libgphoto2_port/libgphoto2_port -I../../../libgphoto2_port -I../../../libgphoto2 -I../../../libgphoto2 -DLOCALEDIR=\"/usr/share/locale\" -DCAMLIBS=\"/usr/lib/libgphoto2/2.2.1\" -Wall -Wmissing-declarations -Wmissing-prototypes -g -march=athlon -O2 -pipe -fomit-frame-pointer -MT library.lo -MD -MP -MF .deps/library.Tpo -c library.c -o library.o >/dev/null 2>&1
if /bin/sh ../../../libtool --tag=CC --mode=compile i686-pc-linux-gnu-gcc -DHAVE_CONFIG_H -I. -I. -I../../..  -I../../.. -I../../../libgphoto2_port/libgphoto2_port -I../../../libgphoto2_port -I../../../libgphoto2 -I../../../libgphoto2 -DLOCALEDIR=\"/usr/share/locale\" -DCAMLIBS=\"/usr/lib/libgphoto2/2.2.1\" -Wall -Wmissing-declarations -Wmissing-prototypes -g   -march=athlon -O2 -pipe -fomit-frame-pointer -MT pdrm11.lo -MD -MP -MF ".deps/pdrm11.Tpo" -c -o pdrm11.lo pdrm11.c; \
        then mv -f ".deps/pdrm11.Tpo" ".deps/pdrm11.Plo"; else rm -f ".deps/pdrm11.Tpo"; exit 1; fi
 i686-pc-linux-gnu-gcc -DHAVE_CONFIG_H -I. -I. -I../../.. -I../../.. -I../../../libgphoto2_port/libgphoto2_port -I../../../libgphoto2_port -I../../../libgphoto2 -I../../../libgphoto2 -DLOCALEDIR=\"/usr/share/locale\" -DCAMLIBS=\"/usr/lib/libgphoto2/2.2.1\" -Wall -Wmissing-declarations -Wmissing-prototypes -g -march=athlon -O2 -pipe -fomit-frame-pointer -MT pdrm11.lo -MD -MP -MF .deps/pdrm11.Tpo -c pdrm11.c  -fPIC -DPIC -o .libs/pdrm11.o
pdrm11.c: In function 'pdrm11_init':
pdrm11.c:42: warning: pointer targets in passing argument 5 of 'gp_port_usb_msg_read' differ in signedness
pdrm11.c:44: warning: pointer targets in passing argument 5 of 'gp_port_usb_msg_read' differ in signedness
pdrm11.c:46: warning: pointer targets in passing argument 5 of 'gp_port_usb_msg_read' differ in signedness
pdrm11.c:48: warning: pointer targets in passing argument 5 of 'gp_port_usb_msg_read' differ in signedness
pdrm11.c:50: warning: pointer targets in passing argument 5 of 'gp_port_usb_msg_read' differ in signedness
pdrm11.c:65: warning: pointer targets in passing argument 5 of 'gp_port_usb_msg_read' differ in signedness
pdrm11.c: In function 'pdrm11_get_file':
pdrm11.c:166: warning: pointer targets in passing argument 5 of 'gp_port_usb_msg_read' differ in signedness
pdrm11.c:166: warning: pointer targets in passing argument 5 of 'gp_port_usb_msg_read' differ in signedness
pdrm11.c:169: warning: pointer targets in passing argument 5 of 'gp_port_usb_msg_read' differ in signedness
pdrm11.c:169: warning: pointer targets in passing argument 5 of 'gp_port_usb_msg_read' differ in signedness
pdrm11.c:186: warning: pointer targets in passing argument 5 of 'gp_port_usb_msg_read' differ in signedness
pdrm11.c:186: warning: pointer targets in passing argument 5 of 'gp_port_usb_msg_read' differ in signedness
pdrm11.c:207: warning: pointer targets in passing argument 2 of 'gp_port_read' differ in signedness
pdrm11.c:210: warning: pointer targets in passing argument 2 of 'gp_port_read' differ in signedness
pdrm11.c:228: warning: pointer targets in passing argument 2 of 'gp_file_set_data_and_size' differ in signedness
pdrm11.c: In function 'pdrm11_delete_file':
pdrm11.c:245: warning: pointer targets in passing argument 5 of 'gp_port_usb_msg_read' differ in signedness
 i686-pc-linux-gnu-gcc -DHAVE_CONFIG_H -I. -I. -I../../.. -I../../.. -I../../../libgphoto2_port/libgphoto2_port -I../../../libgphoto2_port -I../../../libgphoto2 -I../../../libgphoto2 -DLOCALEDIR=\"/usr/share/locale\" -DCAMLIBS=\"/usr/lib/libgphoto2/2.2.1\" -Wall -Wmissing-declarations -Wmissing-prototypes -g -march=athlon -O2 -pipe -fomit-frame-pointer -MT pdrm11.lo -MD -MP -MF .deps/pdrm11.Tpo -c pdrm11.c -o pdrm11.o >/dev/null 2>&1
/bin/sh ../../../libtool --tag=CC --mode=link i686-pc-linux-gnu-gcc  -march=athlon -O2 -pipe -fomit-frame-pointer -Wall -g  -o toshiba_pdrm11.la -rpath /usr/lib/libgphoto2/2.2.1 -module -no-undefined -avoid-version -export-dynamic -export-symbols ../../../camlibs/camlib.sym library.lo pdrm11.lo ../../../libgphoto2/libgphoto2.la
echo "{ global:" > .libs/toshiba_pdrm11.ver
 cat ../../../camlibs/camlib.sym | sed -e "s/\(.*\)/\1;/" >> .libs/toshiba_pdrm11.ver
 echo "local: *; };" >> .libs/toshiba_pdrm11.ver
 i686-pc-linux-gnu-gcc -shared  .libs/library.o .libs/pdrm11.o  -Wl,--rpath -Wl,/var/tmp/portage/media-libs/libgphoto2-2.2.1-r1/work/libgphoto2-2.2.1/libgphoto2/.libs ../../../libgphoto2/.libs/libgphoto2.so  -march=athlon -Wl,-soname -Wl,toshiba_pdrm11.so -Wl,-version-script -Wl,.libs/toshiba_pdrm11.ver -o .libs/toshiba_pdrm11.so
i686-pc-linux-gnu-ar cru .libs/toshiba_pdrm11.a  library.o pdrm11.o
i686-pc-linux-gnu-ranlib .libs/toshiba_pdrm11.a
creating toshiba_pdrm11.la
(cd .libs && rm -f toshiba_pdrm11.la && ln -s ../toshiba_pdrm11.la toshiba_pdrm11.la)
make[4]: Leaving directory `/var/tmp/portage/media-libs/libgphoto2-2.2.1-r1/work/libgphoto2-2.2.1/camlibs/toshiba/pdrm11'
make[4]: Entering directory `/var/tmp/portage/media-libs/libgphoto2-2.2.1-r1/work/libgphoto2-2.2.1/camlibs/toshiba'
make[4]: Nothing to be done for `all-am'.
make[4]: Leaving directory `/var/tmp/portage/media-libs/libgphoto2-2.2.1-r1/work/libgphoto2-2.2.1/camlibs/toshiba'
make[3]: Leaving directory `/var/tmp/portage/media-libs/libgphoto2-2.2.1-r1/work/libgphoto2-2.2.1/camlibs/toshiba'
make[3]: Entering directory `/var/tmp/portage/media-libs/libgphoto2-2.2.1-r1/work/libgphoto2-2.2.1/camlibs'
make[3]: Nothing to be done for `all-am'.
make[3]: Leaving directory `/var/tmp/portage/media-libs/libgphoto2-2.2.1-r1/work/libgphoto2-2.2.1/camlibs'
make[2]: Leaving directory `/var/tmp/portage/media-libs/libgphoto2-2.2.1-r1/work/libgphoto2-2.2.1/camlibs'
Making all in tests
make[2]: Entering directory `/var/tmp/portage/media-libs/libgphoto2-2.2.1-r1/work/libgphoto2-2.2.1/tests'
if i686-pc-linux-gnu-gcc -DHAVE_CONFIG_H -I. -I. -I..  -I.. -I../libgphoto2_port/libgphoto2_port -I../libgphoto2_port -I../libgphoto2 -I../libgphoto2 -DLOCALEDIR=\"/usr/share/locale\" -DCAMLIBS=\"/usr/lib/libgphoto2/2.2.1\" -Wall -Wmissing-declarations -Wmissing-prototypes -g   -march=athlon -O2 -pipe -fomit-frame-pointer -MT test-gphoto2.o -MD -MP -MF ".deps/test-gphoto2.Tpo" -c -o test-gphoto2.o test-gphoto2.c; \
        then mv -f ".deps/test-gphoto2.Tpo" ".deps/test-gphoto2.Po"; else rm -f ".deps/test-gphoto2.Tpo"; exit 1; fi
/bin/sh ../libtool --tag=CC --mode=link i686-pc-linux-gnu-gcc  -march=athlon -O2 -pipe -fomit-frame-pointer -Wall -g  -o test-gphoto2  test-gphoto2.o ../libgphoto2/libgphoto2.la ../libgphoto2_port/libgphoto2_port/libgphoto2_port.la -lexif -lm
mkdir .libs
i686-pc-linux-gnu-gcc -march=athlon -O2 -pipe -fomit-frame-pointer -Wall -g -o .libs/test-gphoto2 test-gphoto2.o  ../libgphoto2/.libs/libgphoto2.so ../libgphoto2_port/libgphoto2_port/.libs/libgphoto2_port.so /usr/lib/libexif.so -lm
creating test-gphoto2
if i686-pc-linux-gnu-gcc -DHAVE_CONFIG_H -I. -I. -I..  -I.. -I../libgphoto2_port/libgphoto2_port -I../libgphoto2_port -I../libgphoto2 -I../libgphoto2 -DLOCALEDIR=\"/usr/share/locale\" -DCAMLIBS=\"/usr/lib/libgphoto2/2.2.1\" -Wall -Wmissing-declarations -Wmissing-prototypes -g   -march=athlon -O2 -pipe -fomit-frame-pointer -MT test-filesys.o -MD -MP -MF ".deps/test-filesys.Tpo" -c -o test-filesys.o test-filesys.c; \
        then mv -f ".deps/test-filesys.Tpo" ".deps/test-filesys.Po"; else rm -f ".deps/test-filesys.Tpo"; exit 1; fi
/bin/sh ../libtool --tag=CC --mode=link i686-pc-linux-gnu-gcc  -march=athlon -O2 -pipe -fomit-frame-pointer -Wall -g  -o test-filesys  test-filesys.o ../libgphoto2/libgphoto2.la ../libgphoto2_port/libgphoto2_port/libgphoto2_port.la -lexif -lm
i686-pc-linux-gnu-gcc -march=athlon -O2 -pipe -fomit-frame-pointer -Wall -g -o .libs/test-filesys test-filesys.o  ../libgphoto2/.libs/libgphoto2.so ../libgphoto2_port/libgphoto2_port/.libs/libgphoto2_port.so /usr/lib/libexif.so -lm
creating test-filesys
make[2]: Leaving directory `/var/tmp/portage/media-libs/libgphoto2-2.2.1-r1/work/libgphoto2-2.2.1/tests'
Making all in po
make[2]: Entering directory `/var/tmp/portage/media-libs/libgphoto2-2.2.1-r1/work/libgphoto2-2.2.1/po'
make[2]: Nothing to be done for `all'.
make[2]: Leaving directory `/var/tmp/portage/media-libs/libgphoto2-2.2.1-r1/work/libgphoto2-2.2.1/po'
Making all in packaging
make[2]: Entering directory `/var/tmp/portage/media-libs/libgphoto2-2.2.1-r1/work/libgphoto2-2.2.1/packaging'
Making all in linux-hotplug
make[3]: Entering directory `/var/tmp/portage/media-libs/libgphoto2-2.2.1-r1/work/libgphoto2-2.2.1/packaging/linux-hotplug'
if i686-pc-linux-gnu-gcc -DHAVE_CONFIG_H -I. -I. -I../.. -I../../libgphoto2 -I../../libgphoto2_port/libgphoto2_port -I../.. -I../../libgphoto2_port/libgphoto2_port -I../../libgphoto2_port -I../../libgphoto2 -I../../libgphoto2 -DLOCALEDIR=\"/usr/share/locale\" -DCAMLIBS=\"/usr/lib/libgphoto2/2.2.1\" -Wall -Wmissing-declarations -Wmissing-prototypes -g   -march=athlon -O2 -pipe -fomit-frame-pointer -MT print-usb-usermap.o -MD -MP -MF ".deps/print-usb-usermap.Tpo" -c -o print-usb-usermap.o print-usb-usermap.c; \
        then mv -f ".deps/print-usb-usermap.Tpo" ".deps/print-usb-usermap.Po"; else rm -f ".deps/print-usb-usermap.Tpo"; exit 1; fi
/bin/sh ../../libtool --tag=CC --mode=link i686-pc-linux-gnu-gcc  -march=athlon -O2 -pipe -fomit-frame-pointer -Wall -g  -o print-usb-usermap  print-usb-usermap.o ../../libgphoto2/libgphoto2.la ../../libgphoto2_port/libgphoto2_port/libgphoto2_port.la -lexif -lm
mkdir .libs
i686-pc-linux-gnu-gcc -march=athlon -O2 -pipe -fomit-frame-pointer -Wall -g -o .libs/print-usb-usermap print-usb-usermap.o  ../../libgphoto2/.libs/libgphoto2.so ../../libgphoto2_port/libgphoto2_port/.libs/libgphoto2_port.so /usr/lib/libexif.so -lm
creating print-usb-usermap
make[3]: Leaving directory `/var/tmp/portage/media-libs/libgphoto2-2.2.1-r1/work/libgphoto2-2.2.1/packaging/linux-hotplug'
Making all in generic
make[3]: Entering directory `/var/tmp/portage/media-libs/libgphoto2-2.2.1-r1/work/libgphoto2-2.2.1/packaging/generic'
 cd ../.. && /bin/sh /var/tmp/portage/media-libs/libgphoto2-2.2.1-r1/work/libgphoto2-2.2.1/missing --run automake-1.9 --gnu  packaging/generic/Makefile
configure.in:330: error: AC_SUBST: `apidocdir}' is not a valid shell variable name
libgphoto2_port/m4/gp-documentation.m4:60: GP_BUILD_GTK_DOCS is expanded from...
configure.in:330: the top level
autom4te-2.62: /usr/bin/m4 failed with exit status: 1
automake-1.9: autoconf failed with exit status: 1
make[3]: *** [Makefile.in] Error 1
make[3]: Leaving directory `/var/tmp/portage/media-libs/libgphoto2-2.2.1-r1/work/libgphoto2-2.2.1/packaging/generic'
make[2]: *** [all-recursive] Error 1
make[2]: Leaving directory `/var/tmp/portage/media-libs/libgphoto2-2.2.1-r1/work/libgphoto2-2.2.1/packaging'
make[1]: *** [all-recursive] Error 1
make[1]: Leaving directory `/var/tmp/portage/media-libs/libgphoto2-2.2.1-r1/work/libgphoto2-2.2.1'
make: *** [all] Error 2
 *
 * ERROR: media-libs/libgphoto2-2.2.1-r1 failed.
 * Call stack:
 *               ebuild.sh, line   49:  Called src_compile
 *             environment, line 2529:  Called die
 * The specific snippet of code:
 *       emake -j1 apidocdir=/usr/share/doc/${PF}/api || die "make failed"
 *  The die message:
 *   make failed
 *
 * If you need support, post the topmost build error, and the call stack if relevant.
 * A complete build log is located at '/var/tmp/portage/media-libs/libgphoto2-2.2.1-r1/temp/build.log'.
 * The ebuild environment file is located at '/var/tmp/portage/media-libs/libgphoto2-2.2.1-r1/temp/environment'.
 *

 * Messages for package media-libs/libgphoto2-2.2.1-r1:

 * All camera drivers will be built since you did not specify
 * via the CAMERAS variable what camera you use.
 * libgphoto2 supports: all adc65 agfa-cl20 aox barbie canon casio clicksmart310
 *      digigr8 digita dimera directory enigma13 fuji gsmart300 hp215 iclick jamcam
 *      jd11 kodak konica largan lg_gsm mars minolta mustek panasonic pccam300
 *      pccam600 polaroid ptp2 ricoh samsung sierra sipix smal sonix sonydscf1
 *      sonydscf55 soundvision spca50x sq905 stv0674 stv0680 sx330z template
 *      toshiba
 *
 * ERROR: media-libs/libgphoto2-2.2.1-r1 failed.
 * Call stack:
 *               ebuild.sh, line   49:  Called src_compile
 *             environment, line 2529:  Called die
 * The specific snippet of code:
 *       emake -j1 apidocdir=/usr/share/doc/${PF}/api || die "make failed"
 *  The die message:
 *   make failed
 *
 * If you need support, post the topmost build error, and the call stack if relevant.
 * A complete build log is located at '/var/tmp/portage/media-libs/libgphoto2-2.2.1-r1/temp/build.log'.
 * The ebuild environment file is located at '/var/tmp/portage/media-libs/libgphoto2-2.2.1-r1/temp/environment'.
 *

 * Regenerating GNU info directory index...
 * Processed 176 info files.

 * IMPORTANT: 1 config files in '/etc' need updating.
 * See the CONFIGURATION FILES section of the emerge
 * man page to learn how to update config files.