All pastes #981361 Raw Edit

Mine

public text v1 · immutable
·published 2008-04-11 19:00 UTC
rendered paste body
utom4te-2.62: /usr/bin/m4 failed with exit status: 1
automake-1.9: autoconf failed with exit status: 1
make[3]: *** [Makefile.in] Error 1
make[3]: Leaving directory `/var/tmp/portage/media-libs/libgphoto2-2.2.1-r1/work/libgphoto2-2.2.1/packaging/generic'
make[2]: *** [all-recursive] Error 1
make[2]: Leaving directory `/var/tmp/portage/media-libs/libgphoto2-2.2.1-r1/work/libgphoto2-2.2.1/packaging'
make[1]: *** [all-recursive] Error 1
make[1]: Leaving directory `/var/tmp/portage/media-libs/libgphoto2-2.2.1-r1/work/libgphoto2-2.2.1'
make: *** [all] Error 2
 *
 * ERROR: media-libs/libgphoto2-2.2.1-r1 failed.
 * Call stack:
 *               ebuild.sh, line   49:  Called src_compile
 *             environment, line 2529:  Called die
 * The specific snippet of code:
 *       emake -j1 apidocdir=/usr/share/doc/${PF}/api || die "make failed"
 *  The die message:
 *   make failed
 *
 * If you need support, post the topmost build error, and the call stack if relevant.
 * A complete build log is located at '/var/tmp/portage/media-libs/libgphoto2-2.2.1-r1/temp/build.log'.
 * The ebuild environment file is located at '/var/tmp/portage/media-libs/libgphoto2-2.2.1-r1/temp/environment'.
 *

 * Messages for package media-libs/libgphoto2-2.2.1-r1:

 * All camera drivers will be built since you did not specify
 * via the CAMERAS variable what camera you use.
 * libgphoto2 supports: all adc65 agfa-cl20 aox barbie canon casio clicksmart310
 *      digigr8 digita dimera directory enigma13 fuji gsmart300 hp215 iclick jamcam
 *      jd11 kodak konica largan lg_gsm mars minolta mustek panasonic pccam300
 *      pccam600 polaroid ptp2 ricoh samsung sierra sipix smal sonix sonydscf1
 *      sonydscf55 soundvision spca50x sq905 stv0674 stv0680 sx330z template
 *      toshiba
 *
 * ERROR: media-libs/libgphoto2-2.2.1-r1 failed.
 * Call stack:
 *               ebuild.sh, line   49:  Called src_compile
 *             environment, line 2529:  Called die
 * The specific snippet of code:
 *       emake -j1 apidocdir=/usr/share/doc/${PF}/api || die "make failed"
 *  The die message:
 *   make failed
 *
 * If you need support, post the topmost build error, and the call stack if relevant.
 * A complete build log is located at '/var/tmp/portage/media-libs/libgphoto2-2.2.1-r1/temp/build.log'.
 * The ebuild environment file is located at '/var/tmp/portage/media-libs/libgphoto2-2.2.1-r1/temp/environment'.
 *

 * Regenerating GNU info directory index...
 * Processed 176 info files.

 * IMPORTANT: 1 config files in '/etc' need updating.
 * See the CONFIGURATION FILES section of the emerge
 * man page to learn how to update config files.