All pastes #980815 Raw Edit

Miscellany

public text v1 · immutable
·published 2008-04-11 09:15 UTC
rendered paste body
 x86_64-pc-linux-gnu-gcc -DHAVE_CONFIG_H -I. -I../.. -I/usr/include/libxml2 -I/usr/include/startup-notification-1.0 -I/usr/include/compiz -I/usr/include/libxml2 -I/usr/include/startup-notification-1.0 -I/usr/include/compiz -DDATADIR=\"\" -DLIBDIR=\"/usr/lib64\" -DLOCALEDIR=\"/usr/share/locale\" -DIMAGEDIR=\"/usr/share/compiz\" -I../../include -Os -march=k8 -pipe -Wall -Wpointer-arith -Wstrict-prototypes -Wmissing-prototypes -Wmissing-declarations -Wnested-externs -fno-strict-aliasing -MT 3d.lo -MD -MP -MF .deps/3d.Tpo -c 3d.c  -fPIC -DPIC -o .libs/3d.o
3d.c:40:25: error: compiz-core.h: No such file or directory
3d.c:41:25: error: compiz-cube.h: No such file or directory
In file included from 3d.c:42:
3d_options.h:23: error: expected ‘=’, ‘,’, ‘;’, ‘asm’ or ‘__attribute__’ before ‘*’ token
3d_options.h:30: error: expected ‘)’ before ‘*’ token
3d_options.h:32: error: expected ‘=’, ‘,’, ‘;’, ‘asm’ or ‘__attribute__’ before ‘*’ token
3d_options.h:52: error: expected ‘)’ before ‘*’ token
3d_options.h:54: error: expected ‘=’, ‘,’, ‘;’, ‘asm’ or ‘__attribute__’ before ‘*’ token
3d_options.h:56: error: expected ‘=’, ‘,’, ‘;’, ‘asm’ or ‘__attribute__’ before ‘*’ token
3d_options.h:57: error: expected ‘=’, ‘,’, ‘;’, ‘asm’ or ‘__attribute__’ before ‘*’ token
3d_options.h:58: error: expected ‘)’ before ‘*’ token
3d_options.h:60: error: expected ‘)’ before ‘*’ token
3d_options.h:61: error: expected ‘=’, ‘,’, ‘;’, ‘asm’ or ‘__attribute__’ before ‘*’ token
3d_options.h:62: error: expected ‘)’ before ‘*’ token
3d_options.h:64: error: expected ‘)’ before ‘*’ token
3d_options.h:65: error: expected ‘=’, ‘,’, ‘;’, ‘asm’ or ‘__attribute__’ before ‘*’ token
3d_options.h:66: error: expected ‘)’ before ‘*’ token
3d_options.h:68: error: expected ‘)’ before ‘*’ token
3d_options.h:69: error: expected ‘=’, ‘,’, ‘;’, ‘asm’ or ‘__attribute__’ before ‘*’ token
3d_options.h:70: error: expected ‘)’ before ‘*’ token
3d_options.h:72: error: expected ‘=’, ‘,’, ‘;’, ‘asm’ or ‘__attribute__’ before ‘tdGetManualOnly’
3d_options.h:73: error: expected ‘=’, ‘,’, ‘;’, ‘asm’ or ‘__attribute__’ before ‘*’ token
3d_options.h:74: error: expected ‘)’ before ‘*’ token
3d_options.h:76: error: expected ‘)’ before ‘*’ token
3d_options.h:77: error: expected ‘=’, ‘,’, ‘;’, ‘asm’ or ‘__attribute__’ before ‘*’ token
3d_options.h:78: error: expected ‘)’ before ‘*’ token
3d_options.h:80: error: expected ‘)’ before ‘*’ token
3d_options.h:81: error: expected ‘=’, ‘,’, ‘;’, ‘asm’ or ‘__attribute__’ before ‘*’ token
3d_options.h:82: error: expected ‘)’ before ‘*’ token
3d_options.h:84: error: expected ‘)’ before ‘*’ token
3d_options.h:85: error: expected ‘)’ before ‘*’ token
3d_options.h:86: error: expected ‘)’ before ‘*’ token
3d_options.h:87: error: expected ‘)’ before ‘*’ token
3d_options.h:88: error: expected ‘)’ before ‘*’ token
3d_options.h:89: error: expected ‘=’, ‘,’, ‘;’, ‘asm’ or ‘__attribute__’ before ‘*’ token
3d_options.h:90: error: expected ‘)’ before ‘*’ token
3d_options.h:92: error: expected ‘)’ before ‘*’ token
3d_options.h:93: error: expected ‘)’ before ‘*’ token
3d_options.h:94: error: expected ‘)’ before ‘*’ token
3d_options.h:95: error: expected ‘)’ before ‘*’ token
3d_options.h:96: error: expected ‘)’ before ‘*’ token
3d_options.h:97: error: expected ‘=’, ‘,’, ‘;’, ‘asm’ or ‘__attribute__’ before ‘*’ token
3d_options.h:98: error: expected ‘)’ before ‘*’ token
3d_options.h:100: error: expected ‘=’, ‘,’, ‘;’, ‘asm’ or ‘__attribute__’ before ‘tdGetBevelTopleft’
3d_options.h:101: error: expected ‘=’, ‘,’, ‘;’, ‘asm’ or ‘__attribute__’ before ‘*’ token
3d_options.h:102: error: expected ‘)’ before ‘*’ token
3d_options.h:104: error: expected ‘=’, ‘,’, ‘;’, ‘asm’ or ‘__attribute__’ before ‘tdGetBevelTopright’
3d_options.h:105: error: expected ‘=’, ‘,’, ‘;’, ‘asm’ or ‘__attribute__’ before ‘*’ token
3d_options.h:106: error: expected ‘)’ before ‘*’ token
3d_options.h:108: error: expected ‘=’, ‘,’, ‘;’, ‘asm’ or ‘__attribute__’ before ‘tdGetBevelBottomleft’
3d_options.h:109: error: expected ‘=’, ‘,’, ‘;’, ‘asm’ or ‘__attribute__’ before ‘*’ token
3d_options.h:110: error: expected ‘)’ before ‘*’ token
3d_options.h:112: error: expected ‘=’, ‘,’, ‘;’, ‘asm’ or ‘__attribute__’ before ‘tdGetBevelBottomright’
3d_options.h:113: error: expected ‘=’, ‘,’, ‘;’, ‘asm’ or ‘__attribute__’ before ‘*’ token
3d_options.h:114: error: expected ‘)’ before ‘*’ token
3d.c:56: error: expected specifier-qualifier-list before ‘Bool’
3d.c:69: error: expected specifier-qualifier-list before ‘PreparePaintScreenProc’
3d.c:111: error: expected ‘=’, ‘,’, ‘;’, ‘asm’ or ‘__attribute__’ before ‘windowIs3D’
3d.c:130: error: expected ‘)’ before ‘*’ token
3d.c:191: error: expected ‘=’, ‘,’, ‘;’, ‘asm’ or ‘__attribute__’ before ‘tdPaintWindow’
3d.c:225: error: expected ‘=’, ‘,’, ‘;’, ‘asm’ or ‘__attribute__’ before ‘tdPaintWindowWithDepth’
3d.c:413: error: expected ‘=’, ‘,’, ‘;’, ‘asm’ or ‘__attribute__’ before ‘tdPaintWindow’
3d.c:461: error: expected ‘)’ before ‘*’ token
3d.c:477: error: expected ‘)’ before ‘*’ token
3d.c:494: error: expected ‘)’ before ‘*’ token
3d.c:655: error: expected ‘=’, ‘,’, ‘;’, ‘asm’ or ‘__attribute__’ before ‘tdPaintOutput’
3d.c:680: error: expected ‘)’ before ‘*’ token
3d.c:692: error: expected ‘=’, ‘,’, ‘;’, ‘asm’ or ‘__attribute__’ before ‘*’ token
3d.c:699: error: expected ‘=’, ‘,’, ‘;’, ‘asm’ or ‘__attribute__’ before ‘*’ token
3d.c:706: error: expected ‘=’, ‘,’, ‘;’, ‘asm’ or ‘__attribute__’ before ‘*’ token
3d.c:713: error: expected ‘=’, ‘,’, ‘;’, ‘asm’ or ‘__attribute__’ before ‘*’ token
3d.c:721: error: expected ‘)’ before ‘*’ token
3d.c:741: error: expected ‘=’, ‘,’, ‘;’, ‘asm’ or ‘__attribute__’ before ‘tdInitDisplay’
3d.c:772: error: expected ‘)’ before ‘*’ token
3d.c:783: error: expected ‘=’, ‘,’, ‘;’, ‘asm’ or ‘__attribute__’ before ‘tdInitScreen’
3d.c:825: error: expected ‘)’ before ‘*’ token
3d.c:845: error: expected ‘=’, ‘,’, ‘;’, ‘asm’ or ‘__attribute__’ before ‘tdInitWindow’
3d.c:867: error: expected ‘)’ before ‘*’ token
3d.c:876: error: expected ‘=’, ‘,’, ‘;’, ‘asm’ or ‘__attribute__’ before ‘tdInit’
3d.c:886: error: expected ‘)’ before ‘*’ token
3d.c:892: error: expected ‘=’, ‘,’, ‘;’, ‘asm’ or ‘__attribute__’ before ‘tdInitObject’
3d.c:906: error: expected ‘)’ before ‘*’ token
3d.c:919: error: expected ‘=’, ‘,’, ‘;’, ‘asm’ or ‘__attribute__’ before ‘tdVTable’
3d.c:930: error: expected ‘=’, ‘,’, ‘;’, ‘asm’ or ‘__attribute__’ before ‘*’ token
make[3]: *** [3d.lo] Error 1
make[3]: *** Waiting for unfinished jobs....
 x86_64-pc-linux-gnu-gcc -DHAVE_CONFIG_H -I. -I../.. -I/usr/include/libxml2 -I/usr/include/startup-notification-1.0 -I/usr/include/compiz -I/usr/include/libxml2 -I/usr/include/startup-notification-1.0 -I/usr/include/compiz -DDATADIR=\"\" -DLIBDIR=\"/usr/lib64\" -DLOCALEDIR=\"/usr/share/locale\" -DIMAGEDIR=\"/usr/share/compiz\" -I../../include -Os -march=k8 -pipe -Wall -Wpointer-arith -Wstrict-prototypes -Wmissing-prototypes -Wmissing-declarations -Wnested-externs -fno-strict-aliasing -MT 3d_options.lo -MD -MP -MF .deps/3d_options.Tpo -c 3d_options.c  -fPIC -DPIC -o .libs/3d_options.o
 x86_64-pc-linux-gnu-gcc -DHAVE_CONFIG_H -I. -I../.. -I/usr/include/libxml2 -I/usr/include/startup-notification-1.0 -I/usr/include/compiz -I/usr/include/libxml2 -I/usr/include/startup-notification-1.0 -I/usr/include/compiz -DDATADIR=\"\" -DLIBDIR=\"/usr/lib64\" -DLOCALEDIR=\"/usr/share/locale\" -DIMAGEDIR=\"/usr/share/compiz\" -I../../include -Os -march=k8 -pipe -Wall -Wpointer-arith -Wstrict-prototypes -Wmissing-prototypes -Wmissing-declarations -Wnested-externs -fno-strict-aliasing -MT 3d_options.lo -MD -MP -MF .deps/3d_options.Tpo -c 3d_options.c -o 3d_options.o >/dev/null 2>&1
make[2]: *** [all-recursive] Error 1
make[1]: *** [all-recursive] Error 1
make: *** [all] Error 2
 * 
 * ERROR: x11-plugins/compiz-fusion-plugins-extra-0.7.2 failed.
 * Call stack:
 *               ebuild.sh, line   49:  Called src_compile
 *             environment, line  179:  Called die
 * The specific snippet of code:
 *           emake || die "emake failed";
 *  The die message:
 *   emake failed