All pastes #980007 Raw Edit

Something

public text v1 · immutable
·published 2008-04-10 19:01 UTC
rendered paste body
 * [UFO] src/client/cl_actor.c
In file included from src/client/../common/common.h:29,
                 from src/client/cl_renderer.h:31,
                 from src/client/client.h:32,
                 from src/client/cl_actor.c:25:
src/client/../common/../game/q_shared.h:66:31: error: ../shared/defines.h: No such file or directory
In file included from src/client/../common/common.h:31,
                 from src/client/cl_renderer.h:31,
                 from src/client/client.h:32,
                 from src/client/cl_actor.c:25:
src/client/../common/../game/game.h:33:31: error: ../shared/typedefs.h: No such file or directory
src/client/../common/../game/game.h:34:30: error: ../common/tracing.h: No such file or directory
In file included from src/client/../common/common.h:31,
                 from src/client/cl_renderer.h:31,
                 from src/client/client.h:32,
                 from src/client/cl_actor.c:25:
src/client/../common/../game/game.h:149: error: expected specifier-qualifier-list before 'trace_t'
In file included from src/client/../common/common.h:33,
                 from src/client/cl_renderer.h:31,
                 from src/client/client.h:32,
                 from src/client/cl_actor.c:25:
src/client/../common/http.h:38: error: 'MAX_QPATH' undeclared here (not in a function)
src/client/../common/http.h:44: error: 'MAX_OSPATH' undeclared here (not in a function)
In file included from src/client/../common/cmodel.h:29,
                 from src/client/../common/common.h:219,
                 from src/client/cl_renderer.h:31,
                 from src/client/client.h:32,
                 from src/client/cl_actor.c:25:
src/client/../common/../common/qfiles.h:32:31: error: ../shared/defines.h: No such file or directory
In file included from src/client/../common/cmodel.h:29,
                 from src/client/../common/common.h:219,
                 from src/client/cl_renderer.h:31,
                 from src/client/client.h:32,
                 from src/client/cl_actor.c:25:
src/client/../common/../common/qfiles.h:391: error: 'HEADER_LUMPS' undeclared here (not in a function)
In file included from src/client/../common/common.h:219,
                 from src/client/cl_renderer.h:31,
                 from src/client/client.h:32,
                 from src/client/cl_actor.c:25:
src/client/../common/cmodel.h:35: error: expected '=', ',', ';', 'asm' or '__attribute__' before '*' token
src/client/../common/cmodel.h:50: error: expected '=', ',', ';', 'asm' or '__attribute__' before 'CM_CompleteBoxTrace'
src/client/../common/cmodel.h:51: error: expected '=', ',', ';', 'asm' or '__attribute__' before 'CM_TransformedBoxTrace'
In file included from src/client/../common/common.h:221,
                 from src/client/cl_renderer.h:31,
                 from src/client/client.h:32,
                 from src/client/cl_actor.c:25:
src/client/../common/filesys.h:32:31: error: ../shared/defines.h: No such file or directory
src/client/../common/filesys.h:33:32: error: ../shared/typedefs.h: No such file or directory
In file included from src/client/../common/common.h:221,
                 from src/client/cl_renderer.h:31,
                 from src/client/client.h:32,
                 from src/client/cl_actor.c:25:
src/client/../common/filesys.h:41: error: 'MAX_MAPS' undeclared here (not in a function)
src/client/../common/filesys.h:44: error: expected ')' before '*' token
src/client/../common/filesys.h:45: error: expected declaration specifiers or '...' before 'qFILE'
src/client/../common/filesys.h:46: error: expected ')' before '*' token
src/client/../common/filesys.h:48: error: expected declaration specifiers or '...' before 'qFILE'
src/client/../common/filesys.h:61: error: expected declaration specifiers or '...' before 'qFILE'
src/client/../common/filesys.h:62: error: expected ')' before '*' token
src/client/../common/filesys.h:77: error: expected declaration specifiers or '...' before 'qFILE'
In file included from src/client/cl_renderer.h:31,
                 from src/client/client.h:32,
                 from src/client/cl_actor.c:25:
src/client/../common/common.h:250: error: expected ')' before '*' token
In file included from src/client/cl_renderer.h:31,
                 from src/client/client.h:32,
                 from src/client/cl_actor.c:25:
src/client/../common/common.h:284: error: 'MAX_MAP_ENTSTRING' undeclared here (not in a function)
In file included from src/client/cl_actor.c:25:
src/client/client.h:109: error: 'MAX_TILESTRINGS' undeclared here (not in a function)
src/client/client.h:109: error: 'MAX_MODELS' undeclared here (not in a function)
src/client/client.h:109: error: 'MAX_CLIENTS' undeclared here (not in a function)
src/client/client.h:109: error: 'MAX_GENERAL' undeclared here (not in a function)
src/client/client.h:109: error: 'MAX_TOKEN_CHARS' undeclared here (not in a function)
In file included from src/client/client.h:313,
                 from src/client/cl_actor.c:25:
src/client/cl_le.h:131: error: 'MAX_EDICTS' undeclared here (not in a function)
src/client/cl_le.h:172: error: expected '=', ',', ';', 'asm' or '__attribute__' before 'CL_Trace'
src/client/cl_actor.c: In function 'CL_MoveMode':
src/client/cl_actor.c:195: error: 'TU_CROUCH' undeclared (first use in this function)
src/client/cl_actor.c:195: error: (Each undeclared identifier is reported only once
src/client/cl_actor.c:195: error: for each function it appears in.)
src/client/cl_actor.c:195: error: 'TU_CROUCH_WALKING_FACTOR' undeclared (first use in this function)
src/client/cl_actor.c:206: warning: control reaches end of non-void function
src/client/cl_actor.c: In function 'CL_GetActorChr':
src/client/cl_actor.c:522: error: 'DEBUG_CLIENT' undeclared (first use in this function)
src/client/cl_actor.c: In function 'CL_WorkingFiremode':
src/client/cl_actor.c:641: error: 'DEBUG_CLIENT' undeclared (first use in this function)
src/client/cl_actor.c: In function 'CL_ReservedTUs':
src/client/cl_actor.c:693: error: 'DEBUG_CLIENT' undeclared (first use in this function)
src/client/cl_actor.c: In function 'CL_UsableTUs':
src/client/cl_actor.c:742: error: 'DEBUG_CLIENT' undeclared (first use in this function)
src/client/cl_actor.c: In function 'CL_ReserveTUs':
src/client/cl_actor.c:788: error: 'DEBUG_CLIENT' undeclared (first use in this function)
src/client/cl_actor.c: In function 'CL_SetReactionFiremode':
src/client/cl_actor.c:822: error: 'DEBUG_CLIENT' undeclared (first use in this function)
src/client/cl_actor.c: In function 'CL_ReserveShot_f':
src/client/cl_actor.c:1147: error: 'DEBUG_CLIENT' undeclared (first use in this function)
src/client/cl_actor.c: In function 'CL_UpdateReactionFiremodes':
src/client/cl_actor.c:1271: error: 'DEBUG_CLIENT' undeclared (first use in this function)
src/client/cl_actor.c:1332: error: 'NONE' undeclared (first use in this function)
src/client/cl_actor.c: In function 'CL_SetDefaultReactionFiremode':
src/client/cl_actor.c:1389: error: 'DEBUG_CLIENT' undeclared (first use in this function)
src/client/cl_actor.c: In function 'CL_DisplayFiremodes_f':
src/client/cl_actor.c:1462: error: 'DEBUG_CLIENT' undeclared (first use in this function)
src/client/cl_actor.c: In function 'CL_FireWeapon_f':
src/client/cl_actor.c:1672: error: 'DEBUG_CLIENT' undeclared (first use in this function)
src/client/cl_actor.c: In function 'CL_RefreshWeaponButtons':
src/client/cl_actor.c:1738: error: 'TU_CROUCH' undeclared (first use in this function)
src/client/cl_actor.c: In function 'CL_ActorUpdateCVars':
src/client/cl_actor.c:2169: error: 'TU_CROUCH' undeclared (first use in this function)
src/client/cl_actor.c:2176: error: 'ROUTING_NOT_REACHABLE' undeclared (first use in this function)
src/client/cl_actor.c: In function 'CL_ActorSelect':
src/client/cl_actor.c:2507: error: 'MAX_ROUTE' undeclared (first use in this function)
src/client/cl_actor.c: In function 'CL_MoveLength':
src/client/cl_actor.c:2759: error: 'TU_CROUCH' undeclared (first use in this function)
src/client/cl_actor.c:2762: error: 'TU_CROUCH_WALKING_FACTOR' undeclared (first use in this function)
src/client/cl_actor.c:2764: error: 'DEBUG_CLIENT' undeclared (first use in this function)
src/client/cl_actor.c: In function 'CL_TraceMove':
src/client/cl_actor.c:2802: error: 'ROUTING_NOT_REACHABLE' undeclared (first use in this function)
src/client/cl_actor.c: In function 'CL_MaximumMove':
src/client/cl_actor.c:2839: error: 'ROUTING_NOT_REACHABLE' undeclared (first use in this function)
src/client/cl_actor.c: In function 'CL_ActorStartMove':
src/client/cl_actor.c:2873: error: 'ROUTING_NOT_REACHABLE' undeclared (first use in this function)
src/client/cl_actor.c: In function 'CL_ActorShoot':
src/client/cl_actor.c:2913: error: 'DEBUG_CLIENT' undeclared (first use in this function)
src/client/cl_actor.c: In function 'CL_ActorReload':
src/client/cl_actor.c:2954: error: 'NONE' undeclared (first use in this function)
src/client/cl_actor.c: In function 'CL_ActorUseDoor':
src/client/cl_actor.c:3017: error: 'DEBUG_CLIENT' undeclared (first use in this function)
src/client/cl_actor.c: In function 'CL_ActorDoorAction':
src/client/cl_actor.c:3041: error: 'DEBUG_CLIENT' undeclared (first use in this function)
src/client/cl_actor.c: In function 'CL_ActorDoorAction_f':
src/client/cl_actor.c:3059: error: 'TU_DOOR_ACTION' undeclared (first use in this function)
src/client/cl_actor.c: In function 'CL_ActorResetClientAction':
src/client/cl_actor.c:3084: error: 'DEBUG_CLIENT' undeclared (first use in this function)
src/client/cl_actor.c: In function 'CL_InvCheckHands':
src/client/cl_actor.c:3111: error: 'DEBUG_CLIENT' undeclared (first use in this function)
src/client/cl_actor.c: In function 'CL_ActorDoMove':
src/client/cl_actor.c:3173: error: 'DEBUG_CLIENT' undeclared (first use in this function)
src/client/cl_actor.c: In function 'CL_ActorTurnMouse':
src/client/cl_actor.c:3213: error: 'TU_TURN' undeclared (first use in this function)
src/client/cl_actor.c: In function 'CL_ActorStandCrouch_f':
src/client/cl_actor.c:3291: error: 'TU_CROUCH' undeclared (first use in this function)
src/client/cl_actor.c: In function 'CL_ActorToggleCrouchReservation_f':
src/client/cl_actor.c:3337: error: 'TU_CROUCH' undeclared (first use in this function)
src/client/cl_actor.c: In function 'CL_ActorToggleReaction_f':
src/client/cl_actor.c:3445: error: 'NONE' undeclared (first use in this function)
src/client/cl_actor.c: In function 'CL_ActorHit':
src/client/cl_actor.c:3462: error: 'DEBUG_CLIENT' undeclared (first use in this function)
src/client/cl_actor.c: In function 'CL_ActorDoShoot':
src/client/cl_actor.c:3580: error: 'DEBUG_CLIENT' undeclared (first use in this function)
src/client/cl_actor.c: In function 'CL_ActorStartShoot':
src/client/cl_actor.c:3717: error: 'DEBUG_CLIENT' undeclared (first use in this function)
src/client/cl_actor.c: In function 'CL_ActorDie':
src/client/cl_actor.c:3743: error: 'DEBUG_CLIENT' undeclared (first use in this function)
src/client/cl_actor.c:3847: error: 'MAX_ROUTE' undeclared (first use in this function)
src/client/cl_actor.c: In function 'CL_DoEndRound':
src/client/cl_actor.c:4024: error: 'MAX_ROUTE' undeclared (first use in this function)
src/client/cl_actor.c:4030: error: 'DEBUG_CLIENT' undeclared (first use in this function)
src/client/cl_actor.c: In function 'CL_ActorMouseTrace':
src/client/cl_actor.c:4146: warning: implicit declaration of function 'TR_TestLineDM'
src/client/cl_actor.c:4146: error: 'TL_FLAG_ACTORCLIP' undeclared (first use in this function)
src/client/cl_actor.c:4175: error: 'PATHFINDING_HEIGHT' undeclared (first use in this function)
src/client/cl_actor.c: In function 'CL_AddActor':
src/client/cl_actor.c:4241: error: 'NONE' undeclared (first use in this function)
src/client/cl_actor.c: In function 'CL_AddUGV':
src/client/cl_actor.c:4337: error: 'NONE' undeclared (first use in this function)
src/client/cl_actor.c: In function 'CL_TargetingToHit':
src/client/cl_actor.c:4518: warning: implicit declaration of function 'TR_TestLine'
src/client/cl_actor.c:4518: error: 'TL_FLAG_NONE' undeclared (first use in this function)
src/client/cl_actor.c: In function 'CL_TargetingStraight':
src/client/cl_actor.c:4598: error: 'trace_t' undeclared (first use in this function)
src/client/cl_actor.c:4598: error: expected ';' before 'tr'
src/client/cl_actor.c:4599: warning: ISO C90 forbids mixed declarations and code
src/client/cl_actor.c:4637: error: 'tr' undeclared (first use in this function)
src/client/cl_actor.c:4637: warning: implicit declaration of function 'CL_Trace'
src/client/cl_actor.c:4637: error: 'MASK_SHOT' undeclared (first use in this function)
src/client/cl_actor.c: In function 'CL_TargetingGrenade':
src/client/cl_actor.c:4677: error: 'trace_t' undeclared (first use in this function)
src/client/cl_actor.c:4677: error: expected ';' before 'tr'
src/client/cl_actor.c:4678: warning: ISO C90 forbids mixed declarations and code
src/client/cl_actor.c:4693: error: 'GROUND_DELTA' undeclared (first use in this function)
src/client/cl_actor.c:4731: error: 'tr' undeclared (first use in this function)
src/client/cl_actor.c:4731: error: 'MASK_SHOT' undeclared (first use in this function)
src/client/cl_actor.c: In function 'CL_AddTargetingBox':
src/client/cl_actor.c:4793: error: 'ROUTING_NOT_REACHABLE' undeclared (first use in this function)
src/client/cl_actor.c: In function 'CL_ActorTargetAlign_f':
src/client/cl_actor.c:4896: error: 'GROUND_DELTA' undeclared (first use in this function)
src/client/cl_actor.c: In function 'CL_PlayActorSound':
src/client/cl_actor.c:5015: error: 'DEBUG_SOUND' undeclared (first use in this function)
src/client/cl_actor.c:5015: error: 'DEBUG_CLIENT' undeclared (first use in this function)
make: *** [debug-linux-gnu-i386/client/client/cl_actor.o] Error 1