cc1: warnings being treated as errors
mod_enum.c: In function 'enum_app_function':
mod_enum.c:643: warning: implicit declaration of function 'end_of_p'
mod_enum.c:643: warning: assignment makes pointer from integer without a cast
mod_enum.c: In function 'enum_api':
mod_enum.c:692: warning: assignment makes pointer from integer without a cast
gmake[5]: *** [mod_enum.o] Error 1
gmake[4]: *** [all] Error 1
gmake[3]: *** [mod_enum-all] Error 1
gmake[2]: *** [all-recursive] Error 1
Making all in build
+-------- FreeSWITCH Build Complete -----------+
+ FreeSWITCH has been successfully built. +
+ Install by running: +
+ +
+ gmake install +
+----------------------------------------------+
gmake[1]: *** [all-recursive] Error 1
gmake: *** [all] Error 2