/home/goose/Downloads/ndiswrapper-1.20/driver/ntoskernel.h:669: error: syntax er ror before "wfastcall"
/home/goose/Downloads/ndiswrapper-1.20/driver/ntoskernel.h:669: warning: type de faults to `int' in declaration of `wfastcall'
/home/goose/Downloads/ndiswrapper-1.20/driver/ntoskernel.h:669: warning: data de finition has no type or storage class
/home/goose/Downloads/ndiswrapper-1.20/driver/ntoskernel.h:670: error: syntax er ror before "wfastcall"
/home/goose/Downloads/ndiswrapper-1.20/driver/ntoskernel.h:670: warning: type de faults to `int' in declaration of `wfastcall'
/home/goose/Downloads/ndiswrapper-1.20/driver/ntoskernel.h:670: warning: data de finition has no type or storage class
/home/goose/Downloads/ndiswrapper-1.20/driver/ntoskernel.h:671: error: syntax er ror before "wfastcall"
/home/goose/Downloads/ndiswrapper-1.20/driver/ntoskernel.h:671: warning: type de faults to `int' in declaration of `wfastcall'
/home/goose/Downloads/ndiswrapper-1.20/driver/ntoskernel.h:671: warning: data de finition has no type or storage class
/home/goose/Downloads/ndiswrapper-1.20/driver/ntoskernel.h:673: error: syntax er ror before "wfastcall"
/home/goose/Downloads/ndiswrapper-1.20/driver/ntoskernel.h:673: warning: type de faults to `int' in declaration of `wfastcall'
/home/goose/Downloads/ndiswrapper-1.20/driver/ntoskernel.h:673: warning: data de finition has no type or storage class
/home/goose/Downloads/ndiswrapper-1.20/driver/ntoskernel.h:674: error: syntax er ror before "wfastcall"
/home/goose/Downloads/ndiswrapper-1.20/driver/ntoskernel.h:674: warning: type de faults to `int' in declaration of `wfastcall'
/home/goose/Downloads/ndiswrapper-1.20/driver/ntoskernel.h:674: warning: data de finition has no type or storage class
/home/goose/Downloads/ndiswrapper-1.20/driver/hal.c:122: error: syntax error bef ore "KIRQL"
/home/goose/Downloads/ndiswrapper-1.20/driver/hal.c:132: error: syntax error bef ore "void"
/home/goose/Downloads/ndiswrapper-1.20/driver/hal.c:140: error: syntax error bef ore "KIRQL"
/home/goose/Downloads/ndiswrapper-1.20/driver/hal.c:147: error: syntax error bef ore "void"
/home/goose/Downloads/ndiswrapper-1.20/driver/hal.c:154: error: syntax error bef ore "void"
/home/goose/Downloads/ndiswrapper-1.20/driver/hal.c:166: error: syntax error bef ore "void"
make[3]: *** [/home/goose/Downloads/ndiswrapper-1.20/driver/hal.o] Error 1
make[2]: *** [_module_/home/goose/Downloads/ndiswrapper-1.20/driver] Error 2
make[2]: Leaving directory `/usr/src/linux-2.6.16'
make[1]: *** [default] Error 2
make[1]: Leaving directory `/home/goose/Downloads/ndiswrapper-1.20/driver'
make: *** [all] Error 2
bash-3.00#