>>> Emerging (2 of 2) dev-python/pygtk-2.12.0 to /
* pygtk-2.12.0.tar.bz2 RMD160 SHA1 SHA256 size ;-) ... [ ok ]
* checking ebuild checksums ;-) ... [ ok ]
* checking auxfile checksums ;-) ... [ ok ]
* checking miscfile checksums ;-) ... [ ok ]
* checking pygtk-2.12.0.tar.bz2 ;-) ... [ ok ]
>>> Unpacking source...
>>> Unpacking pygtk-2.12.0.tar.bz2 to /var/tmp/portage/dev-python/pygtk-2.12.0/work
>>> Source unpacked.
>>> Compiling source in /var/tmp/portage/dev-python/pygtk-2.12.0/work/pygtk-2.12.0 ...
* econf: updating pygtk-2.12.0/config.sub with /usr/share/gnuconfig/config.sub
* econf: updating pygtk-2.12.0/config.guess with /usr/share/gnuconfig/config.guess
./configure --prefix=/usr --host=i686-pc-linux-gnu --mandir=/usr/share/man --infodir=/usr/share/info --datadir=/usr/share --sysconfdir=/etc --localstatedir=/var/lib --disable-docs --enable-thread --build=i686-pc-linux-gnu
checking for a BSD-compatible install... /usr/bin/install -c
checking whether build environment is sane... yes
checking for gawk... gawk
checking whether make sets $(MAKE)... yes
checking for style of include used by make... GNU
checking for i686-pc-linux-gnu-gcc... i686-pc-linux-gnu-gcc
checking for C compiler default output file name... a.out
checking whether the C compiler works... yes
checking whether we are cross compiling... no
checking for suffix of executables...
checking for suffix of object files... o
checking whether we are using the GNU C compiler... yes
checking whether i686-pc-linux-gnu-gcc accepts -g... yes
checking for i686-pc-linux-gnu-gcc option to accept ISO C89... none needed
checking dependency style of i686-pc-linux-gnu-gcc... gcc3
checking for bind_textdomain_codeset... yes
checking build system type... i686-pc-linux-gnu
checking host system type... i686-pc-linux-gnu
checking for some Win32 platform... no
checking for native Win32... no
checking for a sed that does not truncate output... /bin/sed
checking for grep that handles long lines and -e... /bin/grep
checking for egrep... /bin/grep -E
checking for ld used by i686-pc-linux-gnu-gcc... /usr/i686-pc-linux-gnu/bin/ld
checking if the linker (/usr/i686-pc-linux-gnu/bin/ld) is GNU ld... yes
checking for /usr/i686-pc-linux-gnu/bin/ld option to reload object files... -r
checking for BSD-compatible nm... /usr/bin/nm -B
checking whether ln -s works... yes
checking how to recognise dependent libraries... pass_all
checking how to run the C preprocessor... i686-pc-linux-gnu-gcc -E
checking for ANSI C header files... yes
checking for sys/types.h... yes
checking for sys/stat.h... yes
checking for stdlib.h... yes
checking for string.h... yes
checking for memory.h... yes
checking for strings.h... yes
checking for inttypes.h... yes
checking for stdint.h... yes
checking for unistd.h... yes
checking dlfcn.h usability... yes
checking dlfcn.h presence... yes
checking for dlfcn.h... yes
checking the maximum length of command line arguments... 32768
checking command to parse /usr/bin/nm -B output from i686-pc-linux-gnu-gcc object... ok
checking for objdir... .libs
checking for i686-pc-linux-gnu-ar... i686-pc-linux-gnu-ar
checking for i686-pc-linux-gnu-ranlib... i686-pc-linux-gnu-ranlib
checking for i686-pc-linux-gnu-strip... i686-pc-linux-gnu-strip
checking if i686-pc-linux-gnu-gcc supports -fno-rtti -fno-exceptions... no
checking for i686-pc-linux-gnu-gcc option to produce PIC... -fPIC
checking if i686-pc-linux-gnu-gcc PIC flag -fPIC works... yes
checking if i686-pc-linux-gnu-gcc static flag -static works... yes
checking if i686-pc-linux-gnu-gcc supports -c -o file.o... yes
checking whether the i686-pc-linux-gnu-gcc linker (/usr/i686-pc-linux-gnu/bin/ld) supports shared libraries... yes
checking whether -lc should be explicitly linked in... no
checking dynamic linker characteristics... GNU/Linux ld.so
checking how to hardcode library paths into programs... immediate
checking whether stripping libraries is possible... yes
checking if libtool supports shared libraries... yes
checking whether to build shared libraries... yes
checking whether to build static libraries... no
configure: creating libtool
checking for a Python interpreter with version >= 2.3.5... python
checking for python... /usr/local/bin/python
checking for python version... 2.5
checking for python platform... linux2
checking for python script directory... ${prefix}/lib/python2.5/site-packages
checking for python extension module directory... ${exec_prefix}/lib/python2.5/site-packages
checking for headers required to compile python extensions... found
checking for python module thread... yes
checking whether to enable threading in pygtk... yes
checking for i686-pc-linux-gnu-pkg-config... no
checking for pkg-config... /usr/bin/pkg-config
checking pkg-config is at least version 0.7... yes
checking for GLIB - version >= 2.8.0... yes (version 2.14.6)
checking for PYGOBJECT... yes
checking for ATK... yes
checking for PANGO... yes
checking for PYCAIRO... no
Package pycairo was not found in the pkg-config search path.
Perhaps you should add the directory containing `pycairo.pc'
to the PKG_CONFIG_PATH environment variable
No package 'pycairo' found
Package pycairo was not found in the pkg-config search path.
Perhaps you should add the directory containing `pycairo.pc'
to the PKG_CONFIG_PATH environment variable
No package 'pycairo' found
Package pycairo was not found in the pkg-config search path.
Perhaps you should add the directory containing `pycairo.pc'
to the PKG_CONFIG_PATH environment variable
No package 'pycairo' found
checking for PANGOCAIRO... no
checking for GTK... yes
checking for GTK210... yes
checking for GTK212... yes
checking for LIBGLADE... yes
checking for GTKUNIXPRINT... yes
checking for GDK target... x11
checking for Numeric/arrayobject.h... yes
checking whether i686-pc-linux-gnu-gcc understands -Wall... yes
checking whether i686-pc-linux-gnu-gcc understands -fno-strict-aliasing... yes
checking whether i686-pc-linux-gnu-gcc understands -std=c9x... yes
configure: creating ./config.status
config.status: creating Makefile
config.status: creating pygtk-2.0.pc
config.status: creating codegen/Makefile
config.status: creating gtk/Makefile
config.status: creating docs/Makefile
config.status: creating docs/reference/entities.docbook
config.status: creating examples/Makefile
config.status: creating tests/Makefile
config.status: creating codegen/pygtk-codegen-2.0
config.status: creating pygtk.spec
config.status: creating PKG-INFO
config.status: creating config.h
config.status: executing depfiles commands
The following modules will be built:
atk
pango
gtk with 2.12 API
gtk.glade
gtk.unixprint
The following modules will NOT be built:
pangocairo
cd . && /bin/sh /var/tmp/portage/dev-python/pygtk-2.12.0/work/pygtk-2.12.0/missing --run automake-1.8 --gnu Makefile
cd . && /bin/sh ./config.status Makefile depfiles
config.status: creating Makefile
config.status: executing depfiles commands
make all-recursive
make[1]: Entering directory `/var/tmp/portage/dev-python/pygtk-2.12.0/work/pygtk-2.12.0'
Making all in codegen
make[2]: Entering directory `/var/tmp/portage/dev-python/pygtk-2.12.0/work/pygtk-2.12.0/codegen'
make[2]: Nothing to be done for `all'.
make[2]: Leaving directory `/var/tmp/portage/dev-python/pygtk-2.12.0/work/pygtk-2.12.0/codegen'
Making all in .
make[2]: Entering directory `/var/tmp/portage/dev-python/pygtk-2.12.0/work/pygtk-2.12.0'
if /bin/sh ./libtool --mode=compile i686-pc-linux-gnu-gcc -DHAVE_CONFIG_H -I. -I. -I. -I/usr/local/include/python2.5 -I/usr/local/include/python2.5 -I/usr/include/pygtk-2.0 -I/usr/include/glib-2.0 -I/usr/lib/glib-2.0/include -pthread -I/usr/include/glib-2.0 -I/usr/lib/glib-2.0/include -I./gtk -I/usr/include/atk-1.0 -I/usr/include/glib-2.0 -I/usr/lib/glib-2.0/include -O2 -march=i686 -pipe -Wall -fno-strict-aliasing -std=c9x -MT atk_la-atkmodule.lo -MD -MP -MF ".deps/atk_la-atkmodule.Tpo" -c -o atk_la-atkmodule.lo `test -f 'atkmodule.c' || echo './'`atkmodule.c; \
then mv -f ".deps/atk_la-atkmodule.Tpo" ".deps/atk_la-atkmodule.Plo"; else rm -f ".deps/atk_la-atkmodule.Tpo"; exit 1; fi
mkdir .libs
i686-pc-linux-gnu-gcc -DHAVE_CONFIG_H -I. -I. -I. -I/usr/local/include/python2.5 -I/usr/local/include/python2.5 -I/usr/include/pygtk-2.0 -I/usr/include/glib-2.0 -I/usr/lib/glib-2.0/include -pthread -I/usr/include/glib-2.0 -I/usr/lib/glib-2.0/include -I./gtk -I/usr/include/atk-1.0 -I/usr/include/glib-2.0 -I/usr/lib/glib-2.0/include -O2 -march=i686 -pipe -Wall -fno-strict-aliasing -std=c9x -MT atk_la-atkmodule.lo -MD -MP -MF .deps/atk_la-atkmodule.Tpo -c atkmodule.c -fPIC -DPIC -o .libs/atk_la-atkmodule.o
(cd .\
&& /usr/local/bin/python codegen/codegen.py \
--py_ssize_t-clean \
--register pango-types.defs \
--register atk-types.defs \
--register gtk/gtk-base-types.defs \
--override atk.override \
--prefix pyatk atk.defs) > ./gen-atk.c \
&& cp ./gen-atk.c ./atk.c \
&& rm -f ./gen-atk.c
Could not write method AtkObject.get_attributes: No ArgType for AtkAttributeSet*
Could not write method AtkObject.connect_property_change_handler: No ArgType for AtkPropertyChangeHandler*
Could not write method AtkObject.notify_state_change: No ArgType for AtkState
Could not write method AtkObject.initialize: No ArgType for gpointer
Could not write virtual accessor method AtkObject.get_attributes: No ArgType for AtkAttributeSet*
Could not write virtual accessor method AtkObject.connect_property_change_handler: No ArgType for AtkPropertyChangeHandler*
Could not write virtual accessor method AtkObject.initialize: No ArgType for gpointer
Could not write virtual accessor method AtkObject.children_changed: No ArgType for gpointer
Could not write virtual accessor method AtkObject.property_change: No ArgType for AtkPropertyValues*
Could not write virtual accessor method AtkObject.active_descendant_changed: No ArgType for gpointer*
Could not write virtual proxy AtkObject.get_attributes: No ArgType for AtkAttributeSet*
Could not write virtual proxy AtkObject.connect_property_change_handler: No ArgType for AtkPropertyChangeHandler*
Could not write virtual proxy AtkObject.initialize: No ArgType for gpointer
Could not write virtual proxy AtkObject.children_changed: No ArgType for gpointer
Could not write virtual proxy AtkObject.property_change: No ArgType for AtkPropertyValues*
Could not write virtual proxy AtkObject.active_descendant_changed: No ArgType for gpointer*
Warning: generating old-style constructor for:atk_no_op_object_new
Could not write method AtkComponent.add_focus_handler: No ArgType for AtkFocusHandler
Could not write virtual accessor method AtkComponent.add_focus_handler: No ArgType for AtkFocusHandler
Could not write virtual accessor method AtkComponent.get_extents: No ArgType for gint*
Could not write virtual accessor method AtkComponent.get_position: No ArgType for gint*
Could not write virtual accessor method AtkComponent.get_size: No ArgType for gint*
Could not write interface proxy AtkComponent.add_focus_handler: No ArgType for AtkFocusHandler
Could not write interface proxy AtkComponent.get_extents: cannot use int* parameter with direction 'None'
Could not write interface proxy AtkComponent.get_position: cannot use int* parameter with direction 'None'
Could not write interface proxy AtkComponent.get_size: cannot use int* parameter with direction 'None'
Could not write method AtkDocument.get_document: No ArgType for gpointer
Could not write method AtkDocument.get_attributes: No ArgType for AtkAttributeSet*
Could not write virtual accessor method AtkDocument.get_document: No ArgType for gpointer
Could not write virtual accessor method AtkDocument.get_document_attributes: No ArgType for AtkAttributeSet*
Could not write virtual accessor method AtkDocument.get_document_attribute_value: No ArgType for G_CONST_RETURNgchar*
Could not write interface proxy AtkDocument.get_document: No ArgType for gpointer
Could not write interface proxy AtkDocument.get_document_attributes: No ArgType for AtkAttributeSet*
Could not write interface proxy AtkDocument.get_document_attribute_value: No ArgType for G_CONST_RETURNgchar*
Could not write virtual accessor method AtkEditableText.set_run_attributes: No ArgType for AtkAttributeSet*
Could not write virtual accessor method AtkEditableText.insert_text: No ArgType for gint*
Could not write interface proxy AtkEditableText.set_run_attributes: No ArgType for AtkAttributeSet*
Could not write interface proxy AtkEditableText.insert_text: cannot use int* parameter with direction 'None'
Could not write virtual accessor method AtkImage.get_image_position: No ArgType for gint*
Could not write virtual accessor method AtkImage.get_image_size: No ArgType for gint*
Could not write interface proxy AtkImage.get_image_position: cannot use int* parameter with direction 'None'
Could not write interface proxy AtkImage.get_image_size: cannot use int* parameter with direction 'None'
Could not write method AtkStreamableContent.get_stream: No ArgType for GIOChannel*
Could not write virtual accessor method AtkStreamableContent.get_stream: No ArgType for GIOChannel*
Could not write virtual accessor method AtkStreamableContent.get_uri: No ArgType for G_CONST_RETURNgchar*
Could not write interface proxy AtkStreamableContent.get_stream: No ArgType for GIOChannel*
Could not write interface proxy AtkStreamableContent.get_uri: No ArgType for G_CONST_RETURNgchar*
Could not write virtual accessor method AtkTable.get_selected_columns: No ArgType for gint**
Could not write virtual accessor method AtkTable.get_selected_rows: No ArgType for gint**
Could not write interface proxy AtkTable.get_selected_columns: No ArgType for gint**
Could not write interface proxy AtkTable.get_selected_rows: No ArgType for gint**
Could not write virtual accessor method AtkText.get_text_after_offset: No ArgType for gint*
Could not write virtual accessor method AtkText.get_text_at_offset: No ArgType for gint*
Could not write virtual accessor method AtkText.get_text_before_offset: No ArgType for gint*
Could not write virtual accessor method AtkText.get_run_attributes: No ArgType for gint*
Could not write virtual accessor method AtkText.get_default_attributes: No ArgType for AtkAttributeSet*
Could not write virtual accessor method AtkText.get_character_extents: No ArgType for gint*
Could not write virtual accessor method AtkText.get_selection: No ArgType for gint*
Could not write virtual accessor method AtkText.get_range_extents: No ArgType for AtkTextRectangle*
Could not write virtual accessor method AtkText.get_bounded_ranges: No ArgType for AtkTextRectangle*
Could not write interface proxy AtkText.get_text_after_offset: cannot use int* parameter with direction 'None'
Could not write interface proxy AtkText.get_text_at_offset: cannot use int* parameter with direction 'None'
Could not write interface proxy AtkText.get_character_at_offset: No ArgType for gunichar
Could not write interface proxy AtkText.get_text_before_offset: cannot use int* parameter with direction 'None'
Could not write interface proxy AtkText.get_run_attributes: No ArgType for AtkAttributeSet*
Could not write interface proxy AtkText.get_default_attributes: No ArgType for AtkAttributeSet*
Could not write interface proxy AtkText.get_character_extents: cannot use int* parameter with direction 'None'
Could not write interface proxy AtkText.get_selection: cannot use int* parameter with direction 'None'
Could not write interface proxy AtkText.get_range_extents: No ArgType for AtkTextRectangle*
Could not write interface proxy AtkText.get_bounded_ranges: No ArgType for AtkTextRange**
Could not write method AtkValue.get_minimum_increment: No ArgType for GValue*
Could not write virtual accessor method AtkValue.get_current_value: No ArgType for GValue*
Could not write virtual accessor method AtkValue.get_maximum_value: No ArgType for GValue*
Could not write virtual accessor method AtkValue.get_minimum_value: No ArgType for GValue*
Could not write virtual accessor method AtkValue.set_current_value: No ArgType for const-GValue*
Could not write virtual accessor method AtkValue.get_minimum_increment: No ArgType for GValue*
Could not write interface proxy AtkValue.get_current_value: No ArgType for GValue*
Could not write interface proxy AtkValue.get_maximum_value: No ArgType for GValue*
Could not write interface proxy AtkValue.get_minimum_value: No ArgType for GValue*
Could not write interface proxy AtkValue.set_current_value: No ArgType for const-GValue*
Could not write interface proxy AtkValue.get_minimum_increment: No ArgType for GValue*
Could not write function add_focus_tracker: No ArgType for AtkEventListener
Could not write function focus_tracker_init: No ArgType for AtkEventListenerInit
Could not write function add_global_event_listener: No ArgType for GSignalEmissionHook
Could not write function add_key_event_listener: No ArgType for AtkKeySnoopFunc
Warning: Constructor for AtkNoOpObject needs to be updated to new API
See http://live.gnome.org/PyGTK_2fWhatsNew28#update-constructors
Warning: Constructor for AtkRelation needs to be updated to new API
See http://live.gnome.org/PyGTK_2fWhatsNew28#update-constructors
***INFO*** The coverage of global functions is 85.71% (24/28)
***INFO*** The coverage of methods is 94.48% (154/163)
***INFO*** The coverage of virtual proxies is 82.86% (29/35)
***INFO*** The coverage of virtual accessors is 77.27% (119/154)
***INFO*** The coverage of interface proxies is 74.79% (89/119)
if /bin/sh ./libtool --mode=compile i686-pc-linux-gnu-gcc -DHAVE_CONFIG_H -I. -I. -I. -I/usr/local/include/python2.5 -I/usr/local/include/python2.5 -I/usr/include/pygtk-2.0 -I/usr/include/glib-2.0 -I/usr/lib/glib-2.0/include -pthread -I/usr/include/glib-2.0 -I/usr/lib/glib-2.0/include -I./gtk -I/usr/include/atk-1.0 -I/usr/include/glib-2.0 -I/usr/lib/glib-2.0/include -O2 -march=i686 -pipe -Wall -fno-strict-aliasing -std=c9x -MT atk_la-atk.lo -MD -MP -MF ".deps/atk_la-atk.Tpo" -c -o atk_la-atk.lo `test -f 'atk.c' || echo './'`atk.c; \
then mv -f ".deps/atk_la-atk.Tpo" ".deps/atk_la-atk.Plo"; else rm -f ".deps/atk_la-atk.Tpo"; exit 1; fi
i686-pc-linux-gnu-gcc -DHAVE_CONFIG_H -I. -I. -I. -I/usr/local/include/python2.5 -I/usr/local/include/python2.5 -I/usr/include/pygtk-2.0 -I/usr/include/glib-2.0 -I/usr/lib/glib-2.0/include -pthread -I/usr/include/glib-2.0 -I/usr/lib/glib-2.0/include -I./gtk -I/usr/include/atk-1.0 -I/usr/include/glib-2.0 -I/usr/lib/glib-2.0/include -O2 -march=i686 -pipe -Wall -fno-strict-aliasing -std=c9x -MT atk_la-atk.lo -MD -MP -MF .deps/atk_la-atk.Tpo -c atk.c -fPIC -DPIC -o .libs/atk_la-atk.o
/bin/sh ./libtool --mode=link i686-pc-linux-gnu-gcc -O2 -march=i686 -pipe -Wall -fno-strict-aliasing -std=c9x -o atk.la -rpath /usr/lib/python2.5/site-packages/gtk-2.0 -module -avoid-version -export-symbols-regex initatk atk_la-atkmodule.lo atk_la-atk.lo -latk-1.0 -lgobject-2.0 -lgmodule-2.0 -ldl -lglib-2.0
generating symbol list for `atk.la'
/usr/bin/nm -B .libs/atk_la-atkmodule.o .libs/atk_la-atk.o | sed -n -e 's/^.*[ ]\([ABCDGIRSTW][ABCDGIRSTW]*\)[ ][ ]*\([_A-Za-z][_A-Za-z0-9]*\)$/\1 \2 \2/p' | /bin/sed 's/.* //' | sort | uniq > .libs/atk.exp
/bin/grep -E -e "initatk" ".libs/atk.exp" > ".libs/atk.expT"
mv -f ".libs/atk.expT" ".libs/atk.exp"
echo "{ global:" > .libs/atk.ver
cat .libs/atk.exp | sed -e "s/\(.*\)/\1;/" >> .libs/atk.ver
echo "local: *; };" >> .libs/atk.ver
i686-pc-linux-gnu-gcc -shared .libs/atk_la-atkmodule.o .libs/atk_la-atk.o /usr/lib/libatk-1.0.so -L/usr/lib /usr/lib/libgobject-2.0.so /usr/lib/libgmodule-2.0.so -ldl /usr/lib/libglib-2.0.so -march=i686 -Wl,-soname -Wl,atk.so -Wl,-version-script -Wl,.libs/atk.ver -o .libs/atk.so
creating atk.la
(cd .libs && rm -f atk.la && ln -s ../atk.la atk.la)
if /bin/sh ./libtool --mode=compile i686-pc-linux-gnu-gcc -DHAVE_CONFIG_H -I. -I. -I. -I/usr/local/include/python2.5 -I/usr/local/include/python2.5 -I/usr/include/pygtk-2.0 -I/usr/include/glib-2.0 -I/usr/lib/glib-2.0/include -pthread -I/usr/include/glib-2.0 -I/usr/lib/glib-2.0/include -I./gtk -I/usr/include/pango-1.0 -I/usr/include/glib-2.0 -I/usr/lib/glib-2.0/include -O2 -march=i686 -pipe -Wall -fno-strict-aliasing -std=c9x -MT pango_la-pangomodule.lo -MD -MP -MF ".deps/pango_la-pangomodule.Tpo" -c -o pango_la-pangomodule.lo `test -f 'pangomodule.c' || echo './'`pangomodule.c; \
then mv -f ".deps/pango_la-pangomodule.Tpo" ".deps/pango_la-pangomodule.Plo"; else rm -f ".deps/pango_la-pangomodule.Tpo"; exit 1; fi
i686-pc-linux-gnu-gcc -DHAVE_CONFIG_H -I. -I. -I. -I/usr/local/include/python2.5 -I/usr/local/include/python2.5 -I/usr/include/pygtk-2.0 -I/usr/include/glib-2.0 -I/usr/lib/glib-2.0/include -pthread -I/usr/include/glib-2.0 -I/usr/lib/glib-2.0/include -I./gtk -I/usr/include/pango-1.0 -I/usr/include/glib-2.0 -I/usr/lib/glib-2.0/include -O2 -march=i686 -pipe -Wall -fno-strict-aliasing -std=c9x -MT pango_la-pangomodule.lo -MD -MP -MF .deps/pango_la-pangomodule.Tpo -c pangomodule.c -fPIC -DPIC -o .libs/pango_la-pangomodule.o
(cd .\
&& /usr/local/bin/python codegen/codegen.py \
--py_ssize_t-clean \
--register pango-types.defs \
--register atk-types.defs \
--register gtk/gtk-base-types.defs \
--override pango.override \
--prefix pypango pango.defs) > ./gen-pango.c \
&& cp ./gen-pango.c ./pango.c \
&& rm -f ./gen-pango.c
Could not write getter for PangoGlyphString.glyphs: No ArgType for PangoGlyphInfo*
Could not write getter for PangoGlyphString.log_clusters: No ArgType for gint*
Could not write getter for PangoItem.analysis_extra_attrs: No ArgType for GSList*
Could not write method PangoLayoutIter.get_run: No ArgType for PangoLayoutRun*
Could not write method PangoLayoutIter.get_run_readonly: No ArgType for PangoLayoutRun*
Could not write method PangoLayoutLine.get_x_ranges: No ArgType for int**
Could not write method PangoMatrix.transform_point: No ArgType for double*
Could not write method PangoMatrix.transform_distance: No ArgType for double*
Could not write method PangoMatrix.transform_rectangle: No ArgType for PangoRectangle*
Could not write method PangoMatrix.transform_pixel_rectangle: No ArgType for PangoRectangle*
Could not write virtual accessor method PangoFont.get_coverage: No ArgType for PangoCoverage*
Could not write virtual accessor method PangoFont.get_glyph_extents: No ArgType for PangoGlyph
Could not write virtual proxy PangoFont.get_coverage: No ArgType for PangoCoverage*
Could not write virtual proxy PangoFont.find_shaper: No ArgType for guint32
Could not write virtual proxy PangoFont.get_glyph_extents: No ArgType for PangoGlyph
Could not write virtual accessor method PangoFontFace.list_sizes: No ArgType for int**
Could not write virtual proxy PangoFontFace.get_face_name: No ArgType for const-char*
Could not write virtual proxy PangoFontFace.list_sizes: No ArgType for int**
Could not write virtual accessor method PangoFontFamily.list_faces: No ArgType for PangoFontFace***
Could not write virtual proxy PangoFontFamily.list_faces: No ArgType for PangoFontFace***
Could not write virtual proxy PangoFontFamily.get_name: No ArgType for const-char*
Could not write virtual accessor method PangoFontMap.list_families: No ArgType for PangoFontFamily***
Could not write virtual proxy PangoFontMap.list_families: No ArgType for PangoFontFamily***
Could not write virtual accessor method PangoFontset.foreach: No ArgType for PangoFontsetForeachFunc
Could not write virtual proxy PangoFontset.foreach: No ArgType for PangoFontsetForeachFunc
Warning: generating old-style constructor for:pango_fontset_simple_new
Warning: generating old-style constructor for:pango_layout_new
Could not write method PangoLayout.get_lines: No ArgType for GSList*
Could not write method PangoLayout.get_lines_readonly: No ArgType for GSList*
Could not write method PangoRenderer.draw_glyph: No ArgType for PangoGlyph
Could not write virtual accessor method PangoRenderer.draw_shape: No ArgType for PangoAttrShape*
Could not write virtual accessor method PangoRenderer.draw_glyph: No ArgType for PangoGlyph
Could not write virtual accessor method PangoRenderer.prepare_run: No ArgType for PangoLayoutRun*
Could not write virtual proxy PangoRenderer.draw_shape: No ArgType for PangoAttrShape*
Could not write virtual proxy PangoRenderer.draw_glyph: No ArgType for PangoGlyph
Could not write virtual proxy PangoRenderer.prepare_run: No ArgType for PangoLayoutRun*
Could not write function attr_shape_new_with_data: No ArgType for const-PangoRectangle*
Could not write function find_paragraph_boundary: No ArgType for gint*
Could not write function get_log_attrs: No ArgType for PangoLogAttr*
Could not write function itemize: No ArgType for PangoAttrIterator*
Could not write function itemize_with_base_dir: No ArgType for PangoAttrIterator*
Could not write function reorder_items: No ArgType for GList*
Could not write function get_mirror_char: No ArgType for gunichar*
Could not write function extents_to_pixels: No ArgType for PangoRectangle*
Warning: Constructor for PangoContext needs to be updated to new API
See http://live.gnome.org/PyGTK_2fWhatsNew28#update-constructors
Warning: Constructor for PangoFontsetSimple needs to be updated to new API
See http://live.gnome.org/PyGTK_2fWhatsNew28#update-constructors
Warning: Constructor for PangoLayout needs to be updated to new API
See http://live.gnome.org/PyGTK_2fWhatsNew28#update-constructors
***INFO*** The coverage of global functions is 83.67% (41/49)
***INFO*** The coverage of methods is 94.74% (180/190)
***INFO*** The coverage of virtual proxies is 58.62% (17/29)
***INFO*** The coverage of virtual accessors is 68.97% (20/29)
***INFO*** There are no declared interface proxies.
if /bin/sh ./libtool --mode=compile i686-pc-linux-gnu-gcc -DHAVE_CONFIG_H -I. -I. -I. -I/usr/local/include/python2.5 -I/usr/local/include/python2.5 -I/usr/include/pygtk-2.0 -I/usr/include/glib-2.0 -I/usr/lib/glib-2.0/include -pthread -I/usr/include/glib-2.0 -I/usr/lib/glib-2.0/include -I./gtk -I/usr/include/pango-1.0 -I/usr/include/glib-2.0 -I/usr/lib/glib-2.0/include -O2 -march=i686 -pipe -Wall -fno-strict-aliasing -std=c9x -MT pango_la-pango.lo -MD -MP -MF ".deps/pango_la-pango.Tpo" -c -o pango_la-pango.lo `test -f 'pango.c' || echo './'`pango.c; \
then mv -f ".deps/pango_la-pango.Tpo" ".deps/pango_la-pango.Plo"; else rm -f ".deps/pango_la-pango.Tpo"; exit 1; fi
i686-pc-linux-gnu-gcc -DHAVE_CONFIG_H -I. -I. -I. -I/usr/local/include/python2.5 -I/usr/local/include/python2.5 -I/usr/include/pygtk-2.0 -I/usr/include/glib-2.0 -I/usr/lib/glib-2.0/include -pthread -I/usr/include/glib-2.0 -I/usr/lib/glib-2.0/include -I./gtk -I/usr/include/pango-1.0 -I/usr/include/glib-2.0 -I/usr/lib/glib-2.0/include -O2 -march=i686 -pipe -Wall -fno-strict-aliasing -std=c9x -MT pango_la-pango.lo -MD -MP -MF .deps/pango_la-pango.Tpo -c pango.c -fPIC -DPIC -o .libs/pango_la-pango.o
/bin/sh ./libtool --mode=link i686-pc-linux-gnu-gcc -O2 -march=i686 -pipe -Wall -fno-strict-aliasing -std=c9x -o pango.la -rpath /usr/lib/python2.5/site-packages/gtk-2.0 -module -avoid-version -export-symbols-regex initpango pango_la-pangomodule.lo pango_la-pango.lo -lpango-1.0 -lgobject-2.0 -lgmodule-2.0 -ldl -lglib-2.0
generating symbol list for `pango.la'
/usr/bin/nm -B .libs/pango_la-pangomodule.o .libs/pango_la-pango.o | sed -n -e 's/^.*[ ]\([ABCDGIRSTW][ABCDGIRSTW]*\)[ ][ ]*\([_A-Za-z][_A-Za-z0-9]*\)$/\1 \2 \2/p' | /bin/sed 's/.* //' | sort | uniq > .libs/pango.exp
/bin/grep -E -e "initpango" ".libs/pango.exp" > ".libs/pango.expT"
mv -f ".libs/pango.expT" ".libs/pango.exp"
echo "{ global:" > .libs/pango.ver
cat .libs/pango.exp | sed -e "s/\(.*\)/\1;/" >> .libs/pango.ver
echo "local: *; };" >> .libs/pango.ver
i686-pc-linux-gnu-gcc -shared .libs/pango_la-pangomodule.o .libs/pango_la-pango.o /usr/lib/libpango-1.0.so -L/usr/lib /usr/lib/libgobject-2.0.so /usr/lib/libgmodule-2.0.so -ldl /usr/lib/libglib-2.0.so -march=i686 -Wl,-soname -Wl,pango.so -Wl,-version-script -Wl,.libs/pango.ver -o .libs/pango.so
creating pango.la
(cd .libs && rm -f pango.la && ln -s ../pango.la pango.la)
make[2]: Leaving directory `/var/tmp/portage/dev-python/pygtk-2.12.0/work/pygtk-2.12.0'
Making all in gtk
make[2]: Entering directory `/var/tmp/portage/dev-python/pygtk-2.12.0/work/pygtk-2.12.0/gtk'
if /bin/sh ../libtool --mode=compile i686-pc-linux-gnu-gcc -DHAVE_CONFIG_H -I. -I. -I.. -I/usr/local/include/python2.5 -I/usr/local/include/python2.5 -I/usr/include/pygtk-2.0 -I/usr/include/glib-2.0 -I/usr/lib/glib-2.0/include -I./gtk -I/usr/include/gtk-unix-print-2.0 -I/usr/include/gtk-2.0 -I/usr/include/atk-1.0 -I/usr/include/cairo -I/usr/lib/gtk-2.0/include -I/usr/include/pango-1.0 -I/usr/include/glib-2.0 -I/usr/lib/glib-2.0/include -I/usr/include/freetype2 -I/usr/include/libpng12 -O2 -march=i686 -pipe -Wall -fno-strict-aliasing -std=c9x -MT gtkunixprint_la-gtkunixprintmodule.lo -MD -MP -MF ".deps/gtkunixprint_la-gtkunixprintmodule.Tpo" -c -o gtkunixprint_la-gtkunixprintmodule.lo `test -f 'gtkunixprintmodule.c' || echo './'`gtkunixprintmodule.c; \
then mv -f ".deps/gtkunixprint_la-gtkunixprintmodule.Tpo" ".deps/gtkunixprint_la-gtkunixprintmodule.Plo"; else rm -f ".deps/gtkunixprint_la-gtkunixprintmodule.Tpo"; exit 1; fi
mkdir .libs
i686-pc-linux-gnu-gcc -DHAVE_CONFIG_H -I. -I. -I.. -I/usr/local/include/python2.5 -I/usr/local/include/python2.5 -I/usr/include/pygtk-2.0 -I/usr/include/glib-2.0 -I/usr/lib/glib-2.0/include -I./gtk -I/usr/include/gtk-unix-print-2.0 -I/usr/include/gtk-2.0 -I/usr/include/atk-1.0 -I/usr/include/cairo -I/usr/lib/gtk-2.0/include -I/usr/include/pango-1.0 -I/usr/include/glib-2.0 -I/usr/lib/glib-2.0/include -I/usr/include/freetype2 -I/usr/include/libpng12 -O2 -march=i686 -pipe -Wall -fno-strict-aliasing -std=c9x -MT gtkunixprint_la-gtkunixprintmodule.lo -MD -MP -MF .deps/gtkunixprint_la-gtkunixprintmodule.Tpo -c gtkunixprintmodule.c -fPIC -DPIC -o .libs/gtkunixprint_la-gtkunixprintmodule.o
gtkunixprintmodule.c:35:22: error: pycairo.h: No such file or directory
gtkunixprintmodule.c:36: error: expected '=', ',', ';', 'asm' or '__attribute__' before '*' token
gtkunixprintmodule.c: In function 'initgtkunixprint':
gtkunixprintmodule.c:51: error: 'Pycairo_IMPORT' undeclared (first use in this function)
gtkunixprintmodule.c:51: error: (Each undeclared identifier is reported only once
gtkunixprintmodule.c:51: error: for each function it appears in.)
make[2]: *** [gtkunixprint_la-gtkunixprintmodule.lo] Error 1
make[2]: Leaving directory `/var/tmp/portage/dev-python/pygtk-2.12.0/work/pygtk-2.12.0/gtk'
make[1]: *** [all-recursive] Error 1
make[1]: Leaving directory `/var/tmp/portage/dev-python/pygtk-2.12.0/work/pygtk-2.12.0'
make: *** [all] Error 2
*
* ERROR: dev-python/pygtk-2.12.0 failed.
* Call stack:
* ebuild.sh, line 49: Called src_compile
* environment, line 2524: Called die
* The specific snippet of code:
* emake -j1 || die
* The die message:
* (no error message)
*
* If you need support, post the topmost build error, and the call stack if relevant.
* A complete build log is located at '/var/tmp/portage/dev-python/pygtk-2.12.0/temp/build.log'.
* The ebuild environment file is located at '/var/tmp/portage/dev-python/pygtk-2.12.0/temp/environment'.
*
* Messages for package dev-python/pygobject-2.14.1:
* Unable to establish /usr/lib/python2.4/site-packages/pygtk.py symlink
* Unable to establish /usr/lib/python2.4/site-packages/pygtk.pth symlink
* Unable to find /usr/lib/python2.4/site-packages/pygtk.py
* Messages for package dev-python/pygtk-2.12.0:
*
* ERROR: dev-python/pygtk-2.12.0 failed.
* Call stack:
* ebuild.sh, line 49: Called src_compile
* environment, line 2524: Called die
* The specific snippet of code:
* emake -j1 || die
* The die message:
* (no error message)
*
* If you need support, post the topmost build error, and the call stack if relevant.
* A complete build log is located at '/var/tmp/portage/dev-python/pygtk-2.12.0/temp/build.log'.
* The ebuild environment file is located at '/var/tmp/portage/dev-python/pygtk-2.12.0/temp/environment'.
*
* GNU info directory index is up-to-date.
localhost ~ #