gcc -std=gnu99 -DHAVE_CONFIG_H -DXML_BYTE_ORDER=12 -DXML_DTD -I./expat/xmlparse -I./expat/xmltok -I/tmp/davfs/davfs2-0.2.2 -I./lib -I/usr/src/linux/include -I./src -I/usr/src/linux/include -g -O2 -I./libneon -c src/davfsd.c -o src/davfsd.o
src/davfsd.c: In function ‘main’:
src/davfsd.c:798: warning: implicit declaration of function ‘dav_check_mount’
src/davfsd.c:855: warning: implicit declaration of function ‘dav_mount’
src/davfsd.c:861: warning: implicit declaration of function ‘dav_mount_save_mtab’
gcc -std=gnu99 -DHAVE_CONFIG_H -DXML_BYTE_ORDER=12 -DXML_DTD -I./expat/xmlparse -I./expat/xmltok -I/tmp/davfs/davfs2-0.2.2 -I./lib -I/usr/src/linux/include -I./src -I/usr/src/linux/include -g -O2 -I./libneon -c src/mount.c -o src/mount.o
gcc -std=gnu99 -DHAVE_CONFIG_H -DXML_BYTE_ORDER=12 -DXML_DTD -I./expat/xmlparse -I./expat/xmltok -I/tmp/davfs/davfs2-0.2.2 -I./lib -I/usr/src/linux/include -I./src -I/usr/src/linux/include -g -O2 -I./libneon -c src/util.c -o src/util.o
gcc -std=gnu99 -DHAVE_CONFIG_H -DXML_BYTE_ORDER=12 -DXML_DTD -I./expat/xmlparse -I./expat/xmltok -I/tmp/davfs/davfs2-0.2.2 -I./lib -I/usr/src/linux/include -I./src -I/usr/src/linux/include -g -O2 -I./libneon -c src/webdav.c -o src/webdav.o
(cd libneon && make) || exit 1
make[1]: Entering directory `/tmp/davfs/davfs2-0.2.2/libneon'
gcc -std=gnu99 -DHAVE_CONFIG_H -DXML_BYTE_ORDER=12 -DXML_DTD -I../expat/xmlparse -I../expat/xmltok -I/tmp/davfs/davfs2-0.2.2 -I../lib -I/usr/src/linux/include -g -O2 -I../libneon -DNEON_SSL -c ne_request.c -o ne_request.o
gcc -std=gnu99 -DHAVE_CONFIG_H -DXML_BYTE_ORDER=12 -DXML_DTD -I../expat/xmlparse -I../expat/xmltok -I/tmp/davfs/davfs2-0.2.2 -I../lib -I/usr/src/linux/include -g -O2 -I../libneon -DNEON_SSL -c ne_session.c -o ne_session.o
gcc -std=gnu99 -DHAVE_CONFIG_H -DXML_BYTE_ORDER=12 -DXML_DTD -I../expat/xmlparse -I../expat/xmltok -I/tmp/davfs/davfs2-0.2.2 -I../lib -I/usr/src/linux/include -g -O2 -I../libneon -DNEON_SSL -c ne_basic.c -o ne_basic.o
gcc -std=gnu99 -DHAVE_CONFIG_H -DXML_BYTE_ORDER=12 -DXML_DTD -I../expat/xmlparse -I../expat/xmltok -I/tmp/davfs/davfs2-0.2.2 -I../lib -I/usr/src/linux/include -g -O2 -I../libneon -DNEON_SSL -c ne_string.c -o ne_string.o
gcc -std=gnu99 -DHAVE_CONFIG_H -DXML_BYTE_ORDER=12 -DXML_DTD -I../expat/xmlparse -I../expat/xmltok -I/tmp/davfs/davfs2-0.2.2 -I../lib -I/usr/src/linux/include -g -O2 -I../libneon -DNEON_SSL -c ne_uri.c -o ne_uri.o
gcc -std=gnu99 -DHAVE_CONFIG_H -DXML_BYTE_ORDER=12 -DXML_DTD -I../expat/xmlparse -I../expat/xmltok -I/tmp/davfs/davfs2-0.2.2 -I../lib -I/usr/src/linux/include -g -O2 -I../libneon -DNEON_SSL -c ne_dates.c -o ne_dates.o
gcc -std=gnu99 -DHAVE_CONFIG_H -DXML_BYTE_ORDER=12 -DXML_DTD -I../expat/xmlparse -I../expat/xmltok -I/tmp/davfs/davfs2-0.2.2 -I../lib -I/usr/src/linux/include -g -O2 -I../libneon -DNEON_SSL -c ne_alloc.c -o ne_alloc.o
gcc -std=gnu99 -DHAVE_CONFIG_H -DXML_BYTE_ORDER=12 -DXML_DTD -I../expat/xmlparse -I../expat/xmltok -I/tmp/davfs/davfs2-0.2.2 -I../lib -I/usr/src/linux/include -g -O2 -I../libneon -DNEON_SSL -c ne_md5.c -o ne_md5.o
gcc -std=gnu99 -DHAVE_CONFIG_H -DXML_BYTE_ORDER=12 -DXML_DTD -I../expat/xmlparse -I../expat/xmltok -I/tmp/davfs/davfs2-0.2.2 -I../lib -I/usr/src/linux/include -g -O2 -I../libneon -DNEON_SSL -c ne_utils.c -o ne_utils.o
gcc -std=gnu99 -DHAVE_CONFIG_H -DXML_BYTE_ORDER=12 -DXML_DTD -I../expat/xmlparse -I../expat/xmltok -I/tmp/davfs/davfs2-0.2.2 -I../lib -I/usr/src/linux/include -g -O2 -I../libneon -DNEON_SSL -c ne_socket.c -o ne_socket.o
gcc -std=gnu99 -DHAVE_CONFIG_H -DXML_BYTE_ORDER=12 -DXML_DTD -I../expat/xmlparse -I../expat/xmltok -I/tmp/davfs/davfs2-0.2.2 -I../lib -I/usr/src/linux/include -g -O2 -I../libneon -DNEON_SSL -c ne_auth.c -o ne_auth.o
gcc -std=gnu99 -DHAVE_CONFIG_H -DXML_BYTE_ORDER=12 -DXML_DTD -I../expat/xmlparse -I../expat/xmltok -I/tmp/davfs/davfs2-0.2.2 -I../lib -I/usr/src/linux/include -g -O2 -I../libneon -DNEON_SSL -c ne_cookies.c -o ne_cookies.o
gcc -std=gnu99 -DHAVE_CONFIG_H -DXML_BYTE_ORDER=12 -DXML_DTD -I../expat/xmlparse -I../expat/xmltok -I/tmp/davfs/davfs2-0.2.2 -I../lib -I/usr/src/linux/include -g -O2 -I../libneon -DNEON_SSL -c ne_redirect.c -o ne_redirect.o
gcc -std=gnu99 -DHAVE_CONFIG_H -DXML_BYTE_ORDER=12 -DXML_DTD -I../expat/xmlparse -I../expat/xmltok -I/tmp/davfs/davfs2-0.2.2 -I../lib -I/usr/src/linux/include -g -O2 -I../libneon -DNEON_SSL -c ne_compress.c -o ne_compress.o
gcc -std=gnu99 -DHAVE_CONFIG_H -DXML_BYTE_ORDER=12 -DXML_DTD -I../expat/xmlparse -I../expat/xmltok -I/tmp/davfs/davfs2-0.2.2 -I../lib -I/usr/src/linux/include -g -O2 -I../libneon -DNEON_SSL -c ne_207.c -o ne_207.o
gcc -std=gnu99 -DHAVE_CONFIG_H -DXML_BYTE_ORDER=12 -DXML_DTD -I../expat/xmlparse -I../expat/xmltok -I/tmp/davfs/davfs2-0.2.2 -I../lib -I/usr/src/linux/include -g -O2 -I../libneon -DNEON_SSL -c ne_xml.c -o ne_xml.o
ne_xml.c:44:22: error: xmlparse.h: No such file or directory
ne_xml.c:48: error: expected ‘=’, ‘,’, ‘;’, ‘asm’ or ‘__attribute__’ before ‘ne_xml_char’
ne_xml.c:75: error: expected ‘:’, ‘,’, ‘;’, ‘}’ or ‘__attribute__’ before ‘*’ token
ne_xml.c:103: error: expected specifier-qualifier-list before ‘XML_Parser’
ne_xml.c:112: warning: type defaults to ‘int’ in declaration of ‘ne_xml_char’
ne_xml.c:112: error: expected ‘;’, ‘,’ or ‘)’ before ‘*’ token
ne_xml.c:113: warning: type defaults to ‘int’ in declaration of ‘ne_xml_char’
ne_xml.c:113: error: expected ‘;’, ‘,’ or ‘)’ before ‘*’ token
ne_xml.c:114: warning: type defaults to ‘int’ in declaration of ‘ne_xml_char’
ne_xml.c:114: error: expected ‘;’, ‘,’ or ‘)’ before ‘*’ token
ne_xml.c:120: error: expected specifier-qualifier-list before ‘ne_xml_char’
ne_xml.c:169: warning: type defaults to ‘int’ in declaration of ‘XML_Char’
ne_xml.c:169: error: expected ‘;’, ‘,’ or ‘)’ before ‘*’ token
ne_xml.c: In function ‘ne_xml_currentline’:
ne_xml.c:181: warning: implicit declaration of function ‘XML_GetCurrentLineNumber’
ne_xml.c:181: error: ‘ne_xml_parser’ has no member named ‘parser’
ne_xml.c: In function ‘ne_xml_doc_encoding’:
ne_xml.c:192: error: ‘ne_xml_parser’ has no member named ‘encoding’
ne_xml.c: At top level:
ne_xml.c:198: warning: type defaults to ‘int’ in declaration of ‘ne_xml_char’
ne_xml.c:198: error: expected ‘;’, ‘,’ or ‘)’ before ‘*’ token
ne_xml.c:231: warning: type defaults to ‘int’ in declaration of ‘ne_xml_char’
ne_xml.c:231: error: expected ‘;’, ‘,’ or ‘)’ before ‘*’ token
ne_xml.c:270: warning: type defaults to ‘int’ in declaration of ‘ne_xml_char’
ne_xml.c:270: error: expected ‘;’, ‘,’ or ‘)’ before ‘*’ token
ne_xml.c: In function ‘destroy_element’:
ne_xml.c:319: error: ‘struct element’ has no member named ‘name’
ne_xml.c:321: error: ‘struct element’ has no member named ‘nspaces’
ne_xml.c:323: error: ‘struct namespace’ has no member named ‘next’
ne_xml.c:324: error: ‘struct namespace’ has no member named ‘name’
ne_xml.c:325: error: ‘struct namespace’ has no member named ‘uri’
ne_xml.c:329: error: ‘struct element’ has no member named ‘default_ns’
ne_xml.c:330: error: ‘struct element’ has no member named ‘default_ns’
ne_xml.c: At top level:
ne_xml.c:335: warning: type defaults to ‘int’ in declaration of ‘ne_xml_char’
ne_xml.c:335: error: expected ‘;’, ‘,’ or ‘)’ before ‘*’ token
ne_xml.c:350: warning: type defaults to ‘int’ in declaration of ‘ne_xml_char’
ne_xml.c:350: error: expected ‘;’, ‘,’ or ‘)’ before ‘*’ token
ne_xml.c: In function ‘resolve_nspace’:
ne_xml.c:384: error: ‘const struct element’ has no member named ‘parent’
ne_xml.c:387: error: ‘const struct element’ has no member named ‘nspaces’
ne_xml.c:387: error: ‘const struct namespace’ has no member named ‘next’
ne_xml.c:388: error: ‘const struct namespace’ has no member named ‘name’
ne_xml.c:389: error: ‘const struct namespace’ has no member named ‘name’
ne_xml.c:390: error: ‘const struct namespace’ has no member named ‘uri’
ne_xml.c: In function ‘ne_xml_create’:
ne_xml.c:404: error: ‘struct element’ has no member named ‘default_ns’
ne_xml.c:405: error: ‘struct element’ has no member named ‘state’
ne_xml.c:406: error: ‘ne_xml_parser’ has no member named ‘error’
ne_xml.c:408: error: ‘ne_xml_parser’ has no member named ‘parser’
ne_xml.c:408: warning: implicit declaration of function ‘XML_ParserCreate’
ne_xml.c:409: error: ‘ne_xml_parser’ has no member named ‘parser’
ne_xml.c:412: warning: implicit declaration of function ‘XML_SetElementHandler’
ne_xml.c:412: error: ‘ne_xml_parser’ has no member named ‘parser’
ne_xml.c:412: error: ‘start_element’ undeclared (first use in this function)
ne_xml.c:412: error: (Each undeclared identifier is reported only once
ne_xml.c:412: error: for each function it appears in.)
ne_xml.c:412: error: ‘end_element’ undeclared (first use in this function)
ne_xml.c:413: warning: implicit declaration of function ‘XML_SetCharacterDataHandler’
ne_xml.c:413: error: ‘ne_xml_parser’ has no member named ‘parser’
ne_xml.c:413: error: ‘char_data’ undeclared (first use in this function)
ne_xml.c:414: warning: implicit declaration of function ‘XML_SetUserData’
ne_xml.c:414: error: ‘ne_xml_parser’ has no member named ‘parser’
ne_xml.c:415: warning: implicit declaration of function ‘XML_SetXmlDeclHandler’
ne_xml.c:415: error: ‘ne_xml_parser’ has no member named ‘parser’
ne_xml.c:415: error: ‘decl_handler’ undeclared (first use in this function)
ne_xml.c: In function ‘ne_xml_push_handler’:
ne_xml.c:443: error: ‘struct element’ has no member named ‘handler’
ne_xml.c: In function ‘ne_xml_parse’:
ne_xml.c:482: warning: implicit declaration of function ‘XML_Parse’
ne_xml.c:482: error: ‘ne_xml_parser’ has no member named ‘parser’
ne_xml.c:485: error: ‘ne_xml_parser’ has no member named ‘error’
ne_xml.c:487: error: ‘ne_xml_parser’ has no member named ‘parser’
ne_xml.c:488: warning: implicit declaration of function ‘XML_ErrorString’
ne_xml.c:488: warning: implicit declaration of function ‘XML_GetErrorCode’
ne_xml.c:488: error: ‘ne_xml_parser’ has no member named ‘parser’
ne_xml.c: In function ‘ne_xml_destroy’:
ne_xml.c:516: error: ‘struct element’ has no member named ‘handler’
ne_xml.c:523: error: ‘struct element’ has no member named ‘parent’
ne_xml.c:531: warning: implicit declaration of function ‘XML_ParserFree’
ne_xml.c:531: error: ‘ne_xml_parser’ has no member named ‘parser’
ne_xml.c:532: error: ‘ne_xml_parser’ has no member named ‘encoding’
ne_xml.c:532: error: ‘ne_xml_parser’ has no member named ‘encoding’
ne_xml.c: In function ‘ne_xml_set_error’:
ne_xml.c:542: error: ‘ne_xml_parser’ has no member named ‘error’
ne_xml.c: In function ‘ne_xml_get_error’:
ne_xml.c:566: error: ‘ne_xml_parser’ has no member named ‘error’
make[1]: *** [ne_xml.o] Error 1
make[1]: Leaving directory `/tmp/davfs/davfs2-0.2.2/libneon'
make: *** [subdirs] Error 1