adchpp/Util.h:144: error: ISO C++ forbids declaration of DLL with no type
adchpp/Util.h:144: error: expected ; before static
adchpp/Util.h:145: error: ISO C++ forbids declaration of DLL with no type
adchpp/Util.h:145: error: expected ; before static
adchpp/Util.h: In static member function static void adchpp::Util::setApp(std::string):
adchpp/Util.h:150: error: appPath was not declared in this scope
adchpp/Util.h:151: error: appName was not declared in this scope
adchpp/Util.h: In static member function static std::string adchpp::Util::getAppPath():
adchpp/Util.h:155: error: appPath was not declared in this scope
adchpp/Util.h: In static member function static std::string adchpp::Util::getAppName():
adchpp/Util.h:158: error: appName was not declared in this scope
scons: *** [build/debug-default/adchpp/AdcCommand.os] Error 1
scons: building terminated because of errors.