cursoricon.c: In function create_cursor:
cursoricon.c:219: error: union generic_request has no member named create_cursor_request
cursoricon.c:219: error: union generic_reply has no member named create_cursor_reply
cursoricon.c:219: error: REQ_create_cursor undeclared (first use in this function)
cursoricon.c:219: error: (Each undeclared identifier is reported only once
cursoricon.c:219: error: for each function it appears in.)
cursoricon.c:221: error: dereferencing pointer to incomplete type
cursoricon.c:222: error: dereferencing pointer to incomplete type
cursoricon.c:223: error: dereferencing pointer to incomplete type
cursoricon.c: In function destroy_cursor:
cursoricon.c:238: error: union generic_request has no member named destroy_cursor_request
cursoricon.c:238: error: union generic_reply has no member named destroy_cursor_reply
cursoricon.c:238: error: REQ_destroy_cursor undeclared (first use in this function)
cursoricon.c:240: error: dereferencing pointer to incomplete type
cursoricon.c: In function set_cursor_frame:
cursoricon.c:259: error: union generic_request has no member named set_cursor_frame_request
cursoricon.c:259: error: union generic_reply has no member named set_cursor_frame_reply
cursoricon.c:259: error: REQ_set_cursor_frame undeclared (first use in this function)
cursoricon.c:261: error: dereferencing pointer to incomplete type
cursoricon.c:262: error: dereferencing pointer to incomplete type
cursoricon.c:263: error: dereferencing pointer to incomplete type
cursoricon.c:264: error: dereferencing pointer to incomplete type
cursoricon.c:265: error: dereferencing pointer to incomplete type
cursoricon.c:266: error: dereferencing pointer to incomplete type
cursoricon.c:267: error: dereferencing pointer to incomplete type
cursoricon.c:268: error: dereferencing pointer to incomplete type
cursoricon.c:269: error: dereferencing pointer to incomplete type
cursoricon.c:270: error: dereferencing pointer to incomplete type
cursoricon.c: In function get_cursor_frame:
cursoricon.c:288: error: union generic_request has no member named get_cursor_frame_request
cursoricon.c:288: error: union generic_reply has no member named get_cursor_frame_reply
cursoricon.c:288: error: REQ_get_cursor_frame undeclared (first use in this function)
cursoricon.c:290: error: dereferencing pointer to incomplete type
cursoricon.c:291: error: dereferencing pointer to incomplete type
cursoricon.c:295: error: dereferencing pointer to incomplete type
cursoricon.c:296: error: dereferencing pointer to incomplete type
cursoricon.c:297: error: dereferencing pointer to incomplete type
cursoricon.c:298: error: dereferencing pointer to incomplete type
cursoricon.c:299: error: dereferencing pointer to incomplete type
cursoricon.c:300: error: dereferencing pointer to incomplete type
cursoricon.c:301: error: dereferencing pointer to incomplete type
cursoricon.c:302: error: dereferencing pointer to incomplete type
cursoricon.c:305: error: dereferencing pointer to incomplete type
cursoricon.c:305: error: dereferencing pointer to incomplete type
cursoricon.c:305: error: dereferencing pointer to incomplete type
cursoricon.c: In function get_cursor_object:
cursoricon.c:318: error: union generic_request has no member named get_cursor_info_request
cursoricon.c:318: error: union generic_reply has no member named get_cursor_info_reply
cursoricon.c:318: error: REQ_get_cursor_info undeclared (first use in this function)
cursoricon.c:320: error: dereferencing pointer to incomplete type
cursoricon.c:323: error: dereferencing pointer to incomplete type
cursoricon.c:324: error: dereferencing pointer to incomplete type
make[2]: *** [cursoricon.o] Error 1
make[1]: *** [user] Error 2
make: *** [dlls] Error 2