All pastes #973036 Raw Edit

Scotepi

public text v1 · immutable
·published 2008-04-05 21:43 UTC
rendered paste body
~ $ sudo port install hellanzb
--->  Building python24 with target all libpython2.4.dylib
Error: Target org.macports.build returned: shell command " cd "/opt/local/var/macports/build/_opt_local_var_macports_sources_rsync.macports.org_release_ports_lang_python24/work/Python-2.4.5" && make all libpython2.4.dylib " returned error 2
Command output: Python/mactoolboxglue.c:423: error: 'cobj' undeclared (first use in this function)
Python/mactoolboxglue.c: At top level:
Python/mactoolboxglue.c:426: warning: parameter names (without types) in function declaration
Python/mactoolboxglue.c:426: error: syntax error before 'cobj'
Python/mactoolboxglue.c:426: warning: function declaration isn't a prototype
Python/mactoolboxglue.c: In function 'UserDataObj_New':
Python/mactoolboxglue.c:426: error: 'cobj' undeclared (first use in this function)
Python/mactoolboxglue.c: At top level:
Python/mactoolboxglue.c:427: error: syntax error before 'UserData'
Python/mactoolboxglue.c:427: warning: function declaration isn't a prototype
Python/mactoolboxglue.c:427: error: syntax error before 'UserData'
Python/mactoolboxglue.c:427: warning: function declaration isn't a prototype
Python/mactoolboxglue.c: In function 'UserDataObj_Convert':
Python/mactoolboxglue.c:427: error: 'pyobj' undeclared (first use in this function)
Python/mactoolboxglue.c:427: error: 'cobj' undeclared (first use in this function)
Python/mactoolboxglue.c: At top level:
Python/mactoolboxglue.c:428: warning: parameter names (without types) in function declaration
Python/mactoolboxglue.c:428: error: syntax error before 'cobj'
Python/mactoolboxglue.c:428: warning: function declaration isn't a prototype
Python/mactoolboxglue.c: In function 'MediaObj_New':
Python/mactoolboxglue.c:428: error: 'cobj' undeclared (first use in this function)
Python/mactoolboxglue.c: At top level:
Python/mactoolboxglue.c:429: error: syntax error before 'Media'
Python/mactoolboxglue.c:429: warning: function declaration isn't a prototype
Python/mactoolboxglue.c:429: error: syntax error before 'Media'
Python/mactoolboxglue.c:429: warning: function declaration isn't a prototype
Python/mactoolboxglue.c: In function 'MediaObj_Convert':
Python/mactoolboxglue.c:429: error: 'pyobj' undeclared (first use in this function)
Python/mactoolboxglue.c:429: error: 'cobj' undeclared (first use in this function)
make: *** [Python/mactoolboxglue.o] Error 1

Error: The following dependencies failed to build: py-twisted py-zopeinterface python24 shorten unrar
Error: Status 1 encountered during processing.