All pastes #97272 Raw Edit

Anonymous

public text v1 · immutable
#97272 ·published 2006-07-23 14:53 UTC
rendered paste body
# emerge -1av kexi

These are the packages that would be merged, in order:

Calculating dependencies... done!
[ebuild     U ] app-office/kexi-1.5.2 [1.5.1] USE="arts mysql -debug -postgres -xinerama" 0 kB

Total size of downloads: 0 kB


make[5]: Leaving directory `/var/tmp/portage/kexi-1.5.2/work/kexi-1.5.2/kexi/3rdparty/kexisql/src'
make[5]: Entering directory `/var/tmp/portage/kexi-1.5.2/work/kexi-1.5.2/kexi/3rdparty/kexisql'
make[5]: Für das Ziel »all-am« ist nichts zu tun.
make[5]: Leaving directory `/var/tmp/portage/kexi-1.5.2/work/kexi-1.5.2/kexi/3rdparty/kexisql'
make[4]: Leaving directory `/var/tmp/portage/kexi-1.5.2/work/kexi-1.5.2/kexi/3rdparty/kexisql'
make[4]: Entering directory `/var/tmp/portage/kexi-1.5.2/work/kexi-1.5.2/kexi/3rdparty'
make[4]: Für das Ziel »all-am« ist nichts zu tun.
make[4]: Leaving directory `/var/tmp/portage/kexi-1.5.2/work/kexi-1.5.2/kexi/3rdparty'
make[3]: Leaving directory `/var/tmp/portage/kexi-1.5.2/work/kexi-1.5.2/kexi/3rdparty'
Making all in kexiutils
make[3]: Entering directory `/var/tmp/portage/kexi-1.5.2/work/kexi-1.5.2/kexi/kexiutils'
/bin/sh ../../libtool --silent --mode=compile i686-pc-linux-gnu-g++ -DHAVE_CONFIG_H -I. -I. -I../.. -I../../kexi -I/usr/kde/3.5/include -I/usr/qt/3/include -I.  -I/usr/kde/3.5/include -DKEXI_SCRIPTS_SUPPORT -DQT_THREAD_SUPPORT  -D_REENTRANT  -Wno-long-long -Wundef -ansi -D_XOPEN_SOURCE=500 -D_BSD_SOURCE -Wcast-align -Wconversion -Wchar-subscripts -Wall -W -Wpointer-arith -DNDEBUG -DNO_DEBUG -O2 -O2 -march=pentium-m -pipe -fomit-frame-pointer -Wformat-security -Wmissing-format-attribute -Wno-non-virtual-dtor -fno-exceptions -fno-check-new -fno-common -DQT_CLEAN_NAMESPACE -DQT_NO_ASCII_CAST -DQT_NO_STL -DQT_NO_COMPAT -DQT_NO_TRANSLATION -DHAVE_KNEWSTUFF -c -o identifier.lo `test -f 'identifier.cpp' || echo './'`identifier.cpp
/bin/sh ../../libtool --silent --mode=compile i686-pc-linux-gnu-g++ -DHAVE_CONFIG_H -I. -I. -I../.. -I../../kexi -I/usr/kde/3.5/include -I/usr/qt/3/include -I.  -I/usr/kde/3.5/include -DKEXI_SCRIPTS_SUPPORT -DQT_THREAD_SUPPORT  -D_REENTRANT  -Wno-long-long -Wundef -ansi -D_XOPEN_SOURCE=500 -D_BSD_SOURCE -Wcast-align -Wconversion -Wchar-subscripts -Wall -W -Wpointer-arith -DNDEBUG -DNO_DEBUG -O2 -O2 -march=pentium-m -pipe -fomit-frame-pointer -Wformat-security -Wmissing-format-attribute -Wno-non-virtual-dtor -fno-exceptions -fno-check-new -fno-common -DQT_CLEAN_NAMESPACE -DQT_NO_ASCII_CAST -DQT_NO_STL -DQT_NO_COMPAT -DQT_NO_TRANSLATION -DHAVE_KNEWSTUFF -c -o validator.lo `test -f 'validator.cpp' || echo './'`validator.cpp
/bin/sh ../../libtool --silent --mode=compile i686-pc-linux-gnu-g++ -DHAVE_CONFIG_H -I. -I. -I../.. -I../../kexi -I/usr/kde/3.5/include -I/usr/qt/3/include -I.  -I/usr/kde/3.5/include -DKEXI_SCRIPTS_SUPPORT -DQT_THREAD_SUPPORT  -D_REENTRANT  -Wno-long-long -Wundef -ansi -D_XOPEN_SOURCE=500 -D_BSD_SOURCE -Wcast-align -Wconversion -Wchar-subscripts -Wall -W -Wpointer-arith -DNDEBUG -DNO_DEBUG -O2 -O2 -march=pentium-m -pipe -fomit-frame-pointer -Wformat-security -Wmissing-format-attribute -Wno-non-virtual-dtor -fno-exceptions -fno-check-new -fno-common -DQT_CLEAN_NAMESPACE -DQT_NO_ASCII_CAST -DQT_NO_STL -DQT_NO_COMPAT -DQT_NO_TRANSLATION -DHAVE_KNEWSTUFF -c -o utils.lo `test -f 'utils.cpp' || echo './'`utils.cpp
utils.cpp:208:23: utils_p.moc: No such file or directory
make[3]: *** [utils.lo] Fehler 1
make[3]: Leaving directory `/var/tmp/portage/kexi-1.5.2/work/kexi-1.5.2/kexi/kexiutils'
make[2]: *** [all-recursive] Fehler 1
make[2]: Leaving directory `/var/tmp/portage/kexi-1.5.2/work/kexi-1.5.2/kexi'
make[1]: *** [all-recursive] Fehler 1
make[1]: Leaving directory `/var/tmp/portage/kexi-1.5.2/work/kexi-1.5.2'
make: *** [all] Fehler 2

!!! ERROR: app-office/kexi-1.5.2 failed.
Call stack:
  ebuild.sh, line 1539:   Called dyn_compile
  ebuild.sh, line 939:   Called src_compile
  kexi-1.5.2.ebuild, line 46:   Called kde-meta_src_compile
  kde-meta.eclass, line 410:   Called kde_src_compile
  kde.eclass, line 164:   Called kde_src_compile 'all'
  kde.eclass, line 314:   Called kde_src_compile 'myconf' 'configure' 'make'
  kde.eclass, line 310:   Called die

!!! died running emake, kde_src_compile:make
!!! If you need support, post the topmost build error, and the call stack if relevant.