All pastes #971448 Raw Edit

Anonymous

public text v1 · immutable
·published 2008-04-04 19:12 UTC
rendered paste body
This file contains any messages produced by compilers while
running configure, to aid debugging if configure makes a mistake.

It was created by configure, which was
generated by GNU Autoconf 2.52.20061216.  Invocation command line was

  $ ./configure --prefix=/tools --with-shared --without-debug --without-ada --enable-overwrite

## ---------- ##
## Platform.  ##
## ---------- ##

hostname = lfslivecd
uname -m = i686
uname -r = 2.6.22.5
uname -s = Linux
uname -v = #1 SMP Thu Nov 29 16:24:21 GMT 2007

/usr/bin/uname -p = unknown
/bin/uname -X     = unknown

/bin/arch              = i686
/usr/bin/arch -k       = unknown
/usr/convex/getsysinfo = unknown
hostinfo               = unknown
/bin/machine           = unknown
/usr/bin/oslevel       = unknown
/bin/universe          = unknown

PATH = /tools/bin:/bin:/usr/bin

## ------------ ##
## Core tests.  ##
## ------------ ##

configure:1080: PATH=".;."; conftest.sh
./configure: line 1081: conftest.sh: command not found
configure:1083: $? = 127
configure:1096: checking for egrep
configure:1106: result: grep -E
configure:1120: result: Configuring NCURSES 5.6 ABI 5 (Fri Apr  4 14:45:05 GMT 2008)
configure:1225: checking build system type
configure:1243: result: i686-pc-linux-gnu
configure:1250: checking host system type
configure:1264: result: i686-pc-linux-gnu
configure:1272: checking target system type
configure:1286: result: i686-pc-linux-gnu
configure:1317: result: Configuring for linux-gnu
configure:1341: checking for prefix
configure:1353: result: /tools
configure:1429: checking for gcc
configure:1444: found /tools/bin/gcc
configure:1452: result: gcc
configure:1680: checking for C compiler version
configure:1683: gcc --version </dev/null >&5
gcc (GCC) 4.1.2
Copyright (C) 2006 Free Software Foundation, Inc.
This is free software; see the source for copying conditions.  There is NO
warranty; not even for MERCHANTABILITY or FITNESS FOR A PARTICULAR PURPOSE.

configure:1686: $? = 0
configure:1688: gcc -v </dev/null >&5
Reading specs from /mnt/lfs/tools/bin/../lib/gcc/i686-pc-linux-gnu/4.1.2/specs
Target: i686-pc-linux-gnu
Configured with: ../gcc-4.1.2/configure --prefix=/tools --with-local-prefix=/tools --disable-nls --enable-shared --enable-languages=c
Thread model: posix
gcc version 4.1.2
configure:1691: $? = 0
configure:1693: gcc -V </dev/null >&5
gcc: '-V' option must have argument
configure:1696: $? = 1
configure:1716: checking for C compiler default output
configure:1719: gcc    conftest.c  >&5
configure:1722: $? = 0
configure:1751: result: a.out
configure:1756: checking whether the C compiler works
configure:1762: ./a.out
configure:1765: $? = 0
configure:1780: result: yes
configure:1787: checking whether we are cross compiling
configure:1789: result: no
configure:1792: checking for executable suffix
configure:1794: gcc -o conftest    conftest.c  >&5
configure:1797: $? = 0
configure:1819: result: 
configure:1825: checking for object suffix
configure:1843: gcc -c   conftest.c >&5
configure:1846: $? = 0
configure:1865: result: o
configure:1869: checking whether we are using the GNU C compiler
configure:1890: gcc -c   conftest.c >&5
configure:1893: $? = 0
configure:1896: test -s conftest.o
configure:1899: $? = 0
configure:1911: result: yes
configure:1917: checking whether gcc accepts -g
configure:1935: gcc -c -g  conftest.c >&5
configure:1938: $? = 0
configure:1941: test -s conftest.o
configure:1944: $? = 0
configure:1954: result: yes
configure:1981: gcc -c -g -O2  conftest.c >&5
conftest.c:2: error: expected '=', ',', ';', 'asm' or '__attribute__' before 'me'
configure:1984: $? = 1
configure: failed program was:
#ifndef __cplusplus
  choke me
#endif
configure:2085: checking version of gcc
configure:2089: result: 4.1.2
configure:2099: checking how to run the C preprocessor
configure:2125: gcc -E  conftest.c
configure:2131: $? = 0
configure:2158: gcc -E  conftest.c
configure:2155:28: error: ac_nonexistent.h: No such file or directory
configure:2164: $? = 1
configure: failed program was:
#line 2154 "configure"
#include "confdefs.h"
#include <ac_nonexistent.h>
configure:2201: result: gcc -E
configure:2216: gcc -E  conftest.c
configure:2222: $? = 0
configure:2249: gcc -E  conftest.c
configure:2246:28: error: ac_nonexistent.h: No such file or directory
configure:2255: $? = 1
configure: failed program was:
#line 2245 "configure"
#include "confdefs.h"
#include <ac_nonexistent.h>
configure:2296: checking whether gcc needs -traditional
configure:2331: result: no
configure:2338: checking whether gcc understands -c and -o together
configure:2354: gcc -c conftest.c -o conftest2.o >&5
configure:2357: $? = 0
configure:2359: gcc -c conftest.c -o conftest2.o >&5
configure:2362: $? = 0
configure:2373: result: yes
configure:2380: checking for POSIXized ISC
configure:2399: result: no
configure:2404: checking for gcc option to accept ANSI C
configure:2519: gcc -c -g -O2  -DCC_HAS_PROTOS  conftest.c >&5
configure:2522: $? = 0
configure:2525: test -s conftest.o
configure:2528: $? = 0
configure:2541: result: -DCC_HAS_PROTOS
configure:2664: checking for ldconfig
configure:2681: found /sbin/ldconfig
configure:2692: result: /sbin/ldconfig
configure:2703: checking if you want to ensure bool is consistent with C++
configure:2713: result: yes
configure:2770: checking for g++
configure:2785: found /usr/bin/g++
configure:2793: result: g++
configure:2808: checking for C++ compiler version
configure:2811: g++ --version </dev/null >&5
g++ (GCC) 4.1.2
Copyright (C) 2006 Free Software Foundation, Inc.
This is free software; see the source for copying conditions.  There is NO
warranty; not even for MERCHANTABILITY or FITNESS FOR A PARTICULAR PURPOSE.

configure:2814: $? = 0
configure:2816: g++ -v </dev/null >&5
Using built-in specs.
Target: i486-pc-linux-gnu
Configured with: ../gcc-4.1.2/configure --prefix=/usr --libexecdir=/usr/lib --enable-shared --enable-threads=posix --enable-__cxa_atexit --enable-clocale=gnu --enable-languages=c,c++ --enable-static --disable-multilib
Thread model: posix
gcc version 4.1.2
configure:2819: $? = 0
configure:2821: g++ -V </dev/null >&5
g++: '-V' option must have argument
configure:2824: $? = 1
configure:2827: checking whether we are using the GNU C++ compiler
configure:2848: g++ -c   conftest.cc >&5
configure:2851: $? = 0
configure:2854: test -s conftest.o
configure:2857: $? = 0
configure:2869: result: yes
configure:2875: checking whether g++ accepts -g
configure:2893: g++ -c -g  conftest.cc >&5
configure:2896: $? = 0
configure:2899: test -s conftest.o
configure:2902: $? = 0
configure:2912: result: yes
configure:2952: g++ -c -g -O2  conftest.cc >&5
configure:2955: $? = 0
configure:2958: test -s conftest.o
configure:2961: $? = 0
configure:2983: g++ -c -g -O2  conftest.cc >&5
configure: In function 'int main()':
configure:2976: error: 'exit' was not declared in this scope
configure:2986: $? = 1
configure: failed program was:
#line 2971 "configure"
#include "confdefs.h"

int
main ()
{
exit (42);
  ;
  return 0;
}
configure:2952: g++ -c -g -O2  conftest.cc >&5
configure:2955: $? = 0
configure:2958: test -s conftest.o
configure:2961: $? = 0
configure:2983: g++ -c -g -O2  conftest.cc >&5
configure:2986: $? = 0
configure:2989: test -s conftest.o
configure:2992: $? = 0
configure:3019: checking for g++
configure:3036: found /usr/bin/g++
configure:3047: result: /usr/bin/g++
configure:3064: checking version of g++
configure:3068: result: 4.1.2
configure:3081: checking if you want to build C++ binding and demo
configure:3091: result: yes
configure:3094: checking if you want to build with Ada95
configure:3104: result: no
configure:3107: checking if you want to build programs such as tic
configure:3117: result: yes
configure:3120: checking if you wish to install curses.h
configure:3130: result: yes
configure:3156: checking for mawk
configure:3182: result: no
configure:3156: checking for gawk
configure:3171: found /usr/bin/gawk
configure:3179: result: gawk
configure:3193: checking for egrep
configure:3203: result: grep -E
configure:3223: checking for a BSD compatible install
configure:3272: result: /usr/bin/install -c
configure:3297: checking for tdlint
configure:3323: result: no
configure:3297: checking for lint
configure:3323: result: no
configure:3297: checking for alint
configure:3323: result: no
configure:3330: checking whether ln -s works
configure:3334: result: yes
configure:3341: checking whether make sets ${MAKE}
configure:3361: result: yes
configure:3370: checking if filesystem supports mixed-case filenames
configure:3397: result: yes
configure:3405: checking for ctags
configure:3429: result: no
configure:3439: checking for etags
configure:3463: result: no
configure:3486: checking for makeflags variable
configure:3520: result: 
configure:3523: checking for long file names
configure:3562: result: yes
configure:3572: checking if filesystem supports mixed-case filenames
configure:3599: result: yes
configure:3643: checking for ranlib
configure:3658: found /tools/bin/ranlib
configure:3667: result: ranlib
configure:3717: checking for ld
configure:3732: found /tools/bin/ld
configure:3741: result: ld
configure:3791: checking for ar
configure:3806: found /tools/bin/ar
configure:3815: result: ar
configure:3831: checking for archiver options (symbol AR_OPTS)
configure:3840: result: rv
configure:3845: checking if you have specified an install-prefix
configure:3858: result: 
configure:4030: checking if you want to build libraries with libtool
configure:4040: result: no
configure:4170: checking if you want to build shared libraries
configure:4180: result: yes
configure:4184: checking if you want to build static libraries
configure:4194: result: yes
configure:4198: checking if you want to build debug libraries
configure:4208: result: no
configure:4212: checking if you want to build profiling libraries
configure:4222: result: no
configure:4230: checking for specified models
configure:4234: result:  shared normal
configure:4239: checking for default model
configure:4242: result: shared
configure:4267: checking if you want to build a separate terminfo library
configure:4277: result: no
configure:4283: checking if you want to link with the GPM mouse library
configure:4293: result: maybe
configure:4297: checking for gpm.h
configure:4307: gcc -E  conftest.c
configure:4313: $? = 0
configure:4332: result: yes
configure:4348: checking for Gpm_Open in -lgpm
configure:4375: gcc -o conftest -g -O2   conftest.c -lgpm   >&5
/mnt/lfs/tools/bin/../lib/gcc/i686-pc-linux-gnu/4.1.2/../../../../i686-pc-linux-gnu/bin/ld: cannot find -lgpm
collect2: ld returned 1 exit status
configure:4378: $? = 1
configure: failed program was:
#line 4356 "configure"
#include "confdefs.h"

/* Override any gcc2 internal prototype to avoid an error.  */
#ifdef __cplusplus
extern "C"
#endif
/* We use char because int might match the return type of a gcc2
   builtin and then its argument prototype would still apply.  */
char Gpm_Open ();
int
main ()
{
Gpm_Open ();
  ;
  return 0;
}
configure:4395: result: no
configure:4401: error: Cannot link with GPM library

## ----------------- ##
## Cache variables.  ##
## ----------------- ##

ac_cv_build=i686-pc-linux-gnu
ac_cv_build_alias=i686-pc-linux-gnu
ac_cv_c_compiler_gnu=yes
ac_cv_cxx_compiler_gnu=yes
ac_cv_env_CC_set=
ac_cv_env_CC_value=
ac_cv_env_CFLAGS_set=
ac_cv_env_CFLAGS_value=
ac_cv_env_CPPFLAGS_set=
ac_cv_env_CPPFLAGS_value=
ac_cv_env_CPP_set=
ac_cv_env_CPP_value=
ac_cv_env_CXXCPP_set=
ac_cv_env_CXXCPP_value=
ac_cv_env_CXXFLAGS_set=
ac_cv_env_CXXFLAGS_value=
ac_cv_env_CXX_set=
ac_cv_env_CXX_value=
ac_cv_env_LDFLAGS_set=
ac_cv_env_LDFLAGS_value=
ac_cv_env_build_alias_set=
ac_cv_env_build_alias_value=
ac_cv_env_host_alias_set=
ac_cv_env_host_alias_value=
ac_cv_env_target_alias_set=
ac_cv_env_target_alias_value=
ac_cv_header_gpm_h=yes
ac_cv_host=i686-pc-linux-gnu
ac_cv_host_alias=i686-pc-linux-gnu
ac_cv_lib_gpm_Gpm_Open=no
ac_cv_objext=o
ac_cv_path_CXX=/usr/bin/g++
ac_cv_path_LDCONFIG=/sbin/ldconfig
ac_cv_path_install='/usr/bin/install -c'
ac_cv_prog_AWK=gawk
ac_cv_prog_CPP='gcc -E'
ac_cv_prog_MAKE_LOWER_TAGS=no
ac_cv_prog_MAKE_UPPER_TAGS=no
ac_cv_prog_ac_ct_AR=ar
ac_cv_prog_ac_ct_CC=gcc
ac_cv_prog_ac_ct_CXX=g++
ac_cv_prog_ac_ct_LD=ld
ac_cv_prog_ac_ct_RANLIB=ranlib
ac_cv_prog_cc_g=yes
ac_cv_prog_cxx_g=yes
ac_cv_prog_egrep='grep -E'
ac_cv_prog_gcc_traditional=no
ac_cv_prog_make_make_set=yes
ac_cv_sys_long_file_names=yes
ac_cv_target=i686-pc-linux-gnu
ac_cv_target_alias=i686-pc-linux-gnu
cf_cv_abi_version=5
cf_cv_ansi_cc=-DCC_HAS_PROTOS
cf_cv_makeflags=
cf_cv_mixedcase=yes
cf_cv_prog_CC_c_o=yes
cf_cv_rel_version=5.6
cf_cv_subst_AR_OPTS=rv
cf_cv_system_name=linux-gnu
cf_cv_timestamp='Fri Apr  4 14:45:05 GMT 2008'

## ------------ ##
## confdefs.h.  ##
## ------------ ##

#define SYSTEM_NAME "linux-gnu"
#define CC_HAS_PROTOS 1
#ifdef __cplusplus
#include <stdlib.h>
#endif
#define MIXEDCASE_FILENAMES 1
#define HAVE_LONG_FILE_NAMES 1
#define MIXEDCASE_FILENAMES 1
#define HAVE_GPM_H 1


configure: exit 1