Compiler: Default compiler
Building Makefile: "C:\Dev-Cpp\Makefile.win"
Executing make...
make.exe -f "C:\Dev-Cpp\Makefile.win" all
g++.exe -c "../Documents and Settings/Alex/My Documents/Chap12/Chap12/Henway/Henway.cpp" -o "../Documents and Settings/Alex/My Documents/Chap12/Chap12/Henway/Henway.o" -I"C:/Dev-Cpp/lib/gcc/mingw32/3.4.2/include" -I"C:/Dev-Cpp/include/c++/3.4.2/backward" -I"C:/Dev-Cpp/include/c++/3.4.2/mingw32" -I"C:/Dev-Cpp/include/c++/3.4.2" -I"C:/Dev-Cpp/include"
g++.exe -c "../Documents and Settings/Alex/My Documents/Chap12/Chap12/Henway/GameEngine.cpp" -o "../Documents and Settings/Alex/My Documents/Chap12/Chap12/Henway/GameEngine.o" -I"C:/Dev-Cpp/lib/gcc/mingw32/3.4.2/include" -I"C:/Dev-Cpp/include/c++/3.4.2/backward" -I"C:/Dev-Cpp/include/c++/3.4.2/mingw32" -I"C:/Dev-Cpp/include/c++/3.4.2" -I"C:/Dev-Cpp/include"
../Documents and Settings/Alex/My Documents/Chap12/Chap12/Henway/GameEngine.cpp: In member function `void GameEngine::CaptureJoystick()':
../Documents and Settings/Alex/My Documents/Chap12/Chap12/Henway/GameEngine.cpp:284: warning: passing NULL used for non-pointer converting 3 of `MMRESULT joySetCapture(HWND__*, UINT, UINT, BOOL)'
g++.exe -c "../Documents and Settings/Alex/My Documents/Chap12/Chap12/Henway/Sprite.cpp" -o "../Documents and Settings/Alex/My Documents/Chap12/Chap12/Henway/Sprite.o" -I"C:/Dev-Cpp/lib/gcc/mingw32/3.4.2/include" -I"C:/Dev-Cpp/include/c++/3.4.2/backward" -I"C:/Dev-Cpp/include/c++/3.4.2/mingw32" -I"C:/Dev-Cpp/include/c++/3.4.2" -I"C:/Dev-Cpp/include"
g++.exe -c "../Documents and Settings/Alex/My Documents/Chap12/Chap12/Henway/Bitmap.cpp" -o "../Documents and Settings/Alex/My Documents/Chap12/Chap12/Henway/Bitmap.o" -I"C:/Dev-Cpp/lib/gcc/mingw32/3.4.2/include" -I"C:/Dev-Cpp/include/c++/3.4.2/backward" -I"C:/Dev-Cpp/include/c++/3.4.2/mingw32" -I"C:/Dev-Cpp/include/c++/3.4.2" -I"C:/Dev-Cpp/include"
../Documents and Settings/Alex/My Documents/Chap12/Chap12/Henway/Bitmap.cpp: In member function `void Bitmap::Draw(HDC__*, int, int, BOOL, COLORREF)':
../Documents and Settings/Alex/My Documents/Chap12/Chap12/Henway/Bitmap.cpp:226: error: `TransparentBlt' undeclared (first use this function)
../Documents and Settings/Alex/My Documents/Chap12/Chap12/Henway/Bitmap.cpp:226: error: (Each undeclared identifier is reported only once for each function it appears in.)
make.exe: *** ["../Documents and Settings/Alex/My Documents/Chap12/Chap12/Henway/Bitmap.o"] Error 1
Execution terminated