All pastes #971007 Raw Edit

Miscellany

public text v1 · immutable
·published 2008-04-04 13:15 UTC
rendered paste body
-- Found Qt-Version 4.4.0-beta1 (using /home/harry/qt-copy/bin/qmake)                                                                                                                        
-- Found X11: /usr/lib/libX11.so                                                                                                                                                             
-- Found KDE 4.1 include dir: /home/harry/kde/include                                                                                                                                        
-- Found KDE 4.1 library dir: /home/harry/kde/lib                                                                                                                                            
-- Found KDE4 kconfig_compiler preprocessor: /home/harry/kde/bin/kconfig_compiler                                                                                                            
-- Found KDE4 automoc: /home/harry/kde/bin/kde4automoc                                                                                                                                       
-- Configuring done                                                                                                                                                                          
-- Generating done                                                                                                                                                                           
-- Build files have been written to: /home/harry/kde/build/playground/base/plasma/applets/worldclock                                                                                         
/usr/bin/cmake -H/home/harry/kde/src/playground/base/plasma/applets/worldclock -B/home/harry/kde/build/playground/base/plasma/applets/worldclock --check-build-system CMakeFiles/Makefile.cmake 0                                                                                                                                                                                         
/usr/bin/cmake -E cmake_progress_start /home/harry/kde/build/playground/base/plasma/applets/worldclock/CMakeFiles 5                                                                          
make -f CMakeFiles/Makefile2 all                                                                                                                                                             
make[1]: Entering directory `/home/harry/kde/build/playground/base/plasma/applets/worldclock'                                                                                                
make -f CMakeFiles/plasma_applet_worldclock.dir/build.make CMakeFiles/plasma_applet_worldclock.dir/depend                                                                                    
make[2]: Entering directory `/home/harry/kde/build/playground/base/plasma/applets/worldclock'                                                                                                
/usr/bin/cmake -E cmake_progress_report /home/harry/kde/build/playground/base/plasma/applets/worldclock/CMakeFiles 4                                                                         
[ 20%] Generating plasma_applet_worldclock_automoc.cpp                                                                                                                                       
/home/harry/kde/bin/kde4automoc /home/harry/kde/build/playground/base/plasma/applets/worldclock/plasma_applet_worldclock_automoc.cpp /home/harry/kde/src/playground/base/plasma/applets/worldclock /home/harry/kde/build/playground/base/plasma/applets/worldclock /home/harry/qt-copy/bin/moc                                                                                            
Generating moc_latlonbox.cpp                                                                                                                                                                 
Scanning dependencies of target plasma_applet_worldclock                                                                                                                                     
cd /home/harry/kde/build/playground/base/plasma/applets/worldclock && /usr/bin/cmake -E cmake_depends "KDevelop3" /home/harry/kde/src/playground/base/plasma/applets/worldclock /home/harry/kde/src/playground/base/plasma/applets/worldclock /home/harry/kde/build/playground/base/plasma/applets/worldclock /home/harry/kde/build/playground/base/plasma/applets/worldclock /home/harry/kde/build/playground/base/plasma/applets/worldclock/CMakeFiles/plasma_applet_worldclock.dir/DependInfo.cmake                                                                                 
make[2]: Leaving directory `/home/harry/kde/build/playground/base/plasma/applets/worldclock'                                                                                                 
make -f CMakeFiles/plasma_applet_worldclock.dir/build.make CMakeFiles/plasma_applet_worldclock.dir/build                                                                                     
make[2]: Entering directory `/home/harry/kde/build/playground/base/plasma/applets/worldclock'                                                                                                
/usr/bin/cmake -E cmake_progress_report /home/harry/kde/build/playground/base/plasma/applets/worldclock/CMakeFiles 1                                                                         
/usr/bin/cmake -E cmake_progress_report /home/harry/kde/build/playground/base/plasma/applets/worldclock/CMakeFiles 2                                                                         
[ 40%] [ 60%] Building CXX object CMakeFiles/plasma_applet_worldclock.dir/plasma_applet_worldclock_automoc.o                                                                                 
/usr/bin/c++   -Dplasma_applet_worldclock_EXPORTS  -pipe -O2 -march=pentium4   -Wnon-virtual-dtor -Wno-long-long -ansi -Wundef -Wcast-align -Wchar-subscripts -Wall -W -Wpointer-arith -Wformat-security -fno-exceptions -fno-check-new -fno-common -Woverloaded-virtual -fvisibility=hidden -fvisibility-inlines-hidden -g3 -fno-inline -fPIC -I/home/harry/kde/build/playground/base/plasma/applets/worldclock -I/home/harry/kde/src/playground/base/plasma/applets/worldclock -I/home/harry/kde/include -I/home/harry/kde/include/KDE -I/home/harry/qt-copy/include/QtHelp -I/home/harry/qt-copy/include/QtWebKit -I/home/harry/qt-copy/include/QtDBus -I/home/harry/qt-copy/include/QtTest -I/home/harry/qt-copy/include/QtUiTools -I/home/harry/qt-copy/include/QtScript -I/home/harry/qt-copy/include/QtSvg -I/home/harry/qt-copy/include/QtXml -I/home/harry/qt-copy/include/QtSql -I/home/harry/qt-copy/include/QtOpenGL -I/home/harry/qt-copy/include/QtNetwork -I/home/harry/qt-copy/include/QtDesigner -I/home/harry/qt-copy/include/QtAssistant -I/home/harry/qt-copy/include/Qt3Support -I/home/harry/qt-copy/include/QtGui -I/home/harry/qt-copy/include/QtCore -I/home/harry/qt-copy/include/Qt -I/home/harry/qt-copy/mkspecs/default -I/home/harry/qt-copy/include   -DQT3_SUPPORT -DQT3_SUPPORT_WARNINGS -D_BSD_SOURCE -D_XOPEN_SOURCE=500 -D_BSD_SOURCE -D_GNU_SOURCE -DQT_NO_STL -DQT_NO_CAST_TO_ASCII -D_REENTRANT -DKDE_DEPRECATED_WARNINGS -o CMakeFiles/plasma_applet_worldclock.dir/plasma_applet_worldclock_automoc.o -c /home/harry/kde/build/playground/base/plasma/applets/worldclock/plasma_applet_worldclock_automoc.cpp                                                                                                               
Building CXX object CMakeFiles/plasma_applet_worldclock.dir/latlonbox.o                                                                                                                      
/usr/bin/c++   -Dplasma_applet_worldclock_EXPORTS  -pipe -O2 -march=pentium4   -Wnon-virtual-dtor -Wno-long-long -ansi -Wundef -Wcast-align -Wchar-subscripts -Wall -W -Wpointer-arith -Wformat-security -fno-exceptions -fno-check-new -fno-common -Woverloaded-virtual -fvisibility=hidden -fvisibility-inlines-hidden -g3 -fno-inline -fPIC -I/home/harry/kde/build/playground/base/plasma/applets/worldclock -I/home/harry/kde/src/playground/base/plasma/applets/worldclock -I/home/harry/kde/include -I/home/harry/kde/include/KDE -I/home/harry/qt-copy/include/QtHelp -I/home/harry/qt-copy/include/QtWebKit -I/home/harry/qt-copy/include/QtDBus -I/home/harry/qt-copy/include/QtTest -I/home/harry/qt-copy/include/QtUiTools -I/home/harry/qt-copy/include/QtScript -I/home/harry/qt-copy/include/QtSvg -I/home/harry/qt-copy/include/QtXml -I/home/harry/qt-copy/include/QtSql -I/home/harry/qt-copy/include/QtOpenGL -I/home/harry/qt-copy/include/QtNetwork -I/home/harry/qt-copy/include/QtDesigner -I/home/harry/qt-copy/include/QtAssistant -I/home/harry/qt-copy/include/Qt3Support -I/home/harry/qt-copy/include/QtGui -I/home/harry/qt-copy/include/QtCore -I/home/harry/qt-copy/include/Qt -I/home/harry/qt-copy/mkspecs/default -I/home/harry/qt-copy/include   -DQT3_SUPPORT -DQT3_SUPPORT_WARNINGS -D_BSD_SOURCE -D_XOPEN_SOURCE=500 -D_BSD_SOURCE -D_GNU_SOURCE -DQT_NO_STL -DQT_NO_CAST_TO_ASCII -D_REENTRANT -DKDE_DEPRECATED_WARNINGS -o CMakeFiles/plasma_applet_worldclock.dir/latlonbox.o -c /home/harry/kde/src/playground/base/plasma/applets/worldclock/latlonbox.cpp                                                                                                                                                               
In file included from /home/harry/kde/build/playground/base/plasma/applets/worldclock/moc_latlonbox.cpp:10,                                                                                  
                 from /home/harry/kde/build/playground/base/plasma/applets/worldclock/plasma_applet_worldclock_automoc.cpp:2:                                                                
/home/harry/kde/build/playground/base/plasma/applets/worldclock/../../../../../../src/playground/base/plasma/applets/worldclock/latlonbox.h:37: error: ‘Marble::Dimension’ has not been declared                                                                                                                                                                                          
/home/harry/kde/build/playground/base/plasma/applets/worldclock/../../../../../../src/playground/base/plasma/applets/worldclock/latlonbox.h:39: error: ‘Dimension’ in namespace ‘Marble’ does not name a type                                                                                                                                                                             
/home/harry/kde/build/playground/base/plasma/applets/worldclock/../../../../../../src/playground/base/plasma/applets/worldclock/latlonbox.h:42: error: ‘Marble::Dimension’ has not been declared                                                                                                                                                                                          
/home/harry/kde/build/playground/base/plasma/applets/worldclock/../../../../../../src/playground/base/plasma/applets/worldclock/latlonbox.h:57: error: ‘Dimension’ in namespace ‘Marble’ does not name a type                                                                                                                                                                             
/home/harry/kde/build/playground/base/plasma/applets/worldclock/../../../../../../src/playground/base/plasma/applets/worldclock/latlonbox.h:71: error: ‘Marble::Dimension’ has not been declared                                                                                                                                                                                          
/home/harry/kde/build/playground/base/plasma/applets/worldclock/../../../../../../src/playground/base/plasma/applets/worldclock/latlonbox.h:37: error: ‘Longitude’ is not a member of ‘Marble’                                                                                                                                                                                            
In file included from /home/harry/kde/build/playground/base/plasma/applets/worldclock/plasma_applet_worldclock_automoc.cpp:2:                                                                
/home/harry/kde/build/playground/base/plasma/applets/worldclock/moc_latlonbox.cpp:64: error: ‘staticMetaObject’ is not a member of ‘Marble’                                                  
/home/harry/kde/build/playground/base/plasma/applets/worldclock/moc_latlonbox.cpp: In member function ‘virtual int LatLonBox::qt_metacall(QMetaObject::Call, int, void**)’:                  
/home/harry/kde/build/playground/base/plasma/applets/worldclock/moc_latlonbox.cpp:92: error: expected type-specifier                                                                         
/home/harry/kde/build/playground/base/plasma/applets/worldclock/moc_latlonbox.cpp:92: error: expected `>'                                                                                    
/home/harry/kde/build/playground/base/plasma/applets/worldclock/moc_latlonbox.cpp:92: error: expected `('                                                                                    
/home/harry/kde/build/playground/base/plasma/applets/worldclock/moc_latlonbox.cpp:92: error: ‘Dimension’ is not a member of ‘Marble’                                                         
/home/harry/kde/build/playground/base/plasma/applets/worldclock/moc_latlonbox.cpp:92: error: expected primary-expression before ‘)’ token                                                    
/home/harry/kde/build/playground/base/plasma/applets/worldclock/moc_latlonbox.cpp:95: error: expected type-specifier                                                                         
/home/harry/kde/build/playground/base/plasma/applets/worldclock/moc_latlonbox.cpp:95: error: expected `>'                                                                                    
/home/harry/kde/build/playground/base/plasma/applets/worldclock/moc_latlonbox.cpp:95: error: expected `('                                                                                    
/home/harry/kde/build/playground/base/plasma/applets/worldclock/moc_latlonbox.cpp:95: error: ‘Dimension’ is not a member of ‘Marble’                                                         
/home/harry/kde/build/playground/base/plasma/applets/worldclock/moc_latlonbox.cpp:95: error: expected primary-expression before ‘)’ token                                                    
/home/harry/kde/build/playground/base/plasma/applets/worldclock/moc_latlonbox.cpp:110: error: expected type-specifier                                                                        
/home/harry/kde/build/playground/base/plasma/applets/worldclock/moc_latlonbox.cpp:110: error: expected `>'                                                                                   
/home/harry/kde/build/playground/base/plasma/applets/worldclock/moc_latlonbox.cpp:110: error: expected `('                                                                                   
/home/harry/kde/build/playground/base/plasma/applets/worldclock/moc_latlonbox.cpp:110: error: ‘Dimension’ is not a member of ‘Marble’                                                        
/home/harry/kde/build/playground/base/plasma/applets/worldclock/moc_latlonbox.cpp:110: error: expected primary-expression before ‘>’ token                                                   
/home/harry/kde/build/playground/base/plasma/applets/worldclock/moc_latlonbox.cpp:110: error: ‘dimension’ was not declared in this scope                                                     
/home/harry/kde/build/playground/base/plasma/applets/worldclock/moc_latlonbox.cpp:110: error: expected `)' before ‘;’ token                                                                  
/home/harry/kde/build/playground/base/plasma/applets/worldclock/moc_latlonbox.cpp:117: error: expected type-specifier                                                                        
/home/harry/kde/build/playground/base/plasma/applets/worldclock/moc_latlonbox.cpp:117: error: expected `>'                                                                                   
/home/harry/kde/build/playground/base/plasma/applets/worldclock/moc_latlonbox.cpp:117: error: expected `('                                                                                   
/home/harry/kde/build/playground/base/plasma/applets/worldclock/moc_latlonbox.cpp:117: error: ‘Dimension’ is not a member of ‘Marble’                                                        
/home/harry/kde/build/playground/base/plasma/applets/worldclock/moc_latlonbox.cpp:117: error: expected primary-expression before ‘>’ token                                                   
/home/harry/kde/build/playground/base/plasma/applets/worldclock/moc_latlonbox.cpp: At global scope:
/home/harry/kde/build/playground/base/plasma/applets/worldclock/moc_latlonbox.cpp:138: error: variable or field ‘dimensionChanged’ declared void
/home/harry/kde/build/playground/base/plasma/applets/worldclock/moc_latlonbox.cpp:138: error: ‘Dimension’ is not a member of ‘Marble’
/home/harry/kde/include/marble/global.h:101: warning: ‘NOT_AVAILABLE’ defined but not used
make[2]: *** [CMakeFiles/plasma_applet_worldclock.dir/plasma_applet_worldclock_automoc.o] Error 1
make[2]: *** Waiting for unfinished jobs....
In file included from /home/harry/kde/src/playground/base/plasma/applets/worldclock/latlonbox.cpp:31:
/home/harry/kde/src/playground/base/plasma/applets/worldclock/latlonbox.h:37: error: ‘Marble::Dimension’ has not been declared
/home/harry/kde/src/playground/base/plasma/applets/worldclock/latlonbox.h:39: error: ‘Dimension’ in namespace ‘Marble’ does not name a type
/home/harry/kde/src/playground/base/plasma/applets/worldclock/latlonbox.h:42: error: ‘Marble::Dimension’ has not been declared
/home/harry/kde/src/playground/base/plasma/applets/worldclock/latlonbox.h:57: error: ‘Dimension’ in namespace ‘Marble’ does not name a type
/home/harry/kde/src/playground/base/plasma/applets/worldclock/latlonbox.h:71: error: ‘Marble::Dimension’ has not been declared
/home/harry/kde/src/playground/base/plasma/applets/worldclock/latlonbox.h:37: error: ‘Longitude’ is not a member of ‘Marble’
/home/harry/kde/src/playground/base/plasma/applets/worldclock/latlonbox.cpp:33: error: ‘Marble::Dimension’ has not been declared
/home/harry/kde/src/playground/base/plasma/applets/worldclock/latlonbox.cpp:33: error: ‘Longitude’ is not a member of ‘Marble’
/home/harry/kde/src/playground/base/plasma/applets/worldclock/latlonbox.cpp:33: error: default argument given for parameter 2 of ‘LatLonBox::LatLonBox(QWidget*, int)’
/home/harry/kde/src/playground/base/plasma/applets/worldclock/latlonbox.h:37: error: after previous specification in ‘LatLonBox::LatLonBox(QWidget*, int)’
/home/harry/kde/src/playground/base/plasma/applets/worldclock/latlonbox.h: In constructor ‘LatLonBox::LatLonBox(QWidget*, int)’:
/home/harry/kde/src/playground/base/plasma/applets/worldclock/latlonbox.h:67: warning: ‘LatLonBox::m_secondsLabel’ will be initialized after
/home/harry/kde/src/playground/base/plasma/applets/worldclock/latlonbox.h:59: warning:   ‘QComboBox* LatLonBox::m_comboBox’
/home/harry/kde/src/playground/base/plasma/applets/worldclock/latlonbox.cpp:33: warning:   when initialized here
/home/harry/kde/src/playground/base/plasma/applets/worldclock/latlonbox.cpp:44: error: ‘m_dimension’ was not declared in this scope
/home/harry/kde/src/playground/base/plasma/applets/worldclock/latlonbox.cpp:51: error: ‘Longitude’ is not a member of ‘Marble’
/home/harry/kde/src/playground/base/plasma/applets/worldclock/latlonbox.cpp:56: error: ‘Latitude’ is not a member of ‘Marble’
/home/harry/kde/src/playground/base/plasma/applets/worldclock/latlonbox.cpp: In member function ‘void LatLonBox::checkComboBox()’:
/home/harry/kde/src/playground/base/plasma/applets/worldclock/latlonbox.cpp:108: error: ‘m_dimension’ was not declared in this scope
/home/harry/kde/src/playground/base/plasma/applets/worldclock/latlonbox.cpp:108: error: ‘Longitude’ is not a member of ‘Marble’
/home/harry/kde/src/playground/base/plasma/applets/worldclock/latlonbox.cpp:111: error: ‘m_dimension’ was not declared in this scope
/home/harry/kde/src/playground/base/plasma/applets/worldclock/latlonbox.cpp:111: error: ‘Latitude’ is not a member of ‘Marble’
/home/harry/kde/src/playground/base/plasma/applets/worldclock/latlonbox.cpp:116: error: ‘m_dimension’ was not declared in this scope
/home/harry/kde/src/playground/base/plasma/applets/worldclock/latlonbox.cpp:116: error: ‘Longitude’ is not a member of ‘Marble’
/home/harry/kde/src/playground/base/plasma/applets/worldclock/latlonbox.cpp:119: error: ‘m_dimension’ was not declared in this scope
/home/harry/kde/src/playground/base/plasma/applets/worldclock/latlonbox.cpp:119: error: ‘Latitude’ is not a member of ‘Marble’
/home/harry/kde/src/playground/base/plasma/applets/worldclock/latlonbox.cpp: At global scope:
/home/harry/kde/src/playground/base/plasma/applets/worldclock/latlonbox.cpp:141: error: variable or field ‘setDimension’ declared void
/home/harry/kde/src/playground/base/plasma/applets/worldclock/latlonbox.cpp:141: error: ‘Dimension’ is not a member of ‘Marble’
/home/harry/kde/include/marble/global.h:101: warning: ‘NOT_AVAILABLE’ defined but not used
make[2]: *** [CMakeFiles/plasma_applet_worldclock.dir/latlonbox.o] Error 1
make[2]: Leaving directory `/home/harry/kde/build/playground/base/plasma/applets/worldclock'
make[1]: *** [CMakeFiles/plasma_applet_worldclock.dir/all] Error 2
make[1]: Leaving directory `/home/harry/kde/build/playground/base/plasma/applets/worldclock'
make: *** [all] Error 2