These are the packages that would be merged, in order:
Calculating dependencies ... done!
[ebuild N ] app-emulation/vmware-modules-1.0.0.17-r1 0 kB
[ebuild N ] dev-cpp/cairomm-1.4.4 USE="-doc -examples" 662 kB
[ebuild N ] dev-cpp/gtkmm-2.12.1 USE="-accessibility -debug -doc -examples" 13,014 kB
[ebuild N ] dev-cpp/libsexymm-0.1.9 USE="-debug -doc" 0 kB
[ebuild N ] x11-libs/libview-0.6.1 USE="-debug" 0 kB
[ebuild N F ] app-emulation/vmware-workstation-6.0.3.80004 217,406 kB
Total: 6 packages (6 new), Size of downloads: 231,081 kB
Fetch Restriction: 1 package (1 unsatisfied)
>>> Verifying ebuild Manifests...
>>> Emerging (1 of 6) app-emulation/vmware-modules-1.0.0.17-r1 to /
* vmware-any-any-update115.tar.gz RMD160 SHA1 SHA256 size ;-) ... [ ok ]
* checking ebuild checksums ;-) ... [ ok ]
* checking auxfile checksums ;-) ... [ ok ]
* checking miscfile checksums ;-) ... [ ok ]
* checking vmware-any-any-update115.tar.gz ;-) ... [ ok ]
* Determining the location of the kernel source code
* Found kernel source directory:
* /usr/src/linux
* Found kernel object directory:
* /lib/modules/2.6.23-tuxonice-r10/build
* Found sources for kernel version:
* 2.6.23-tuxonice-r10
>>> Unpacking source...
>>> Unpacking vmware-any-any-update115.tar.gz to /var/tmp/portage/app-emulation/vmware-modules-1.0.0.17-r1/work
>>> Unpacking ./vmware-any-any-update115/vmblock.tar to /var/tmp/portage/app-emulation/vmware-modules-1.0.0.17-r1/work
* Applying various patches (bugfixes/updates) ...
* 000_all_makefile-include-directory.patch ...
[ ok ]
* 020_all_epoll-def-warnings.patch ...
[ ok ]
* Done with patching
* Converting vmblock-only/Makefile to use M= instead of SUBDIRS= ...
[ ok ]
>>> Unpacking ./vmware-any-any-update115/vmmon.tar to /var/tmp/portage/app-emulation/vmware-modules-1.0.0.17-r1/work
* Applying various patches (bugfixes/updates) ...
* 000_all_makefile-include-directory.patch ...
[ ok ]
* 020_all_epoll-def-warnings.patch ...
[ ok ]
* Done with patching
* Applying various patches (bugfixes/updates) ...
* 030_all_fix-linux-headers.patch ...
[ ok ]
* Done with patching
* Converting vmmon-only/Makefile to use M= instead of SUBDIRS= ...
[ ok ]
>>> Unpacking ./vmware-any-any-update115/vmnet.tar to /var/tmp/portage/app-emulation/vmware-modules-1.0.0.17-r1/work
* Applying various patches (bugfixes/updates) ...
* 000_all_makefile-include-directory.patch ...
[ ok ]
* 020_all_epoll-def-warnings.patch ...
[ ok ]
* Done with patching
* Applying various patches (bugfixes/updates) ...
* 021_all_wireless_fix.patch ...
[ ok ]
* Done with patching
* Converting vmnet-only/Makefile to use M= instead of SUBDIRS= ...
[ ok ]
* Applying 1.0.0.17-update115-nasty-hack.patch ...
[ ok ]
>>> Source unpacked.
>>> Compiling source in /var/tmp/portage/app-emulation/vmware-modules-1.0.0.17-r1/work ...
* Preparing vmblock module
Using 2.6.x kernel build system.
make -C /usr/src/linux/include/.. M=$PWD SRCROOT=$PWD/. modules
make[1]: Entering directory `/usr/src/linux-2.6.23-tuxonice-r10'
make[1]: warning: jobserver unavailable: using -j1. Add `+' to parent make rule.
CC [M] /var/tmp/portage/app-emulation/vmware-modules-1.0.0.17-r1/work/vmblock-only/linux/block.o
CC [M] /var/tmp/portage/app-emulation/vmware-modules-1.0.0.17-r1/work/vmblock-only/linux/control.o
CC [M] /var/tmp/portage/app-emulation/vmware-modules-1.0.0.17-r1/work/vmblock-only/linux/dbllnklst.o
CC [M] /var/tmp/portage/app-emulation/vmware-modules-1.0.0.17-r1/work/vmblock-only/linux/dentry.o
CC [M] /var/tmp/portage/app-emulation/vmware-modules-1.0.0.17-r1/work/vmblock-only/linux/file.o
CC [M] /var/tmp/portage/app-emulation/vmware-modules-1.0.0.17-r1/work/vmblock-only/linux/filesystem.o
CC [M] /var/tmp/portage/app-emulation/vmware-modules-1.0.0.17-r1/work/vmblock-only/linux/inode.o
CC [M] /var/tmp/portage/app-emulation/vmware-modules-1.0.0.17-r1/work/vmblock-only/linux/module.o
CC [M] /var/tmp/portage/app-emulation/vmware-modules-1.0.0.17-r1/work/vmblock-only/linux/stubs.o
CC [M] /var/tmp/portage/app-emulation/vmware-modules-1.0.0.17-r1/work/vmblock-only/linux/super.o
LD [M] /var/tmp/portage/app-emulation/vmware-modules-1.0.0.17-r1/work/vmblock-only/vmblock.o
Building modules, stage 2.
MODPOST 1 modules
CC /var/tmp/portage/app-emulation/vmware-modules-1.0.0.17-r1/work/vmblock-only/vmblock.mod.o
LD [M] /var/tmp/portage/app-emulation/vmware-modules-1.0.0.17-r1/work/vmblock-only/vmblock.ko
make[1]: Leaving directory `/usr/src/linux-2.6.23-tuxonice-r10'
cp -f vmblock.ko ./../vmblock.o
* Preparing vmmon module
Using 2.6.x kernel build system.
make -C /usr/src/linux/include/.. M=$PWD SRCROOT=$PWD/. modules
make[1]: Entering directory `/usr/src/linux-2.6.23-tuxonice-r10'
make[1]: warning: jobserver unavailable: using -j1. Add `+' to parent make rule.
CC [M] /var/tmp/portage/app-emulation/vmware-modules-1.0.0.17-r1/work/vmmon-only/linux/driver.o
CC [M] /var/tmp/portage/app-emulation/vmware-modules-1.0.0.17-r1/work/vmmon-only/linux/driverLog.o
CC [M] /var/tmp/portage/app-emulation/vmware-modules-1.0.0.17-r1/work/vmmon-only/linux/hostif.o
CC [M] /var/tmp/portage/app-emulation/vmware-modules-1.0.0.17-r1/work/vmmon-only/common/comport.o
CC [M] /var/tmp/portage/app-emulation/vmware-modules-1.0.0.17-r1/work/vmmon-only/common/cpuid.o
CC [M] /var/tmp/portage/app-emulation/vmware-modules-1.0.0.17-r1/work/vmmon-only/common/hash.o
CC [M] /var/tmp/portage/app-emulation/vmware-modules-1.0.0.17-r1/work/vmmon-only/common/memtrack.o
CC [M] /var/tmp/portage/app-emulation/vmware-modules-1.0.0.17-r1/work/vmmon-only/common/phystrack.o
CC [M] /var/tmp/portage/app-emulation/vmware-modules-1.0.0.17-r1/work/vmmon-only/common/task.o
cc1plus: warning: command line option "-Wstrict-prototypes" is valid for C/ObjC but not for C++
cc1plus: warning: command line option "-Werror-implicit-function-declaration" is valid for C/ObjC but not for C++
cc1plus: warning: command line option "-Wdeclaration-after-statement" is valid for C/ObjC but not for C++
cc1plus: warning: command line option "-Wno-pointer-sign" is valid for C/ObjC but not for C++
cc1plus: warning: command line option "-Wstrict-prototypes" is valid for C/ObjC but not for C++
cc1plus: warning: command line option "-ffreestanding" is valid for C/ObjC but not for C++
/var/tmp/portage/app-emulation/vmware-modules-1.0.0.17-r1/work/vmmon-only/common/task_compat.h: In function 'int Vmx86_RunVM(VMCrossPage*, VMDriver*) [with VMCrossPage = VMCrossPageV321]':
/var/tmp/portage/app-emulation/vmware-modules-1.0.0.17-r1/work/vmmon-only/common/task_compat.h:2491: warning: 'sysenterState$rsp' is used uninitialized in this function
/var/tmp/portage/app-emulation/vmware-modules-1.0.0.17-r1/work/vmmon-only/common/task_compat.h:2492: warning: 'sysenterState$rip' is used uninitialized in this function
/var/tmp/portage/app-emulation/vmware-modules-1.0.0.17-r1/work/vmmon-only/common/task_compat.h:3028: warning: 'sysenterState$validEIP' may be used uninitialized in this function
/var/tmp/portage/app-emulation/vmware-modules-1.0.0.17-r1/work/vmmon-only/common/task_compat.h:3028: warning: 'sysenterState$cs' may be used uninitialized in this function
/var/tmp/portage/app-emulation/vmware-modules-1.0.0.17-r1/work/vmmon-only/common/task_compat.h: In function 'int Vmx86_RunVM(VMCrossPage*, VMDriver*) [with VMCrossPage = VMCrossPageV3]':
/var/tmp/portage/app-emulation/vmware-modules-1.0.0.17-r1/work/vmmon-only/common/task_compat.h:2491: warning: 'sysenterState$rsp' is used uninitialized in this function
/var/tmp/portage/app-emulation/vmware-modules-1.0.0.17-r1/work/vmmon-only/common/task_compat.h:2492: warning: 'sysenterState$rip' is used uninitialized in this function
/var/tmp/portage/app-emulation/vmware-modules-1.0.0.17-r1/work/vmmon-only/common/task_compat.h:3028: warning: 'sysenterState$validEIP' may be used uninitialized in this function
/var/tmp/portage/app-emulation/vmware-modules-1.0.0.17-r1/work/vmmon-only/common/task_compat.h:3028: warning: 'sysenterState$cs' may be used uninitialized in this function
/var/tmp/portage/app-emulation/vmware-modules-1.0.0.17-r1/work/vmmon-only/common/task_compat.h: In function 'int Vmx86_RunVM(VMCrossPage*, VMDriver*) [with VMCrossPage = VMCrossPageGSX1]':
/var/tmp/portage/app-emulation/vmware-modules-1.0.0.17-r1/work/vmmon-only/common/task_compat.h:2491: warning: 'sysenterState$rsp' is used uninitialized in this function
/var/tmp/portage/app-emulation/vmware-modules-1.0.0.17-r1/work/vmmon-only/common/task_compat.h:2492: warning: 'sysenterState$rip' is used uninitialized in this function
/var/tmp/portage/app-emulation/vmware-modules-1.0.0.17-r1/work/vmmon-only/common/task_compat.h:3028: warning: 'sysenterState$validEIP' may be used uninitialized in this function
/var/tmp/portage/app-emulation/vmware-modules-1.0.0.17-r1/work/vmmon-only/common/task_compat.h:3028: warning: 'sysenterState$cs' may be used uninitialized in this function
/var/tmp/portage/app-emulation/vmware-modules-1.0.0.17-r1/work/vmmon-only/common/task_compat.h: In function 'int Vmx86_RunVM(VMCrossPage*, VMDriver*) [with VMCrossPage = VMCrossPageV2]':
/var/tmp/portage/app-emulation/vmware-modules-1.0.0.17-r1/work/vmmon-only/common/task_compat.h:2491: warning: 'sysenterState$rsp' is used uninitialized in this function
/var/tmp/portage/app-emulation/vmware-modules-1.0.0.17-r1/work/vmmon-only/common/task_compat.h:2492: warning: 'sysenterState$rip' is used uninitialized in this function
/var/tmp/portage/app-emulation/vmware-modules-1.0.0.17-r1/work/vmmon-only/common/task_compat.h:3028: warning: 'sysenterState$validEIP' may be used uninitialized in this function
/var/tmp/portage/app-emulation/vmware-modules-1.0.0.17-r1/work/vmmon-only/common/task_compat.h:3028: warning: 'sysenterState$cs' may be used uninitialized in this function
/var/tmp/portage/app-emulation/vmware-modules-1.0.0.17-r1/work/vmmon-only/common/task_compat.h: In function 'int Vmx86_RunVM_V4(VMDriver*, Vcpuid) [with VMCrossPage = VMCrossPageV4]':
/var/tmp/portage/app-emulation/vmware-modules-1.0.0.17-r1/work/vmmon-only/common/task_compat.h:3028: warning: 'sysenterState$validEIP' may be used uninitialized in this function
/var/tmp/portage/app-emulation/vmware-modules-1.0.0.17-r1/work/vmmon-only/common/task_compat.h:3028: warning: 'sysenterState$cs' may be used uninitialized in this function
/var/tmp/portage/app-emulation/vmware-modules-1.0.0.17-r1/work/vmmon-only/common/task_compat.h:3028: warning: 'sysenterState$rsp' may be used uninitialized in this function
/var/tmp/portage/app-emulation/vmware-modules-1.0.0.17-r1/work/vmmon-only/common/task_compat.h:3028: warning: 'sysenterState$rip' may be used uninitialized in this function
/var/tmp/portage/app-emulation/vmware-modules-1.0.0.17-r1/work/vmmon-only/common/task_compat.h: In function 'int Vmx86_RunVM(VMDriver*, Vcpuid)':
/var/tmp/portage/app-emulation/vmware-modules-1.0.0.17-r1/work/vmmon-only/common/task_compat.h:2491: warning: 'sysenterState$rsp' is used uninitialized in this function
/var/tmp/portage/app-emulation/vmware-modules-1.0.0.17-r1/work/vmmon-only/common/task_compat.h:2492: warning: 'sysenterState$rip' is used uninitialized in this function
/var/tmp/portage/app-emulation/vmware-modules-1.0.0.17-r1/work/vmmon-only/common/task_compat.h:3028: warning: 'sysenterState$validEIP' may be used uninitialized in this function
/var/tmp/portage/app-emulation/vmware-modules-1.0.0.17-r1/work/vmmon-only/common/task_compat.h:3028: warning: 'sysenterState$cs' may be used uninitialized in this function
/var/tmp/portage/app-emulation/vmware-modules-1.0.0.17-r1/work/vmmon-only/common/task_compat.h:3028: warning: 'sysenterState$validEIP' may be used uninitialized in this function
/var/tmp/portage/app-emulation/vmware-modules-1.0.0.17-r1/work/vmmon-only/common/task_compat.h:3028: warning: 'sysenterState$cs' may be used uninitialized in this function
/var/tmp/portage/app-emulation/vmware-modules-1.0.0.17-r1/work/vmmon-only/common/task_compat.h:3028: warning: 'sysenterState$rsp' may be used uninitialized in this function
/var/tmp/portage/app-emulation/vmware-modules-1.0.0.17-r1/work/vmmon-only/common/task_compat.h:3028: warning: 'sysenterState$rip' may be used uninitialized in this function
/var/tmp/portage/app-emulation/vmware-modules-1.0.0.17-r1/work/vmmon-only/common/task_compat.h:3028: warning: 'sysenterState$validEIP' may be used uninitialized in this function
/var/tmp/portage/app-emulation/vmware-modules-1.0.0.17-r1/work/vmmon-only/common/task_compat.h:3028: warning: 'sysenterState$cs' may be used uninitialized in this function
/var/tmp/portage/app-emulation/vmware-modules-1.0.0.17-r1/work/vmmon-only/common/task_compat.h:3028: warning: 'sysenterState$rsp' may be used uninitialized in this function
/var/tmp/portage/app-emulation/vmware-modules-1.0.0.17-r1/work/vmmon-only/common/task_compat.h:3028: warning: 'sysenterState$rip' may be used uninitialized in this function
/var/tmp/portage/app-emulation/vmware-modules-1.0.0.17-r1/work/vmmon-only/common/task_compat.h: In function 'void Task_Switch_V45(VMDriver*, Vcpuid)':
/var/tmp/portage/app-emulation/vmware-modules-1.0.0.17-r1/work/vmmon-only/common/task_compat.h:2666: warning: 'sysenterState$validEIP' may be used uninitialized in this function
/var/tmp/portage/app-emulation/vmware-modules-1.0.0.17-r1/work/vmmon-only/common/task_compat.h:2666: warning: 'sysenterState$cs' may be used uninitialized in this function
/var/tmp/portage/app-emulation/vmware-modules-1.0.0.17-r1/work/vmmon-only/common/task_compat.h:2666: warning: 'sysenterState$rsp' may be used uninitialized in this function
/var/tmp/portage/app-emulation/vmware-modules-1.0.0.17-r1/work/vmmon-only/common/task_compat.h:2666: warning: 'sysenterState$rip' may be used uninitialized in this function
CC [M] /var/tmp/portage/app-emulation/vmware-modules-1.0.0.17-r1/work/vmmon-only/common/vmciContext.o
CC [M] /var/tmp/portage/app-emulation/vmware-modules-1.0.0.17-r1/work/vmmon-only/common/vmciDatagram.o
CC [M] /var/tmp/portage/app-emulation/vmware-modules-1.0.0.17-r1/work/vmmon-only/common/vmciDriver.o
CC [M] /var/tmp/portage/app-emulation/vmware-modules-1.0.0.17-r1/work/vmmon-only/common/vmciDs.o
CC [M] /var/tmp/portage/app-emulation/vmware-modules-1.0.0.17-r1/work/vmmon-only/common/vmciGroup.o
CC [M] /var/tmp/portage/app-emulation/vmware-modules-1.0.0.17-r1/work/vmmon-only/common/vmciHashtable.o
CC [M] /var/tmp/portage/app-emulation/vmware-modules-1.0.0.17-r1/work/vmmon-only/common/vmciProcess.o
CC [M] /var/tmp/portage/app-emulation/vmware-modules-1.0.0.17-r1/work/vmmon-only/common/vmciResource.o
CC [M] /var/tmp/portage/app-emulation/vmware-modules-1.0.0.17-r1/work/vmmon-only/common/vmciSharedMem.o
CC [M] /var/tmp/portage/app-emulation/vmware-modules-1.0.0.17-r1/work/vmmon-only/common/vmx86.o
CC [M] /var/tmp/portage/app-emulation/vmware-modules-1.0.0.17-r1/work/vmmon-only/vmcore/compat.o
CC [M] /var/tmp/portage/app-emulation/vmware-modules-1.0.0.17-r1/work/vmmon-only/vmcore/moduleloop.o
LD [M] /var/tmp/portage/app-emulation/vmware-modules-1.0.0.17-r1/work/vmmon-only/vmmon.o
Building modules, stage 2.
MODPOST 1 modules
CC /var/tmp/portage/app-emulation/vmware-modules-1.0.0.17-r1/work/vmmon-only/vmmon.mod.o
LD [M] /var/tmp/portage/app-emulation/vmware-modules-1.0.0.17-r1/work/vmmon-only/vmmon.ko
make[1]: Leaving directory `/usr/src/linux-2.6.23-tuxonice-r10'
cp -f vmmon.ko ./../vmmon.o
* Preparing vmnet module
Using 2.6.x kernel build system.
make -C /usr/src/linux/include/.. M=$PWD SRCROOT=$PWD/. modules
make[1]: Entering directory `/usr/src/linux-2.6.23-tuxonice-r10'
make[1]: warning: jobserver unavailable: using -j1. Add `+' to parent make rule.
CC [M] /var/tmp/portage/app-emulation/vmware-modules-1.0.0.17-r1/work/vmnet-only/driver.o
CC [M] /var/tmp/portage/app-emulation/vmware-modules-1.0.0.17-r1/work/vmnet-only/hub.o
CC [M] /var/tmp/portage/app-emulation/vmware-modules-1.0.0.17-r1/work/vmnet-only/userif.o
CC [M] /var/tmp/portage/app-emulation/vmware-modules-1.0.0.17-r1/work/vmnet-only/netif.o
CC [M] /var/tmp/portage/app-emulation/vmware-modules-1.0.0.17-r1/work/vmnet-only/bridge.o
/var/tmp/portage/app-emulation/vmware-modules-1.0.0.17-r1/work/vmnet-only/bridge.c: In function 'VNetBridgeIsDeviceWireless':
/var/tmp/portage/app-emulation/vmware-modules-1.0.0.17-r1/work/vmnet-only/bridge.c:861: error: 'struct net_device' has no member named 'wireless_handlers'
/var/tmp/portage/app-emulation/vmware-modules-1.0.0.17-r1/work/vmnet-only/bridge.c:867: warning: control reaches end of non-void function
make[3]: *** [/var/tmp/portage/app-emulation/vmware-modules-1.0.0.17-r1/work/vmnet-only/bridge.o] Error 1
make[2]: *** [_module_/var/tmp/portage/app-emulation/vmware-modules-1.0.0.17-r1/work/vmnet-only] Error 2
make[1]: *** [modules] Error 2
make[1]: Leaving directory `/usr/src/linux-2.6.23-tuxonice-r10'
make: *** [vmnet.ko] Error 2
*
* ERROR: app-emulation/vmware-modules-1.0.0.17-r1 failed.
* Call stack:
* ebuild.sh, line 49: Called src_compile
* environment, line 3194: Called linux-mod_src_compile
* environment, line 2413: Called die
* The specific snippet of code:
* eval "emake HOSTCC=\"$(tc-getBUILD_CC)\" CC=\"$(get-KERNEL_CC)\" LDFLAGS=\"$(get_abi_LDFLAGS)\" ${BUILD_FIXES} ${BUILD_PARAMS} ${BUILD_TARGETS} " || die "Unable to emake HOSTCC="$(tc-getBUILD_CC)" CC="$(get-KERNEL_CC)" LDFLAGS="$(get_abi_LDFLAGS)" ${BUILD_FIXES} ${BUILD_PARAMS} ${BUILD_TARGETS}";
* The die message:
* Unable to emake HOSTCC=i686-pc-linux-gnu-gcc CC=i686-pc-linux-gnu-gcc LDFLAGS= auto-build VMWARE_VER=VME_V6 KERNEL_DIR=/usr/src/linux KBUILD_OUTPUT=/lib/modules/2.6.23-tuxonice-r10/build
*
* If you need support, post the topmost build error, and the call stack if relevant.
* A complete build log is located at '/var/tmp/portage/app-emulation/vmware-modules-1.0.0.17-r1/temp/build.log'.
* The ebuild environment file is located at '/var/tmp/portage/app-emulation/vmware-modules-1.0.0.17-r1/temp/environment'.
*
* Messages for package app-emulation/vmware-modules-1.0.0.17-r1:
*
* ERROR: app-emulation/vmware-modules-1.0.0.17-r1 failed.
* Call stack:
* ebuild.sh, line 49: Called src_compile
* environment, line 3194: Called linux-mod_src_compile
* environment, line 2413: Called die
* The specific snippet of code:
* eval "emake HOSTCC=\"$(tc-getBUILD_CC)\" CC=\"$(get-KERNEL_CC)\" LDFLAGS=\"$(get_abi_LDFLAGS)\" ${BUILD_FIXES} ${BUILD_PARAMS} ${BUILD_TARGETS} " || die "Unable to emake HOSTCC="$(tc-getBUILD_CC)" CC="$(get-KERNEL_CC)" LDFLAGS="$(get_abi_LDFLAGS)" ${BUILD_FIXES} ${BUILD_PARAMS} ${BUILD_TARGETS}";
* The die message:
* Unable to emake HOSTCC=i686-pc-linux-gnu-gcc CC=i686-pc-linux-gnu-gcc LDFLAGS= auto-build VMWARE_VER=VME_V6 KERNEL_DIR=/usr/src/linux KBUILD_OUTPUT=/lib/modules/2.6.23-tuxonice-r10/build
*
* If you need support, post the topmost build error, and the call stack if relevant.
* A complete build log is located at '/var/tmp/portage/app-emulation/vmware-modules-1.0.0.17-r1/temp/build.log'.
* The ebuild environment file is located at '/var/tmp/portage/app-emulation/vmware-modules-1.0.0.17-r1/temp/environment'.
*