rendered paste body/usr/bin/cmake -E cmake_progress_report /home/hrw/kde4/kdebase-runtime-4.0.66+svn791114/obj-x86_64-linux-gnu/CMakeFiles
[ 62%] Building CXX object phonon/xine/CMakeFiles/phonon_xine.dir/bytestreamplugin.o
/usr/bin/g++ -Dphonon_xine_EXPORTS -g -Wall -O2 -Wnon-virtual-dtor -Wno-long-long -ansi -Wundef -Wcast-align -Wchar-subscripts -Wall -W -Wpointer-arith -Wformat-security -fno-exceptions -fno-check-new -fno-common -Woverloaded-virtual -fvisibility=hidden -fvisibility-inlines-hidden -DNDEBUG -fPIC -I/home/hrw/kde4/kdebase-runtime-4.0.66+svn791114/obj-x86_64-linux-gnu/phonon/xine -I/home/hrw/kde4/kdebase-runtime-4.0.66+svn791114/phonon/xine -I/home/hrw/kde4/kdebase-runtime-4.0.66+svn791114 -I/home/hrw/kde4/kdebase-runtime-4.0.66+svn791114/obj-x86_64-linux-gnu -I/usr/include/KDE -I/usr/include/qt4/QtXmlPatterns -I/usr/include/qt4/QtHelp -I/usr/include/qt4/QtWebKit -I/usr/include/qt4/QtDBus -I/usr/include/qt4/QtTest -I/usr/include/qt4/QtUiTools -I/usr/include/qt4/QtScript -I/usr/include/qt4/QtSvg -I/usr/include/qt4/QtXml -I/usr/include/qt4/QtSql -I/usr/include/qt4/QtOpenGL -I/usr/include/qt4/QtNetwork -I/usr/include/qt4/QtDesigner -I/usr/include/qt4/QtAssistant -I/usr/include/qt4/Qt3Support -I/usr/include/qt4/QtGui -I/usr/include/qt4/QtCore -I/usr/include/qt4/Qt -I/usr/share/qt4/mkspecs/default -I/usr/include/qt4 -D_BSD_SOURCE -D_XOPEN_SOURCE=500 -D_BSD_SOURCE -D_GNU_SOURCE -DQT_NO_STL -DQT_NO_CAST_TO_ASCII -D_REENTRANT -DKDE_DEPRECATED_WARNINGS -D_FILE_OFFSET_BITS=64 -o phonon/xine/CMakeFiles/phonon_xine.dir/bytestreamplugin.o -c /home/hrw/kde4/kdebase-runtime-4.0.66+svn791114/phonon/xine/bytestreamplugin.cpp
/home/hrw/kde4/kdebase-runtime-4.0.66+svn791114/phonon/xine/bytestreamplugin.cpp: In function 'void* init_kbytestream_plugin(xine_t*, void*)':
/home/hrw/kde4/kdebase-runtime-4.0.66+svn791114/phonon/xine/bytestreamplugin.cpp:298: error: 'struct input_class_s' has no member named 'textdomain'
make[3]: *** [phonon/xine/CMakeFiles/phonon_xine.dir/bytestreamplugin.o] Error 1
make[3]: Leaving directory `/home/hrw/kde4/kdebase-runtime-4.0.66+svn791114/obj-x86_64-linux-gnu'
make[2]: *** [phonon/xine/CMakeFiles/phonon_xine.dir/all] Error 2
make[2]: Leaving directory `/home/hrw/kde4/kdebase-runtime-4.0.66+svn791114/obj-x86_64-linux-gnu'
make[1]: *** [all] Error 2
make[1]: Leaving directory `/home/hrw/kde4/kdebase-runtime-4.0.66+svn791114/obj-x86_64-linux-gnu'
make: *** [debian/stamp-makefile-build] Error 2
debuild: fatal error at line 1264:
debian/rules build failed